{"text_format":"2","workbook":"xlsx","n_sheets":38,"sheets":["ORCAMENTO_RESUMO","ORCAMENTO_CONSOLIDADO (2)","Manutenção de canteiro","Mao_de_Obra_VALORES_ADICIONAIS","MC - VALORES ADICIONAIS","Moveis_Equipamentos","CPU_Móveis e Equipamentos","Mobilizacao_Desmobilizacao","CPU_MOBILIZAÇAO","CPU_DESMOBILIZAÇAO","Canteiros","Mao_de_Obra","Mao_de_Obra (Total)","Mem_Calculo_EQUIPE","SEGURANÇA DE BARRAGENS","Mao_de_Obra (SEG.BARRAGENS)","MEM_CALCULO_SEG DE BARRAGENS","CPU_SALARIOS","Encargos Sociais e Benefícios","CPU_Viagens","Frentes_Moveis","Viagens_Diárias","Materiais_Consumo","Veiculos","Mem_Calculo_VEICULOS","CPU_VEÍCULOS","Equipamentos","CPU_EQUIPAMENTOS_","Ferramentas","Instrumentos","CPU_Instrumentos","CPU_MANUTENCAO_CANTEIRO","Sobressalentes ","Serviços Especializados","SERVIÇOS ADICIONAIS","Custos Administração","CPU_MATRIZ DE RISCO","Despesas Fiscais"],"not_rendered":{"charts":0,"images":5,"macros":0,"external_links":4,"defined_names":109,"comments":2,"pivot_tables":0},"unopened":[],"bounds":{"document_bytes":16777216,"sheet_cells":100000,"run_cost":"one","rows_first":2000,"rows_last":500,"rows_between":2000,"halvings":0,"cell_chars":16384,"cell_head_chars":4096},"cells_cut":0,"cells_raw":0,"read":"whole","date_system":"1900"}

{"sheet":"ORCAMENTO_RESUMO","index":0,"n_rows":59,"n_cols":18,"rows_kept":59,"cut":false,"hidden":false,"merged":[[59,0,59,2],[59,3,59,4],[56,0,56,2],[57,0,57,2],[56,3,56,4],[57,3,57,4],[58,0,58,2],[58,3,58,4],[4,0,5,4],[0,2,0,4],[1,2,1,4],[2,2,2,4],[7,0,7,2]]}
[null,null,"Ministério do Desenvolvimento Regional  - MDR",null,null,4367736.12]
[null,null,"Companhia de Desenvolvimento dos Vales do São Francisco e do Parnaíba",null,null,{"$f":"D22","v":0}]
[null,null,"Gerência de Operação do PISF - Centro de Controle e Operação (AD / GOI / CCO)",null,null,{"$f":"F1-F2","v":4367736.12}]
[]
["TERMO DE REFERÊNCIA PARA CONTRATAÇÃO DOS RECURSOS NECESSÁRIOS À OPERAÇÃO E MANUTENÇÃO DAS INFRAESTRUTURAS DO EIXO LESTE DO PISF - PROJETO DE INTEGRAÇÃO DO SÃO FRANCISCO COM AS BACIAS HIDROGRÁFICAS DO NORDESTE SETENTRIONAL",{"$nulls":12},{"$f":"E8/12","v":0}]
[]
[{"$nulls":5},{"$f":"E8-F8","v":{"$error":"#REF!"}},{"$f":"F8-G8","v":{"$error":"#REF!"}},{"$nulls":5},6.9999999999999999E-4,{"$f":"$E$8*M7","v":0},null,{"$f":"$N$5*M7","v":0},null,{"$f":"P7/$E$8","v":{"$error":"#DIV/0!"}}]
["ORÇAMENTO CONSOLIDADO",null,null,"TOTAL - (R$)",{"$f":"SUBTOTAL(9,D12:D55)","v":0},{"$f":"#REF!","v":{"$error":"#REF!"}},{"$f":"H11","v":{"$error":"#REF!"}},{"$nulls":5},1E-3,{"$f":"$E$8*M8","v":0},null,{"$f":"$N$5*M8","v":0},null,{"$f":"P8/$E$8","v":{"$error":"#DIV/0!"}}]
[{"$nulls":5},{"$f":"#REF!","v":{"$error":"#REF!"}},{"$f":"F9-F8","v":{"$error":"#REF!"}},{"$nulls":5},2E-3,{"$f":"$E$8*M9","v":0},null,{"$f":"$N$5*M9","v":0},null,{"$f":"P9/$E$8","v":{"$error":"#DIV/0!"}}]
[{"$nulls":5},{"$f":"#REF!","v":{"$error":"#REF!"}},{"$f":"F10-G8","v":{"$error":"#REF!"}},{"$nulls":5},4.0000000000000001E-3,{"$f":"$E$8*M10","v":0},null,{"$f":"$N$5*M10","v":0},null,{"$f":"P10/$E$8","v":{"$error":"#DIV/0!"}}]
["ITEM","CÓDIGO","DESCRIÇÃO","R$ TOTAL","%",null,null,{"$f":"SUM(H12:H56)","v":{"$error":"#REF!"}},{"$nulls":4},0.02,{"$f":"$E$8*M11","v":0},null,{"$f":"$N$5*M11","v":0},null,{"$f":"P11/$E$8","v":{"$error":"#DIV/0!"}}]
["1.",null,{"$f":"'ORCAMENTO_CONSOLIDADO (2)'!C11","v":"MOBILIZAÇÃO E DESMOBILIZAÇAO"},null,null,null,{"$f":"C12","v":"MOBILIZAÇÃO E DESMOBILIZAÇAO"},{"$f":"SUMIF(#REF!,G12,#REF!)","v":{"$error":"#REF!"}},{"$nulls":4},{"$f":"D16+D22+D33+D41","v":0},{"$f":"$E$8*M12","v":0},null,{"$f":"$N$5*M12","v":0},null,{"$f":"P12/$E$8","v":{"$error":"#DIV/0!"}}]
["1.1",null,{"$f":"VLOOKUP(A13&\".\",'ORCAMENTO_CONSOLIDADO (2)'!A$10:C$800,3,FALSE)","v":"MOBILIZAÇÃO (Máquinas, Equipamentos, Ferramentas, Instrumentos, Materiais, Mobiliário)"},null,null,{"$f":"E8-63248004.44","v":-63248004.439999998},null,{"$f":"SUMIF(#REF!,G13,#REF!)","v":{"$error":"#REF!"}},{"$nulls":4},{"$f":"M12*1.2","v":0},{"$f":"$E$8*M13","v":0},null,{"$f":"$N$5*M13","v":0},null,{"$f":"P13/$E$8","v":{"$error":"#DIV/0!"}}]
["1.2",null,{"$f":"VLOOKUP(A14&\".\",'ORCAMENTO_CONSOLIDADO (2)'!A$10:C$800,3,FALSE)","v":"DESMOBILIZAÇÃO (Máquinas, Equip., Ferramentas, Instrumentos, Materiais, Mobiliário)"},{"$nulls":4},{"$f":"SUMIF(#REF!,G14,#REF!)","v":{"$error":"#REF!"}},{"$nulls":4},0.1,{"$f":"$E$8*M14","v":0},null,{"$f":"$N$5*M14","v":0},null,{"$f":"P14/$E$8","v":{"$error":"#DIV/0!"}}]
["2.",null,{"$f":"'ORCAMENTO_CONSOLIDADO (2)'!C18","v":"MOBILIÁRIO E EQUIPAMENTOS DE ESCRITÓRIO"},null,null,null,{"$f":"C15","v":"MOBILIÁRIO E EQUIPAMENTOS DE ESCRITÓRIO"},{"$f":"SUMIF(#REF!,G15,#REF!)","v":{"$error":"#REF!"}}]
["3.",null,{"$f":"'ORCAMENTO_CONSOLIDADO (2)'!C74","v":"EQUIPE - MÃO DE OBRA"},null,null,null,{"$f":"C16","v":"EQUIPE - MÃO DE OBRA"},{"$f":"SUMIF(#REF!,G16,#REF!)","v":{"$error":"#REF!"}}]
["3.1",null,{"$f":"VLOOKUP(A17&\".\",'ORCAMENTO_CONSOLIDADO (2)'!A$10:C$800,3,FALSE)","v":"SALÁRIOS FIXOS"}]
["3.2",null,{"$f":"VLOOKUP(A18&\".\",'ORCAMENTO_CONSOLIDADO (2)'!A$10:C$800,3,FALSE)","v":"VALORES ADICIONAIS"}]
["4.",null,{"$f":"'ORCAMENTO_CONSOLIDADO (2)'!C139","v":"VIAGENS / DIÁRIAS"},null,null,null,{"$f":"C19","v":"VIAGENS / DIÁRIAS"},{"$f":"SUMIF(#REF!,G19,#REF!)","v":{"$error":"#REF!"}}]
["4.1",null,{"$f":"VLOOKUP(A20&\".\",'ORCAMENTO_CONSOLIDADO (2)'!A$10:C$800,3,FALSE)","v":"DESPESAS COM VIAGENS COMERCIAIS"},{"$nulls":4},{"$f":"SUMIF(#REF!,G20,#REF!)","v":{"$error":"#REF!"}}]
["4.2",null,{"$f":"VLOOKUP(A21&\".\",'ORCAMENTO_CONSOLIDADO (2)'!A$10:C$800,3,FALSE)","v":"DESPESAS COM DIÁRIAS"},{"$nulls":4},{"$f":"SUMIF(#REF!,G21,#REF!)","v":{"$error":"#REF!"}}]
["5.",null,{"$f":"'ORCAMENTO_CONSOLIDADO (2)'!C147","v":"VEÍCULOS AUTOMOTORES"},null,null,null,{"$f":"C22","v":"VEÍCULOS AUTOMOTORES"},{"$f":"SUMIF(#REF!,G22,#REF!)","v":{"$error":"#REF!"}}]
["6.",null,{"$f":"'ORCAMENTO_CONSOLIDADO (2)'!C154","v":"FRENTES MÓVEIS DE LIMPEZA E CONSERVAÇÃO"},null,null,null,{"$f":"C23","v":"FRENTES MÓVEIS DE LIMPEZA E CONSERVAÇÃO"},{"$f":"SUMIF(#REF!,G23,#REF!)","v":{"$error":"#REF!"}}]
["7.",null,{"$f":"'ORCAMENTO_CONSOLIDADO (2)'!C159","v":"MATERIAL DE CONSUMO - ALMOXARIFADOS"},null,null,null,{"$f":"C24","v":"MATERIAL DE CONSUMO - ALMOXARIFADOS"},{"$f":"SUMIF(#REF!,G24,#REF!)","v":{"$error":"#REF!"}},{"$f":"D24+D48","v":0}]
["7.1",null,{"$f":"VLOOKUP(A25&\".\",'ORCAMENTO_CONSOLIDADO (2)'!A$10:C$800,3,FALSE)","v":"MATERIAL DE CONSUMO - MECÂNICA"},{"$nulls":4},{"$f":"SUMIF(#REF!,G25,#REF!)","v":{"$error":"#REF!"}}]
["7.2",null,{"$f":"VLOOKUP(A26&\".\",'ORCAMENTO_CONSOLIDADO (2)'!A$10:C$800,3,FALSE)","v":"MATERIAL DE CONSUMO - ELÉTRICA"},{"$nulls":4},{"$f":"SUMIF(#REF!,G26,#REF!)","v":{"$error":"#REF!"}}]
["7.3",null,{"$f":"VLOOKUP(A27&\".\",'ORCAMENTO_CONSOLIDADO (2)'!A$10:C$800,3,FALSE)","v":"MATERIAL DE CONSUMO - CIVIL"},{"$nulls":4},{"$f":"SUMIF(#REF!,G27,#REF!)","v":{"$error":"#REF!"}}]
["7.4",null,{"$f":"VLOOKUP(A28&\".\",'ORCAMENTO_CONSOLIDADO (2)'!A$10:C$800,3,FALSE)","v":"MANUTENÇÃO DE CANTEIRO - ESCRITÓRIO"},{"$nulls":4},{"$f":"SUMIF(#REF!,G28,#REF!)","v":{"$error":"#REF!"}}]
["8.",null,{"$f":"'ORCAMENTO_CONSOLIDADO (2)'!C325","v":"FERRAMENTAS"},null,null,null,{"$f":"C29","v":"FERRAMENTAS"},{"$f":"SUMIF(#REF!,G29,#REF!)","v":{"$error":"#REF!"}}]
["8.1",null,{"$f":"VLOOKUP(A30&\".\",'ORCAMENTO_CONSOLIDADO (2)'!A$10:C$800,3,FALSE)","v":"FERRAMENTAS - MECÂNICA"},{"$nulls":4},{"$f":"SUMIF(#REF!,G30,#REF!)","v":{"$error":"#REF!"}}]
["8.2",null,{"$f":"VLOOKUP(A31&\".\",'ORCAMENTO_CONSOLIDADO (2)'!A$10:C$800,3,FALSE)","v":"FERRAMENTAS - ELÉTRICA"},{"$nulls":4},{"$f":"SUMIF(#REF!,G31,#REF!)","v":{"$error":"#REF!"}}]
["8.3",null,{"$f":"VLOOKUP(A32&\".\",'ORCAMENTO_CONSOLIDADO (2)'!A$10:C$800,3,FALSE)","v":"FERRAMENTAS - CIVIL"},{"$nulls":4},{"$f":"SUMIF(#REF!,G32,#REF!)","v":{"$error":"#REF!"}}]
["9.",null,{"$f":"'ORCAMENTO_CONSOLIDADO (2)'!C536","v":"EQUIPAMENTOS"},null,null,null,{"$f":"C33","v":"EQUIPAMENTOS"},{"$f":"SUMIF(#REF!,G33,#REF!)","v":{"$error":"#REF!"}},{"$f":"D33+D41","v":0}]
["9.1",null,{"$f":"VLOOKUP(A34&\".\",'ORCAMENTO_CONSOLIDADO (2)'!A$10:C$800,3,FALSE)","v":"EQUIPAMENTOS - MECÂNICA"},{"$nulls":4},{"$f":"SUMIF(#REF!,G34,#REF!)","v":{"$error":"#REF!"}}]
["9.2",null,{"$f":"VLOOKUP(A35&\".\",'ORCAMENTO_CONSOLIDADO (2)'!A$10:C$800,3,FALSE)","v":"EQUIPAMENTOS - ELÉTRICA"},{"$nulls":4},{"$f":"SUMIF(#REF!,G35,#REF!)","v":{"$error":"#REF!"}}]
["9.3",null,{"$f":"VLOOKUP(A36&\".\",'ORCAMENTO_CONSOLIDADO (2)'!A$10:C$800,3,FALSE)","v":"EQUIPAMENTOS - CIVIL"},{"$nulls":4},{"$f":"SUMIF(#REF!,G36,#REF!)","v":{"$error":"#REF!"}}]
["10.",null,{"$f":"'ORCAMENTO_CONSOLIDADO (2)'!C635","v":"INSTRUMENTOS"},null,null,null,{"$f":"C37","v":"INSTRUMENTOS"},{"$f":"SUMIF(#REF!,G37,#REF!)","v":{"$error":"#REF!"}}]
["10.1",null,{"$f":"VLOOKUP(A38&\".\",'ORCAMENTO_CONSOLIDADO (2)'!A$10:C$800,3,FALSE)","v":"INSTRUMENTOS - MECÂNICA"},{"$nulls":4},{"$f":"SUMIF(#REF!,G38,#REF!)","v":{"$error":"#REF!"}}]
["10.2",null,{"$f":"VLOOKUP(A39&\".\",'ORCAMENTO_CONSOLIDADO (2)'!A$10:C$800,3,FALSE)","v":"INSTRUMENTOS - ELÉTRICA"},{"$nulls":4},{"$f":"SUMIF(#REF!,G39,#REF!)","v":{"$error":"#REF!"}}]
["10.3",null,{"$f":"VLOOKUP(A40&\".\",'ORCAMENTO_CONSOLIDADO (2)'!A$10:C$800,3,FALSE)","v":"INSTRUMENTOS - CIVIL"},{"$nulls":4},{"$f":"SUMIF(#REF!,G40,#REF!)","v":{"$error":"#REF!"}}]
["11.",null,{"$f":"'ORCAMENTO_CONSOLIDADO (2)'!C676","v":"SEGURANÇA E MANUTENÇÃO DE BARRAGENS"},null,null,null,{"$f":"C41","v":"SEGURANÇA E MANUTENÇÃO DE BARRAGENS"},{"$f":"SUMIF(#REF!,G41,#REF!)","v":{"$error":"#REF!"}}]
["11.1",null,{"$f":"VLOOKUP(A42&\".\",'ORCAMENTO_CONSOLIDADO (2)'!A$10:C$800,3,FALSE)","v":"MÃO DE OBRA - SEGURANÇA DE BARRAGENS"}]
["11.2",null,{"$f":"VLOOKUP(A43&\".\",'ORCAMENTO_CONSOLIDADO (2)'!A$10:C$800,3,FALSE)","v":"EQUIPAMENTOS - SEGURANÇA DE BARRAGENS"}]
["11.3",null,{"$f":"VLOOKUP(A44&\".\",'ORCAMENTO_CONSOLIDADO (2)'!A$10:C$800,3,FALSE)","v":"VEÍCULOS - SEGURANÇA DE BARRAGENS"}]
["12.",null,{"$f":"'ORCAMENTO_CONSOLIDADO (2)'!C700","v":"SERVIÇOS ADICIONAIS"},null,null,{"$f":"#REF!","v":{"$error":"#REF!"}},{"$f":"#REF!","v":{"$error":"#REF!"}},{"$f":"#REF!","v":{"$error":"#REF!"}}]
["12.1",null,{"$f":"VLOOKUP(A46&\".\",'ORCAMENTO_CONSOLIDADO (2)'!A$10:C$800,3,FALSE)","v":"FORNECIMENTO DE ÁGUA POTÁVEL PARA CANTEIRO"}]
["12.2",null,{"$f":"VLOOKUP(A47&\".\",'ORCAMENTO_CONSOLIDADO (2)'!A$10:C$800,3,FALSE)","v":"ANÁLISES DE EFLUENTES"}]
["13.",null,{"$f":"'ORCAMENTO_CONSOLIDADO (2)'!C707","v":"AQUISIÇÃO DE PEÇAS SOBRESSALENTES PISF - EIXOS LESTE"}]
["13.1",null,{"$f":"VLOOKUP(A49&\".\",'ORCAMENTO_CONSOLIDADO (2)'!A$10:C$800,3,FALSE)","v":"SOBRESSALENTES - MECÂNICA"}]
["13.2",null,{"$f":"VLOOKUP(A50&\".\",'ORCAMENTO_CONSOLIDADO (2)'!A$10:C$800,3,FALSE)","v":"SOBRESSALENTES - ELÉTRICA"},null,null,{"$f":"SUMIF(#REF!,C50&\".\",#REF!)","v":{"$error":"#REF!"}},{"$f":"ROUND(F50/G$8,4)","v":{"$error":"#REF!"}},{"$f":"SUMIF(#REF!,E50&\".\",#REF!)","v":{"$error":"#REF!"}}]
["13.3",null,{"$f":"VLOOKUP(A51&\".\",'ORCAMENTO_CONSOLIDADO (2)'!A$10:C$800,3,FALSE)","v":"Peças para reposições nas manutenções preventivas e corretivas dos condicionadores de ar"}]
["13.4",null,{"$f":"VLOOKUP(A52&\".\",'ORCAMENTO_CONSOLIDADO (2)'!A$10:C$800,3,FALSE)","v":"PEÇAS PARA MANUTENÇÃO GERADOR - MECÂNICA"}]
["14.",null,{"$f":"'ORCAMENTO_CONSOLIDADO (2)'!C784","v":"SERVIÇOS ESPECIALIZADOS (EIXO LESTE)"}]
["14.1",null,{"$f":"VLOOKUP(A54&\".\",'ORCAMENTO_CONSOLIDADO (2)'!A$10:C$800,3,FALSE)","v":"Serviços de recarga de extintores de incêndio (EB / SE / Canteiros)"}]
["15.",null,{"$f":"'ORCAMENTO_CONSOLIDADO (2)'!C796","v":"CUSTOS INDIRETOS"},{"$nulls":9},{"$f":"D53+D48+D45+D41+D37+D33+D29+D24+D23+D22+D19+D15+D12","v":0}]
[{"$nulls":6},{"$f":"C55","v":"CUSTOS INDIRETOS"},{"$f":"SUMIF(#REF!,G56,#REF!)","v":{"$error":"#REF!"}}]
["NOME DO INFORMANTE:",null,null,"QUALIFICAÇÃO:"]
[]
["ASSINATURA:",null,null,"DATA:"]

{"sheet":"ORCAMENTO_CONSOLIDADO (2)","index":1,"n_rows":806,"n_cols":14,"rows_kept":806,"cut":false,"hidden":false,"merged":[[801,0,801,5],[801,6,801,7],[0,2,0,7],[1,2,1,7],[2,2,2,7],[4,0,5,7],[6,0,6,4],[805,0,805,7],[806,0,806,7],[807,0,807,7],[802,0,802,5],[802,6,802,7],[803,0,803,5],[803,6,803,7],[804,0,804,5],[804,6,804,7]]}
[null,null,"Ministério do Desenvolvimento Regional  - MDR",{"$nulls":5},70000000,null,6,null,45318771.981999986]
[null,null,"Companhia de Desenvolvimento dos Vales do São Francisco e do Parnaíba",{"$nulls":5},{"$f":"G7-I1","v":-70000000}]
[null,null,"Gerência de Operação do PISF - Centro de Controle e Operação (AD / GOI / CCO)"]
[]
["TERMO DE REFERÊNCIA PARA CONTRATAÇÃO DOS RECURSOS NECESSÁRIOS À OPERAÇÃO E MANUTENÇÃO DAS INFRAESTRUTURAS DO EIXO LESTE DO PISF - PROJETO DE INTEGRAÇÃO DO SÃO FRANCISCO COM AS BACIAS HIDROGRÁFICAS DO NORDESTE SETENTRIONAL"]
[]
["ORÇAMENTO CONSOLIDADO",{"$nulls":4},"TOTAL - (R$)",0,null,118869609.74000004,88777364.980000004,"SUBTOTAL(9;G11:G874)"]
[]
["ITEM","CÓDIGO","DESCRIÇÃO","UNID.","QUANTID.","R$ UNIT.","R$ TOTAL","%"]
[]
["1.",null,"MOBILIZAÇÃO E DESMOBILIZAÇAO"]
["1.1.",null,"MOBILIZAÇÃO (Máquinas, Equipamentos, Ferramentas, Instrumentos, Materiais, Mobiliário)"]
["1.1.1",null,"Mobilização da Equipe - Canteiro apoio geral (Floresta/PE)","un",1,"",null,null,1]
["1.1.2",null,"Mobilização da Equipe - Canteiro central (Sertânia/PE)","un",1,"",null,null,1]
["1.2.",null,"DESMOBILIZAÇÃO (Máquinas, Equip., Ferramentas, Instrumentos, Materiais, Mobiliário)"]
["1.2.1",null,"Desmobilização da Equipe - Canteiro apoio geral (Floresta/PE)","un",1,"",null,null,1]
["1.2.2",null,"Desmobilização da Equipe - Canteiro central (Sertânia/PE)","un",1,"",null,null,1]
["2.",null,"MOBILIÁRIO E EQUIPAMENTOS DE ESCRITÓRIO"]
["2.1","E209300236-EMBASA/BA","Aluguel de impressora colorida-Laser com cartuchos-formatos A4 e A3 (inclusive suprimentos)","un x mês",108,"",null,null,288]
["2.2","I8612-SEINFRA/CE","Aluguel de Plotter (inclusive suprimentos)","un x mês",12,"",null,null,36]
["2.3"," I8610-SEINFRA/CE","Servidor para backup - EQUIPAMENTO SIMILAR","un x mês",12,"",null,null,36]
["2.4"," I8610-SEINFRA/CE","Desktop com software-tipo 1 (i7, 1T, 8GB, monitor 19\", S.O. Windows 10 e Office última versão) - EQUIPAMENTO SIMILAR","un x mês",210,"",null,null,540]
["2.5"," I8610-SEINFRA/CE","Notebook-tipo 1 (i7, 1T, 8GB, S.O. Windows 10 e Office última versão) - EQUIPAMENTO SIMILAR","un x mês",216,"",null,null,528]
["2.6","COT_ANTE","Kit Antena Digital 4K Externa Log 16 elementos Mastro 45cm e cabo coaxial 12m","un x mês",6,"",null,null,12]
["2.7","I0123-SEINFRA/CE","Armário de escritório","un x mês",342,"",null,null,804]
["2.8","73.72.07-SUDECAP/MG","Bebedouro industrial (canteiro)","un x mês",12,"",null,null,36]
["2.9","11534-ORSE/SE","Cadeira giratória, com braço, tipo executiva","un x mês",702,"",null,null,2112]
["2.10","11543-ORSE","Cadeira de plástico sem braço, cor branca","un x mês",138,"",null,null,504]
["2.11","COT_CAM_FOTO","Câmera fotográfica digital 20 mp 5x HD","un x mês",12,"",null,null,36]
["2.12","COT - CAR - LIX","Lixeira Carro Coletor 120L","un x mês",24,"",null,null,72]
["2.13","COT_CESTO","Cestos Telado de lixo 9,6L","un x mês",48,"",null,null,144]
["2.14","39555-SINAPI/PE","Condicionador de ar 12.000 BTU","un x mês",246,"",null,null,624]
["2.15","COT_GPS","GPS com cabo e software (conforme especificação)","un x mês",12,"",null,null,36]
["2.16","COT_MESA_REUN","Mesa de reunião 10 lugares com 10 cadeiras","un x mês",42,"",null,null,108]
["2.17","COT_MESA_PVC","Mesa retangular em Polipropileno 119x75cm","un x mês",36,"",null,null,108]
["2.18","COT_MESA_ESCR","Mesas de escritório com gavetas (conforme especificação)","un x mês",702,"",null,null,2112]
["2.19","F030000293-EMBASA/BA","Projetor multimídia (Datashow)","un x mês",12,"",null,null,36]
["2.20","COT_RACK","Rack para TV até 60 Polegadas 1 Porta","un x mês",12,"",null,null,36]
["2.21","I0122-SEINFRA/CE","Armário de cozinha completo","un x mês",12,"",null,null,36]
["2.22","COT_MES_06","Conjunto de Mesa 1,40 com Tampo MDP com 6 cadeiras","un x mês",12,"",null,null,36]
["2.23","10231-ORSE/SE","Fogão ","un x mês",12,"",null,null,36]
["2.24","029028-IOPES","Cilindro de Gás de Cozinha 45 kg","un x mês",30,"",null,null,84]
["2.25","4226-SINAPI/PE","Gás de cozinha-GLP (kg)","un x mês",1350,"",null,null,3780]
["2.26","F020000716-EMBASA/BA","Geladeira 280 litros","un x mês",12,"",null,null,36]
["2.27","COT_MICROOND","Forno Microondas 20L","un x mês",12,"",null,null,36]
["2.28","COT_FAQUEI","Faqueiro com 24 peças","un x mês",204,"",null,null,780]
["2.29","COT_PRATO","Pratos rasos redondo em cerâmica","un x mês",468,"",null,null,1584]
["2.30","COT_COPO","Conjunto  copos em vidro 350ml com 8 unidades","un x mês",24,"",null,null,72]
["2.31","COT_TELEVISOR","Smart Tv LED 32\"","un x mês",42,"",null,null,108]
["2.32","AP_JANTAR","Aparelho de jantar para 06 pessoas","un x mês",78,"",null,null,264]
["2.33","11645-ORSE/SE","Armário para vestiário, em aço, com 12 portas, com cadeado","un x mês",12,"",null,null,36]
["2.34","COT_CHAP","Chapa gás 65 cm para grelhar","un x mês",12,"",null,null,36]
["2.35","08600-ORSE/SE","Coifa","un x mês",12,"",null,null,36]
["2.36","COT_UTENS","Conjunto de utensílios gadgets inox para cozinha","un x mês",12,"",null,null,36]
["2.37","COT_FOGAO","Fogão industrial 6 bocas 30x30 baixa pressão perfil 5","un x mês",12,"",null,null,36]
["2.38","COT_FORNO","Forno elétrico 46L 1500W","un x mês",12,"",null,null,36]
["2.39","F020000719-EMBASA/BA","Freezer 246 l","un x mês",12,"",null,null,36]
["2.40","\t10232-ORSE/SE","Geladeira industrial 300 litros","un x mês",12,"",null,null,36]
["2.41","COT_PANEL","Conjunto de panelas antiaderente com 7 peças","un x mês",12,"",null,null,36]
["2.42","COT_LIQUID","Liquidificadores industriais alta rotação 2L","un x mês",12,"",null,null,36]
["2.43","COT_MAQ_LAVA_LOUCA","Máquina de lavar louças industrial B.30 ","un x mês",12,"",null,null,36]
["2.44","COT_MAQ_LAVA_ROUPA","Máquina de Lavar roupa 11kg ","un x mês",12,"",null,null,36]
["2.45","COT_MESA_BUF","Carrinho Buffet Térmico Self Service Inox 8 cubas","un x mês",12,"",null,null,36]
["2.46","COT_MESA_REFEIT","Mesa de refeitório 10 lugares com cadeiras MDF branco de 25mm","un x mês",30,"",null,null,108]
["2.47","COT_REFRESQUEIRA","Refresqueira BBS2 Inox","un x mês",12,"",null,null,36]
["2.48","COT_TABUA","Tábuas para carnes 19x35x1,6cm","un x mês",12,"",null,null,36]
["2.49","COT_CAMA_BOX","Cama box conjugada solteiro","un x mês",168,"",null,null,528]
["2.50","COT_GUARDA_ROUPA","Guarda-Roupa solteiro 4 Portas","un x mês",12,"",null,null,36]
["2.51","COT_ROUPA_CAMA","Jogo de roupa de cama solteiro 100% Algodão","un x mês",336,"",null,null,1056]
["2.52","COT_ROUPA_BANHO","Jogo de Roupa de banho 5 Peças","un x mês",168,"",null,null,528]
["2.53","COT_SOFA","Conjunto de sofá 2 e 3 lugares","un x mês",12,"",null,null,36]
[]
[]
["3.",null,"EQUIPE - MÃO DE OBRA"]
["3.1.",null,"SALÁRIOS FIXOS"]
["3.1.1","A1","Almoxarife","homem x mês",6,"",null,null,12]
["3.1.2","A1","Auxiliar Administrativo","homem x mês",6,"",null,null,48]
["3.1.3","A9","Auxiliar de serviços gerais","homem x mês",36,"",null,null,144]
["3.1.4","T3","Auxiliar de Topografia","homem x mês",12,"",null,null,24]
["3.1.5","A8","Carpinteiro","homem x mês",12,"",null,null,36]
["3.1.6","CA","Coordenador - Chefe de Escritório","homem x mês",6,"",null,null,12]
["3.1.7","P0","Coordenador - Engenheiro Sênior (Civil / Eletricista / Mecânico) ","homem x mês",6,"",null,null,12]
["3.1.8","P1","Coordenador Manutenção - Engenheiro Pleno (Civil / Eletricista / Mecânico) ","homem x mês",6,"",null,null,12]
["3.1.9","P1","Coordenador Operação - Engenheiro Pleno (Civil / Eletricista / Mecânico) ","homem x mês",6,"",null,null,12]
["3.1.10","A5","Eletricista","homem x mês",12,"",null,null,36]
["3.1.11","A5","Eletricista (inclusive adicional de periculosidade)","homem x mês",18,"",null,null,168]
["3.1.12","P1","Engenheiro de Segurança e Medicina do Trabalho (inclusive adicional de periculosidade)","homem x mês",6,"",null,null,12]
["3.1.13","P2","Engenheiro Junior ","homem x mês",24,"",null,null,72]
["3.1.14","P1","Engenheiro Pleno ","homem x mês",36,"",null,null,144]
["3.1.15","A7","Ferreiro","homem x mês",6,"",null,null,36]
["3.1.16","P1","Geólogo  (Geotecnia)","homem x mês",6,"",null,null,12]
["3.1.17","P2","Médico do Trabalho","homem x mês",6,"",null,null,12]
["3.1.18","A3","Motorista","homem x mês",6,"",null,null,12]
["3.1.19","A6","Pedreiro","homem x mês",24,"",null,null,84]
["3.1.20","A11","Servente","homem x mês",360,"",null,null,1488]
["3.1.21","T2","Técnico Automação - Especialista em SDSC (inclusive adicional de periculosidade)","homem x mês",6,"",null,null,12]
["3.1.22","T3","Técnico Auxiliar","homem x mês",36,"",null,null,144]
["3.1.23","T3","Técnico Auxiliar (inclusive adicional de periculosidade)","homem x mês",18,""]
["3.1.24","T2","Técnico de Segurança e Medicina do Trabalho (inclusive adicional de periculosidade)","homem x mês",6,"",null,null,24]
["3.1.25","T2","Tecnico Edificações","homem x mês",12,"",null,null,36]
["3.1.26","T2","Técnico - Cadista","homem x mês",6,"",null,null,36]
["3.1.27","T2","Técnico Pleno - Eletrotécnico - Diurno (inclusive adicional de periculosidade)","homem x mês",72,"",null,null,288]
["3.1.28","T2","Técnico Pleno - Eletrotécnico -  Noturno (inclusive adicional de periculosidade)","homem x mês",72,"",null,null,288]
["3.1.29","T2","Técnico Junior - Mecânico - Diurno (inclusive adicional de periculosidade)","homem x mês",72,"",null,null,144]
["3.1.30","T2","Técnico Junior - Mecânico - Noturno (inclusive adicional de periculosidade)","homem x mês",72,"",null,null,144]
["3.1.31","T2","Técnico Pleno ","homem x mês",60,"",null,null,168]
["3.1.32","T2","Técnico Pleno (inclusive adicional de periculosidade)","homem x mês",18,"",null,null,60]
["3.1.33","T1","Técnico Pleno - Analista em Tecnologia da Informação","homem x mês",6,"",null,null,96]
["3.1.34","T0","Técnico - Profissional Sênior (N. Médio/Especializado)","homem x mês",18,"",null,null,12]
["3.1.35","T2","Técnico Telecomunicações/Eletrônica (inclusive adicional de periculosidade)","homem x mês",6,"",null,null,12]
["3.1.36","TS","Topógrafo","homem x mês",6,"",null,null,72]
["3.1.37","A10","Vigia diurno ","homem x mês",24,"",null,null,72]
["3.1.38","A10","Vigia noturno","homem x mês",24,""]
[]
["3.2.",null,"VALORES ADICIONAIS"]
["3.2.1.",null,"ADICIONAL DE PERICULOSIDADE PARA OS ENGENHEIROS E COORDENADORES"]
["3.2.1.1","P1","Engenheiro Pleno","homem x mês",42,"",null,null,12]
["3.2.1.2","P2","Engenheiro Júnior","homem x mês",18,"",null,null,12]
["3.2.1.3","T0","Técnico Sênior","homem x mês",12,"",null,null,12]
["3.2.1.4","T2","Técnico Pleno","homem x mês",30,"",null,null,12]
["3.2.1.5","T3","Técnico Auxiliar","homem x mês",36,"",null,null,12]
["3.2.2.",null,"MÃO DE OBRA - HORA EXTRA 50%"]
["3.2.2.1","P1","Engenheiro Pleno - Hora Extra 50% - C/ Periculosidade","Homem x Hora",192,"",null,null,960,{"$f":"F123*E123","v":{"$error":"#VALUE!"}}]
["3.2.2.2","T2","Técnico Pleno - Hora Extra 50% - C/ Periculosidade","Homem x Hora",192,"",null,null,4719.96,{"$f":"F124*E124","v":{"$error":"#VALUE!"}}]
["3.2.2.3","T2","Técnico Júnior- Hora Extra 50%","Homem x Hora",192,"",null,null,144,{"$error":"#VALUE!"}]
["3.2.2.4","T2","Técnico Júnior- Hora Extra 50% - C/ Periculosidade","Homem x Hora",192,"",null,null,144,{"$error":"#VALUE!"}]
["3.2.2.5","T3","Técnico Auxiliar - Hora Extra 50% - C/ Periculosidade","Homem x Hora",192,"",null,null,3888,{"$error":"#VALUE!"}]
["3.2.2.6","T3","Auxiliar - Hora Extra 50% - C/ Periculosidade","Homem x Hora",192,"",null,null,336,{"$error":"#VALUE!"}]
["3.2.2.7","A11","Servente - Hora Extra 50% - C/ Periculosidade","Homem x Hora",1080,"",null,null,7560,{"$error":"#VALUE!"}]
["3.2.3.",null,"MÃO DE OBRA - HORA EXTRA 100%"]
["3.2.3.1","P1","Engenheiro Pleno - Hora Extra 100% - C/ Periculosidade","Homem x Hora",96,"",null,null,384]
["3.2.3.2","T2","Técnico Pleno - Hora Extra 100% - C/ Periculosidade","Homem x Hora",96,"",null,null,1872]
["3.2.3.3","T2","Técnico Júnior- Hora Extra 100%","Homem x Hora",96,"",null,null,144]
["3.2.3.4","T2","Técnico Júnior- Hora Extra 100% - C/ Periculosidade","Homem x Hora",96,"",null,null,144]
["3.2.3.5","T3","Técnico Auxiliar - Hora Extra 100% - C/ Periculosidade","Homem x Hora",96,"",null,null,1248]
["3.2.3.6","T3","Auxiliar - Hora Extra 100% - C/ Periculosidade","Homem x Hora",96,"",null,null,144]
["3.2.3.7","A11","Servente - Hora Extra 100% - C/ Periculosidade","Homem x Hora",720,"",null,null,3024]
[]
["4.",null,"VIAGENS / DIÁRIAS"]
["4.1.",null,"DESPESAS COM VIAGENS COMERCIAIS"]
["4.1.1",null,"Viagem por via aerea","un",6,"",null,null,48]
["4.1.2",null,"Viagem por via terrestre (comercial)","un",18,"",null,null,144]
["4.2.",null,"DESPESAS COM DIÁRIAS"]
["4.2.1",null,"Diárias nacionais","un",6,"",null,null,48]
["4.2.2",null,"Diárias regionais","un",72,"",null,null,144]
[]
["5.",null,"VEÍCULOS AUTOMOTORES"]
["5.1","B3","TIPO HATCH 1.6 FLEX (110 CV)","un x mês",90,"",null,null,456,{"$f":"E148/12","v":7.5}]
["5.2","B4","TIPO SEDAN 1.6 FLEX (115CV)","un x mês",6,"",null,null,12,{"$f":"E149/12","v":0.5}]
["5.3","B11","Veículo Tipo Pick Up Cabine Dupla 4 x 4 (163 CV)","un x mês",114,"",null,null,324,9.5]
["5.4","B8","Veículo - Tipo Ônibus - 45 assentos (218 CV) - COM MOTORISTA","un x mês",18,"",null,null,48,1.5]
["5.5","B1","NXR BROS 160","un x mês",18,"",null,null,36,1.5]
[]
["6.",null,"FRENTES MÓVEIS DE LIMPEZA E CONSERVAÇÃO"]
["6.1","Banco de Preços (PREGÃO ELETRÔNICO - MUNICÍPIO DE FÁTIMA/BA, 05/2022)","Tenda Piramidal 5m x 5m (para refeitório)","un x mês",48,"",null,null,216]
["6.2","F099722405/EMBASA","Tenda Piramidal 3m x 3m ","un x mês",48,"",null,null,216]
["6.3","10390 - ORSE/SE","Banheiro Químico, com 03 limpezas semanais","un x mês",120,"",null,null,360]
[]
["7.",null,"MATERIAL DE CONSUMO - ALMOXARIFADOS"]
["7.1.",null,"MATERIAL DE CONSUMO - MECÂNICA"]
["7.1.1","04791 - SINAPI","Adesivo Acrílico / Cola de contato","un",480,"",null,null,480]
["7.1.2","05318 - SINAPI","Água Raz - galão  5 l","un",112,"",null,null,112]
["7.1.3","\t000312/SBC","Alcool Comum 90º GL","l",1200,"",null,null,1200]
["7.1.4",null,"Antiferrugem aerosol WD-40 - tubo de 300 ml","un",289,"",null,null,289]
["7.1.5","Banco de preços (NºPregão:142022 / UASG:926687 - Serviço Autonomo de Agua e Esgoto de Volta Redonda SAAE VR RJ, Pregão Eletrônico, 04/2022)","Antiespumante – antiespumante a base de silicone","l",223,"",null,null,223]
["7.1.6","43132 - SINAPI","Arame recozido n.º 18","kg",2400,"",null,null,2400]
["7.1.7","00122 - SINAPI","Cola de PVC com 850 g","un",144,"",null,null,144]
["7.1.8","Banco de preços (DEPART.DE OBRAS E SERV.PUBLICOS\nPrefeitura Municipal de Ubiretama/RS, Dispensa por Limite - 01/2022)","Cola Ultra Gray 70g","un",144,"",null,null,144]
["7.1.9","Banco de preços (PREFEITURA MUNICIPAL DE QUEIROZ, PREGÃO PRESENCIAL - 80/2021)","Cola para junta de motores com 73g","un",1200,"",null,null,1200]
["7.1.10","Banco de preços (FUNDO MUNICIPAL DE ASSISTÊNCIA SOCIAL\nPrefeitura Municipal de Hulha Negra/RS, Dispensa por Limite - 05/2022)","Convertedor de ferrugem 500 ml","un",445,"",null,null,445]
["7.1.11","038200 - SINAPI","Corda de bombeiro 12mm em nylon trançado (rolo de 100,00m)","m",3200,"",null,null,3200]
["7.1.12","004221 - SINAPI","Diesel comum (l)","l",480,"",null,null,4800]
["7.1.13","044533 - SINAPI","Disco corte abrasivo 7\" x 1/8\" x 7/8\"","un",434,"",null,null,434]
["7.1.14","044531 - SINAPI","Disco de corte diamantado - 7\", para esmerilhadeira, segmentado, para concreto","un",108,"",null,null,434]
["7.1.15","044495 - SINAPI","Disco de corte para estrutura metálica 300 x 3,2 x 19,05 mm","un",434,"",null,null,434]
["7.1.16","044533 - SINAPI","Disco de desbaste para estrutura metálica de 9\" x 1/4\" x 7/8\" ( 225 x 6,25 x 21,87 mm)","un",434,"",null,null,434]
["7.1.17","010997 - SINAPI","Eletrodos Revestido AWS-E7018, DN 4 mm","kg",320,"",null,null,320]
["7.1.18",null,"SOLDA-ELETRODO OK 4600 AWS 6013 6,0mm 1/4\"","kg",320,"",null,null,320]
["7.1.19","000012 - SINAPI","Escova de aço para remoção da graxa envelhecida dos cabos de aço","un",160,"",null,null,160]
["7.1.20","000013 - SINAPI","Estopa - embalagem 20 kg","kg",294,"",null,null,294]
["7.1.21","000404 - SINAPI","Fita auto fusão 19 mm x 10 m","un",194,"",null,null,194]
["7.1.22","012815 - SINAPI","Fita crepe adesiva 25mm x 50mm ","un",194,"",null,null,194]
["7.1.23","020111 - SINAPI","Fita isolante 19 mm x 20 m","un",194,"",null,null,194]
["7.1.24",null,"Graxa a base de lítio NGLI 2","kg",478,"",null,null,478]
["7.1.25",null,"Graxa a base de lítio NGLI 3","kg",478,"",null,null,478]
["7.1.26",null,"Graxa com dissulfeto de molibidênio (MoS2) - Lata 500 g","un",478,"",null,null,478]
["7.1.27",null,"Graxa GMA - 2","kg",478,"",null,null,478]
["7.1.28",null,"Graxa de Alta Resistência a Carga, Pressão LGEP 2/1. Aplicação: Engrenagens de roda e engrenagens expostas","kg",478,"",null,null,478]
["7.1.29",null,"Hidróxido de Cálcio P.A. 500 g","kg",600,"",null,null,600]
["7.1.30",null,"Hipoclorito de Sódio 12% 5000 ml","kg",1200,"",null,null,1200]
["7.1.31","8216 - ORSE","Lâmina de serra para metal  Starret ou similar","un",667,"",null,null,667]
["7.1.32",null,"Lençol de borracha manta 3/16” 4,8mm","m²",400,"",null,null,400]
["7.1.33",null,"Líquido penetrante visível lavável à água (Ensaios de Líquido Penetrante)","un",98,"",null,null,98]
["7.1.34","003767 - SINAPI","Lixa nº120","un",2400,"",null,null,2400]
["7.1.35",null,"Lona de borracha com alma 1,0 – 4,8 mm esp.","m",45,"",null,null,45]
["7.1.36","003777 - SINAPI/PE","Lona plástica - 4 x 100 m - 12 kg","m²",3200,"",null,null,3200]
["7.1.37","037459 - SINAPI","Mangueira Cristal, Lisa PVC transparente, 3/4\" x 2 mm","m",1600,"",null,null,1600]
["7.1.38",null,"Mangueira FLG-62/1 0 - 150 PSI 1/4\" NPT","m",800,"",null,null,800]
["7.1.39","7696 - ORSE","Massa calafetar cinza-Durepox ou similiar","kg",334,"",null,null,334]
["7.1.40",null,"Óleo - Translação pórtico e ponte e direção do carro - 20 l -  Óleo EP 220","l",334,"",null,null,334]
["7.1.41",null,"Óleo Hidràulico para os componentes não protegido dos Servomotor Hidráulico - Óleo EP 320","l",334,"",null,null,334]
["7.1.42",null,"Óleo Lubrificante Redutor - Óleo SAE 90","l",334,"",null,null,334]
["7.1.43",null,"Óleo lubrificante, para engrenagem., EP-5, viscosidade (CSt) ( - 40ºC) = 22 - tambor 20 l","l",334,"",null,null,334]
["7.1.44",null,"PAC – Policloreto de alumínio (5 l)","l",967,"",null,null,967]
["7.1.45",null,"Papelão grafitado 1,50 m x 1,60 m Esp 2.4","un",30,"",null,null,30]
["7.1.46",null,"Pasta de Limpeza Uso Geral Limptek 500 gramas","kg",400,"",null,null,400]
["7.1.47",null,"Querosene para limpeza ","l",240,"",null,null,240]
["7.1.48",null,"Revelador não aquoso D70 (Ensaios de Líquido Penetrante)","un",98,"",null,null,98]
["7.1.49",null,"Sílica Gel Branca - Pacote De 1kg - Grânulos De 4-8 Mm","kg",98,"",null,null,98]
["7.1.50","039961 - SINAPI","Silicone (acético branca) - Tubo de 280g","un",480,"",null,null,480]
["7.1.51",null,"Trava Parafusos de Alta Resistência 120 com 10g","un",192,"",null,null,192]
["7.1.52","Banco de preços (FUNDO MUNICIPAL DE CULTURA\nSECRETARIA DE CULTURA E TURISMO\nPrefeitura Municipal de Leme/SP, Dispensa por Limite - 04/2022)","Vaselina sólida anti-inflamável 500g","kg",120,"",null,null,480]
["7.2.",null,"MATERIAL DE CONSUMO - ELÉTRICA"]
["7.2.1","00181 - ORSE","Anilha Identificação - 0,5 a 6mm² (pacote com 100 unidades)","un",10,"",null,null,10]
["7.2.2","00181 - ORSE","Anilha Identificação - 10 a 16mm² (pacote com 100 unidades)","un",10,"",null,null,10]
["7.2.3","03875 - ORSE","Anilha Identificação - 25 a 70mm² (pacote com 100 unidades)","un",10,"",null,null,10]
["7.2.4","03875 - ORSE","Anilha Identificação - 95 a 120mm² (pacote com 100 unidades)","un",10,"",null,null,10]
["7.2.5","03531 - ORSE","Ar comprimido seco  Aerossol 300ml","un",100,"",null,null,100]
["7.2.6","00993 - SINAPI","Cabo cobre flexível classe 4 ou 5 isolação PVC/A M 1,68 e cobertura PVC-ST1 antichama BWF-B 0,6/1 kV 1,5mm²","m",500,"",null,null,500]
["7.2.7","01022 - SINAPI","Cabo cobre flexível classe 4 ou 5 isolação PVC/A M 1,68 e cobertura PVC-ST1 antichama BWF-B 0,6/1 kV 2,5mm²","m",1000,"",null,null,1000]
["7.2.8","01003 - SINAPI","Cabo cobre flexível classe 4 ou 5 isolação PVC/A M 1,68 e cobertura PVC-ST1 antichama BWF-B 0,6/1 kV 4mm²","m",1000,"",null,null,1000]
["7.2.9","00994 - SINAPI","Cabo cobre flexível classe 4 ou 5 isolação PVC/A M 1,68 e cobertura PVC-ST1 antichama BWF-B 0,6/1 kV 6mm²","m",1000,"",null,null,1000]
["7.2.10","01020 - SINAPI","Cabo cobre flexível classe 4 ou 5 isolação PVC/A M 1,68 e cobertura PVC-ST1 antichama BWF-B 0,6/1 kV 10mm²","m",500,"",null,null,500]
["7.2.11","00995 - SINAPI","Cabo cobre flexível classe 4 ou 5 isolação PVC/A M 1,68 e cobertura PVC-ST1 antichama BWF-B 0,6/1 kV 16mm²","m",500,"",null,null,500]
["7.2.12","00996 - SINAPI","Cabo cobre flexível classe 4 ou 5 isolação PVC/A M 1,68 e cobertura PVC-ST1 antichama BWF-B 0,6/1 kV 25mm²","m",500,"",null,null,500]
["7.2.13","01019 - SINAPI","Cabo cobre flexível classe 4 ou 5 isolação PVC/A M 1,68 e cobertura PVC-ST1 antichama BWF-B 0,6/1 kV 35mm²","m",500,"",null,null,500]
["7.2.14","01018 - SINAPI","Cabo cobre flexível classe 4 ou 5 isolação PVC/A M 1,68 e cobertura PVC-ST1 antichama BWF-B 0,6/1 kV 50mm²","m",500,"",null,null,500]
["7.2.15","00977 - SINAPI","Cabo cobre flexível classe 4 ou 5 isolação PVC/A M 1,68 e cobertura PVC-ST1 antichama BWF-B 0,6/1 kV 70mm²","m",500,"",null,null,500]
["7.2.16","00998 - SINAPI","Cabo cobre flexível classe 4 ou 5 isolação PVC/A M 1,68 e cobertura PVC-ST1 antichama BWF-B 0,6/1 kV 95mm²","m",200,"",null,null,200]
["7.2.17","01017 - SINAPI","Cabo cobre flexível classe 4 ou 5 isolação PVC/A M 1,68 e cobertura PVC-ST1 antichama BWF-B 0,6/1 kV 120mm²","m",200,"",null,null,200]
["7.2.18","00863 - SINAPI","Cabo de cobre nu, eletrolítico, têmpera meio duro, #35mm² (m)","m",200,"",null,null,200]
["7.2.19","00867 - SINAPI","Cabo de cobre nu, eletrolítico, têmpera meio duro, #50mm² (m)","m",200,"",null,null,200]
["7.2.20","00864 - SINAPI","Cabo de cobre nu, eletrolítico, têmpera meio duro, #70mm² (m)","m",200,"",null,null,200]
["7.2.21","09720 - ORSE","Conector para haste aterramento #35mm² GTDU","un",25,"",null,null,25]
["7.2.22","09720 - ORSE","Conector para haste aterramento #50mm² GTDU","un",20,"",null,null,20]
["7.2.23","09720 - ORSE","Conector para haste aterramento #70mm² GTDU","un",20,"",null,null,20]
["7.2.24","11602 - ORSE","Filtro de ventiladores de painéis","un",180,"",null,null,180]
["7.2.25",null,"Filtro dos motores do eixo leste EBV6 (fabricante Aeroglass (670x280x25mm)","un",48,"",null,null,48]
["7.2.26",null,"Filtro dos motores do eixo leste EBV5 (fabricante Aeroglass (750x225x25mm)","un",48,"",null,null,48]
["7.2.27",null,"Filtro dos motores do eixo leste EBV1, 2, 3 e 4 (fabricante Aeroglass-modelo FMT_C2015 inox - 345x925x25mm)","un",64,"",null,null,64]
["7.2.28","02643 - ORSE","Fita isolante de borracha autofusão impermeável à prova dágua , até 69 kV (alta tensão)- 19mm x 10m","un",200,"",null,null,200]
["7.2.29","020111 - SINAPI","Fita isolante adesiva antichama 19mm x 20m","un",280,"",null,null,280]
["7.2.30","01118 - ORSE","Interruptor simples com 01 tecla","un",4,"",null,null,4]
["7.2.31","01119 - ORSE","Interruptor simples com 02 teclas","un",4,"",null,null,4]
["7.2.32","38070 - SINAPI","Interruptor tipo three-way (paralelos) com 02 teclas","un",4,"",null,null,4]
["7.2.33",null,"Limpador de contatos elétricos 300ml","un",84,"",null,null,84]
["7.2.34",null,"Pano para limpeza (Rolo Tipo Perfex 20 cm x 300 metros)","un",50,"",null,null,50]
["7.2.35","11443 - ORSE","Pincel - kit 03 pincéis 1/2\" 1\" 1.1/2\"","un",76,"",null,null,76]
["7.2.36","Banco de preços (NºPregão:202022 / UASG:926430 - GOVERNO DO ESTADO DO AMAZONAS\nDEFENSORIA PUBLICA DO ESTADO DO AMAZONAS, Pregão Eletrônico - 05/2022)","Sabão líquido neutro (5 l)","un",54,"",null,null,54]
["7.2.37","02922 - ORSE","Solvente/Desengraxante de alta rigidez dielétrica  1l","un",36,"",null,null,36]
["7.2.38","12377 - ORSE*","Terminal isolado tipo agulha para condutores de 0,5 a 1,5mm² (pct c/ 100)","un",100,"",null,null,100]
["7.2.39","12377 - ORSE*","Terminal isolado tipo agulha para condutores de 1,5 a 2,5 mm² (pct c/ 100)","un",100,"",null,null,100]
["7.2.40","07948 - ORSE*","Terminal isolado tipo agulha para condutores de 4 a 6 mm² (pct c/ 100)","un",100,"",null,null,100]
["7.2.41","04669 - ORSE","Terminal de compressão – 10mm²","un",200,"",null,null,200]
["7.2.42","04670 - ORSE","Terminal de compressão – 16mm²","un",200,"",null,null,200]
["7.2.43","02676 - ORSE","Terminal de compressão – 25mm²","un",100,"",null,null,100]
["7.2.44","02677 - ORSE","Terminal de compressão – 35mm²","un",100,"",null,null,100]
["7.2.45","03559 - ORSE","Terminal de compressão – 50mm²","un",100,"",null,null,100]
["7.2.46","06911 - ORSE","Terminal de compressão – 70mm²","un",100,"",null,null,100]
["7.2.47","03153 - ORSE","Terminal de compressão – 95mm²","un",50,"",null,null,50]
["7.2.48","04673 - ORSE","Terminal de compressão – 120mm²","un",50,"",null,null,50]
["7.2.49","01587 - SINAPI","Terminal de pressão – 35mm²","un",50,"",null,null,50]
["7.2.50","01588 - SINAPI","Terminal de pressão – 50mm²","un",40,"",null,null,40]
["7.2.51","01589 - SINAPI","Terminal de pressão – 70mm²","un",40,"",null,null,40]
["7.3.",null,"MATERIAL DE CONSUMO - CIVIL"]
["7.3.1","00034 - SINAPI","Aço D=10 mm CA 50","kg",1556,"",null,null,1556]
["7.3.2","00043055 - SINAPI","Aço D=12 mm CA 50","kg",1556,"",null,null,1556]
["7.3.3","00043059  - SINAPI","Aço D=5.0 mm CA 60","kg",1556,"",null,null,1556]
["7.3.4","00032 - SINAPI","Aço D=6.3 mm CA 50","kg",1556,"",null,null,1556]
["7.3.5","00033 - SINAPI","Aço D=8.0 mm CA 50","kg",1556,"",null,null,1556]
["7.3.6","00340 - SINAPI","Arame farpado nº. 16 galvanizado Simples","m",2223,"",null,null,2223]
["7.3.7","43131 - SINAPI","Arame galvanizado 8BWG, d=4,19mm","kg",240,"",null,null,240]
["7.3.8","43132 - SINAPI","Arame recozido n.º 18","kg",134,"",null,null,134]
["7.3.9","00367 - SINAPI","Areia grossa comercial, posto em obra","m³",491.7405040000001,"",null,null,491.7405040000001]
["7.3.10","00000134 - SINAPI","Argamassa para grauteamento ","kg",1112,"",null,null,1112]
["7.3.11","004729 - SINAPI","Pedra britada comercial (n.º 0 a 5)","m³",574.26389800000004,"",null,null,574.26389800000004]
["7.3.12","04513 - SINAPI","Caibro de 5x5cm ","m",1334,"",null,null,1334]
["7.3.13","001106 - SINAPI","Cal hidratada","kg",92897,"",null,null,92897]
["7.3.14","001379 - SINAPI","Cimento CPII-32","kg",226100,"",null,null,226100]
["7.3.15","001358 - SINAPI","Compensado resinado 17mm","m²",96,"",null,null,96]
["7.3.16","002692 - SINAPI","Desmoldante","l",86,"",null,null,86]
["7.3.17","020111 - SINAPI","Fita isolante adesiva antichama 19mm x 20m","un",16,"",null,null,16]
["7.3.18"," M2018 - SICRO3/PE","Gastalho 10x2,5cm","m",1334,"",null,null,1334]
["7.3.19","005076 - SINAPI","Grampo para cerca galvanizado 1 x 9","kg",96,"",null,null,96]
["7.3.20","003681 - SINAPI","Junta de dilatação (O-22 ou similar)","m",268,"",null,null,268]
["7.3.21","014077 - SINAPI","Junta de dilatação - Perfil elastomerico pre-formado em epmd, para junta de dilatacao de pisos com pouca solicitacao, 15 mm de largura, movimentacao de 11 a 19 mm","m",268,"",null,null,268]
["7.3.22","38780 - SINAPI/PE","Lâmpada fluorescente compacta, branca 20 W, base E27 (127/220 V)","un",134,"",null,null,134]
["7.3.23","038780 - SINAPI","Lâmpada fluorecente de 20W","un",134,"",null,null,134]
["7.3.24","003751 - SINAPI","Lâmpada vapor mercúrio 400 W (base E40)","un",16,"",null,null,16]
["7.3.25","003767 - SINAPI","Lixa nº120","un",40,"",null,null,40]
["7.3.26","003777 - SINAPI","Lona plástica - 4 x 100m - 12kg","m²",2400,"",null,null,2400]
["7.3.27","025865 - SINAPI","Manta termoplástica PEAD, geomembrana lisa, e=2 mm","m²",12062.8,"",null,null,12062.8]
["7.3.28","004047 - SINAPI","Massa corrida - latão 18 l","un",23,"",null,null,23]
["7.3.29","2866 - ORSE","Mastique elástico base silicone","l",1967.5750691999999,"",null,null,4126]
["7.3.30","00036799  - SINAPI","Mourão de concreto reto para cercas","un",112,"",null,null,112]
["7.3.31",null,"Perfil para fixação das geomembrana Barra de 6m ","m",134,"",null,null,134]
["7.3.32","11442 - ORSE","Pincel 1\"","un",89,"",null,null,89]
["7.3.33","005075 - SINAPI","Prego 18x30","kg",214,"",null,null,214]
["7.3.34","038390 - SINAPI","Rolo de lã de carneiro - 20cm ","un",89,"",null,null,89]
["7.3.35","038393 - SINAPI","Rolo de espuma poliéster 23 cm com cabo","un",89,"",null,null,89]
["7.3.36","012296 - SINAPI","Soquete de porcelana base E27, para uso ao tempo, para lâmpadas","un",16,"",null,null,16]
["7.3.37","00006194 - SINAPI","Tábua de madeira não aparelhada *2,5 X 15 CM (1 X 6 \") pinus, mista ou equivalente da região","m",223,"",null,null,223]
["7.3.38","005318 - SINAPI*","Thinner/águarras - 5 l","un",9,"",null,null,9]
["7.3.39","07258 - SINAPI","Tijolo comum (5,5x10x20) cm","un",10667,"",null,null,10667]
["7.3.40","00154 - SINAPI","Tinta Alcatrão de Hulha -  galão de 3,6 litros","l",9,"",null,null,9]
["7.3.41","02232/ORSE","Tinta Latex  PVA","l",221,"",null,null,221]
["7.3.42","38386 - SINAPI","Trincha de 2 \"","un",89,"",null,null,89]
["7.3.43","38400 - SINAPI","Vassourão 40cm com cabo","un",110,"",null,null,110]
["7.3.44","12001 - SINAPI","CAIXA OCTOGONAL DE FUNDO MOVEL, EM PVC, DE 4\" X 4\", PARA ELETRODUTO FLEXIVEL CORRUGADO","un",12,"",null,null,12]
["7.3.45","1872 - SINAPI","CAIXA DE PASSAGEM, EM PVC, DE 4\" X 2\", PARA ELETRODUTO FLEXIVEL CORRUGADO","un",96,"",null,null,96]
["7.3.46","2688 - SINAPI","ELETRODUTO PVC FLEXIVEL CORRUGADO, COR AMARELA, DE 25 MM","m",500,"",null,null,500]
["7.3.47","7528 - SINAPI","TOMADA 2P+T 10A, 250V, CONJUNTO MONTADO PARA EMBUTIR 4\" X 2\" (PLACA + SUPORTE + MODULO)","un",96,"",null,null,96]
["7.3.48","38062 - SINAPI","INTERRUPTOR SIMPLES 10A, 250V, CONJUNTO MONTADO PARA EMBUTIR 4\" X 2\" (PLACA + SUPORTE + MODULO)","un",12,"",null,null,12]
["7.3.49","0000345 - SINAPI","ARAME GALVANIZADO 18 BWG, D = 1,24MM (0,009 KG/M)","Kg",6.2400000000000011,"",null,null,6.2400000000000011]
["7.3.50","00003315 - SINAPI","GESSO EM PO PARA REVESTIMENTOS/MOLDURAS/SANCAS E USO GERAL","kg",248.70144000000002,"",null,null,248.70144000000002]
["7.3.51","00004812 - SINAPI","PLACA DE GESSO PARA FORRO, *60 X 60* CM, ESPESSURA DE 12 MM (SEM COLOCACAO)","m²",249.60000000000002,"",null,null,249.60000000000002]
["7.3.52","00020250 - SINAPI","SISAL EM FIBRA","Kg",1.9468800000000002,"",null,null,1.9468800000000002]
["7.3.53","00040547 - SINAPI","PARAFUSO ZINCADO, AUTOBROCANTE, FLANGEADO, 4,2 MM X 19 MM","Cento",7.6876800000000012,"",null,null,7.6876800000000012]
["7.3.54","39484 - SINAPI","KIT PORTA PRONTA DE MADEIRA, FOLHA LEVE (NBR 15930) DE 800 X 2100 MM, DE 35 MM A 40 MM DE ESPESSURA, COM MARCO EM ACO, NUCLEO COLMEIA, CAPA LISA EM HDF, ACABAMENTO MELAMINICO BRANCO (INCLUI MARCO, ALIZARES, DOBRADICAS E FECHADURA)","un",12,"",null,null,12]
["7.3.55","031443 - IOPES","JANELA DE CORRER EM ALUMINIO, 100 X 150 CM (A X L), 4 FLS, SEM BANDEIRA, ACABAMENTO ACET OU BRILHANTE, COM VIDRO, COM GUARNICAO PARA 1 FACE","m²",7.1999999999999993,"",null,null,7.1999999999999993]
[]
["7.4.",null,"MANUTENÇÃO DE CANTEIRO - ESCRITÓRIO"]
["7.4.1",null,"Taxa de manutenção de canteiros, incluindo despesas com material de expediente, material de limpeza, água, energia, comunicação, entre outras","%",1,"",null,null,12]
[]
["8.",null,"FERRAMENTAS"]
["8.1.",null,"FERRAMENTAS - MECÂNICA"]
["8.1.1",null,"Alavanca para mecânico 38,4 cm ","un",6,"",null,null,6]
["8.1.2","11240 - ORSE","Alicate de bico com isolamento para 1000V","un",9,"",null,null,9]
["8.1.3","38470 - SINAPI","Alicate de corte diagonal","um",9,"",null,null,9]
["8.1.4","38471 - SINAPI","Alicate para anéis externo pontas retas","un",9,"",null,null,9]
["8.1.5","38471 - SINAPI","Alicate para anéis externos ponta curva 90°","un",9,"",null,null,9]
["8.1.6","38471 - SINAPI","Alicate para anéis internos","un",9,"",null,null,9]
["8.1.7",null,"Alicate de pressão modelo curvo reto, 10\", 250mm","un",9,"",null,null,9]
["8.1.8","11240 - ORSE","Alicate universal, 8\", com isolação 1000 V","un",9,"",null,null,9]
["8.1.9","10585 - ORSE","Arco de Serra manual (com serra)","un",6,"",null,null,6]
["8.1.10",null,"Cabo de força T com encaixe de ½”, ¾” e 1” para soquetes ","un",6,"",null,null,6]
["8.1.11","5090 - SINAPI","Cadeado 30mm","un",9,"",null,null,9]
["8.1.12","00425 - ORSE","Cadeado 40mm","un",9,"",null,null,9]
["8.1.13",null,"Calibrador de folgas de 0,03 mm - 0,50 mm 17 Lâminas (Jogo)","un",6,"",null,null,6]
["8.1.14",null,"Canivete sem ponta inox com lâmina larga","un",9,"",null,null,9]
["8.1.15",null,"Chave ajustável oxidada n.º 08","un",9,"",null,null,9]
["8.1.16",null,"Chave combinada 1\" x 5/16\"","un",9,"",null,null,9]
["8.1.17",null,"Chave combinada 22 mm","un",9,"",null,null,9]
["8.1.18",null,"Chave combinada n.º 5/16\"","un",9,"",null,null,9]
["8.1.19",null,"Chave cruzada 8 x 150","un",9,"",null,null,9]
["8.1.20",null,"Chave de boca 3/4\" x 25/32\"","un",9,"",null,null,9]
["8.1.21",null,"Chave de boca 5/16\" x 1/4\"","un",9,"",null,null,9]
["8.1.22",null,"Chave de fenda 1/4x10","un",9,"",null,null,9]
["8.1.23",null,"Chave de fenda 1/8x3","un",9,"",null,null,9]
["8.1.24",null,"Chave de fenda 3/16x6","un",9,"",null,null,9]
["8.1.25",null,"Chave de fenda 3/8x10","un",9,"",null,null,9]
["8.1.26",null,"Chave de fenda 8x150","un",9,"",null,null,9]
["8.1.27",null,"Chave de fenda cruzada (Philips) 1/4\" x 1. 1/2\"","un",9,"",null,null,9]
["8.1.28",null,"Chave de fenda tipo toco 1/4\" x 1. 1/2\"","un",9,"",null,null,9]
["8.1.29",null,"Chave grifo americana n.º 8 200mm","un",6,"",null,null,6]
["8.1.30",null,"Chave grifo americana n.º 18 450mm","un",6,"",null,null,6]
["8.1.31",null,"Chave Philips","un",9,"",null,null,9]
["8.1.32",null,"Chave soquete tipo canhão 1/2\"","un",3,"",null,null,3]
["8.1.33",null,"Chave soquete tipo canhão 1/4\"","un",3,"",null,null,3]
["8.1.34",null,"Chave soquete tipo canhão 11/32\"","un",3,"",null,null,3]
["8.1.35",null,"Chave soquete tipo canhão 3/8\"","un",3,"",null,null,3]
["8.1.36",null,"Chave soquete tipo canhão 7/16\"","un",3,"",null,null,3]
["8.1.37",null,"Chave soquete tipo canhão 9/16\"","un",3,"",null,null,3]
["8.1.38","12 - SINAPI","Escova de aço, com cabo, *4 X 15* fileiras de cerdas","un",3,"",null,null,3]
["8.1.39","04725 - ORSE","Espátula n.º 38A-23","un",9,"",null,null,9]
["8.1.40","38380 - SINAPI","Esquadro Profissional 12\" (em aço)","un",6,"",null,null,6]
["8.1.41",null,"Extensão elétrica 20m 2x2,50mm com carretel","un",6,"",null,null,6]
["8.1.42",null,"Faca reta desencapadora com isolamento para 1000V","un",9,"",null,null,9]
["8.1.43",null,"Funil para troca de óleo","un",6,"",null,null,6]
["8.1.44",null,"Jogo de broca de aço de 6 a 19mm (concreto parede)","un",9,"",null,null,9]
["8.1.45",null,"Jogo de soquete Estriado de 1/2 Pol. Com 22 peças ","un",6,"",null,null,6]
["8.1.46",null,"Jogo de chave combinada de nº 6 a nº 50","un",9,"",null,null,9]
["8.1.47",null,"Jogo de chave hexagonal (Allen) em polegada","un",9,"",null,null,9]
["8.1.48",null,"Jogo de chave hexagonal (Allen) nº 03 a 17mm","un",9,"",null,null,9]
["8.1.49",null,"Jogo de chave Phillips com isolamento para 1000V","un",9,"",null,null,9]
["8.1.50",null,"Jogo de chave soquete 22 mm a 50 mm","un",6,"",null,null,6]
["8.1.51",null,"Jogo de chaves de fenda com isolamento para 1000V","un",9,"",null,null,9]
["8.1.52",null,"Jogo para Reparo de Rosca Postiça Master M5xM12","un",6,"",null,null,6]
["8.1.53","11400/ORSE","Lanterna grande - 10 Million","un",6,"",null,null,6]
["8.1.54","10592/ORSE","Lima chata paralela murça 6\"","un",9,"",null,null,9]
["8.1.55","J040001106/EMBASA","Lima paralela bastarda 6\"","un",9,"",null,null,9]
["8.1.56",null,"Lima redonda murça 6\"","un",9,"",null,null,9]
["8.1.57",null,"Kit Estojo de Limas Murça 19 peças","un",9,"",null,null,9]
["8.1.58",null,"Mala de ferramenta com 05 gavetas","un",9,"",null,null,9]
["8.1.59","4729 - ORSE","Marreta 1kg","un",9,"",null,null,9]
["8.1.60","J02000073/EMBASA","Marreta 2 kg com cabo de fibra","un",6,"",null,null,6]
["8.1.61","J020000076/EMBASA","Marreta de 5kg com cabo de madeira","un",6,"",null,null,6]
["8.1.62","J030000145/EMBASA","Martelo bola  1kg cabo em madeira ","un",9,"",null,null,9]
["8.1.63","11265/ORSE","Martelo de borracha 32 Cm","un",9,"",null,null,9]
["8.1.64",null,"Nível a laser com base magnética e tripé","un",6,"",null,null,6]
["8.1.65",null,"Nível de mão – metálico e magnético","un",6,"",null,null,6]
["8.1.66",null,"Pe De Cabra, 900 Mm, Sextavado, Pintado","un",6,"",null,null,6]
["8.1.67","38377 - SINAPI","Prumo de centro","un",6,"",null,null,6]
["8.1.68",null,"Punção de centro 100 x 4 mm","un",9,"",null,null,9]
["8.1.69",null,"Punção de centro 150 x 6 mm","un",9,"",null,null,9]
["8.1.70","J030000058/EMBASA","CONJUNTO DE SACA-PINOS","un",9,"",null,null,9]
["8.1.71",null,"Saca pino 08mm","un",9,"",null,null,9]
["8.1.72",null,"Saca pino 17 mm","un",9,"",null,null,9]
["8.1.73",null,"Saca pino paralelo 150x4","un",9,"",null,null,9]
["8.1.74",null,"Saca pino paralelo 150x6","un",9,"",null,null,9]
["8.1.75",null,"Saca pino paralelo 150x8","un",9,"",null,null,9]
["8.1.76",null,"Saca polia 10\"","un",3,"",null,null,3]
["8.1.77",null,"Soquete Sextavado Quadra 1\" 65 mm","un",3,"",null,null,3]
["8.1.78",null,"Soquete Sextavado Quadra 1\" 70 mm","un",3,"",null,null,3]
["8.1.79",null,"Soquete Sextavado Quadra 1\" 75/55 mm","un",3,"",null,null,3]
["8.1.80","11271/ORSE","Talhadeira De Aço Com Empunhadura De Proteção 10''","un",9,"",null,null,9]
["8.1.81",null,"Torquímetro de estalo 50 - 400 N.m","un",3,"",null,null,3]
["8.1.82",null,"Trena Metálica 8 m","un",6,"",null,null,6]
["8.2.",null,"FERRAMENTAS - ELÉTRICA"]
["8.2.1",null,"Adaptador universal de tomadas","un",46,"",null,null,46]
["8.2.2",null,"Alavanca reta, 1,75 m","un",10,"",null,null,10]
["8.2.3",null,"Alicate bico chato/pato, 6\"","un",13,"",null,null,13]
["8.2.4","38470 - SINAPI","Alicate cortador de cabos diagonal, 6\"","un",23,"",null,null,23]
["8.2.5",null,"Alicate cortador de cabos frontal, 6\"","un",13,"",null,null,13]
["8.2.6",null,"Alicate/Tesoura cortador manual de cabos de até 300mm², 225mm","un",13,"",null,null,13]
["8.2.7","38547 - SINAPI","Alicate crimpador, RJ-11/RJ-45, 200mm","un",2,"",null,null,2]
["8.2.8","38547 - SINAPI","Alicate crimpador,  RG-59 e RG-6, 130mm","un",2,"",null,null,2]
["8.2.9","11272 - ORSE","Alicate crimpador para terminais 1,0 a 10mm², 220mm","un",13,"",null,null,13]
["8.2.10","11272 - ORSE","Alicate crimpador para terminais 10 a 120mm², 620mm","un",1,"",null,null,1]
["8.2.11","11272 - ORSE","Alicate crimpador 11\", 280mm","un",2,"",null,null,2]
["8.2.12",null,"Alicate crimpador, hidráulico, prensa terminal,  com matriz de 10 a 300mm²","un",1,"",null,null,1]
["8.2.13","11275 - ORSE","Alicate de pressão, 10\", 250mm","un",13,"",null,null,13]
["8.2.14","11240 - ORSE","Alicate profissional universal, 8\". Material: Cromo Vanadium","un",13,"",null,null,13]
["8.2.15","11240 - ORSE","Alicate universal, 8\", com isolação 1000 V","un",10,"",null,null,10]
["8.2.16","10585 - ORSE","Arco de Serra manual (com serra)","un",23,"",null,null,23]
["8.2.17",null,"Aspirador de Pó / Liquidos 2 Motores de 1200W 220V AA280 ","un",2,"",null,null,2]
["8.2.18",null,"Bastão isolante universal Ø 38 mm, 6 m, com 2 cabeçotes","un",2,"",null,null,2]
["8.2.19",null,"Bastão de resgate - 35 kV, 220 mm","un",2,"",null,null,2]
["8.2.20",null,"Chave de boca ajustável 8\"","un",10,"",null,null,10]
["8.2.21",null,"Chave de boca ajustável 12\"","un",10,"",null,null,10]
["8.2.22",null,"Chave de boca ajustável 18\"","un",10,"",null,null,27]
["8.2.23","00425 - ORSE","Cadeado 40mm","un",27,"",null,null,6]
["8.2.24",null,"Caixa de ferramentas para eletricista NR10 com 34 peças - Equipes de Manutenção","un",6,"",null,null,6]
["8.2.25",null,"Caixa de ferramentas para eletricista NR10 com 34 peças para operadores EB","un",6,"",null,null,2]
["8.2.26",null,"Caixa de ferramentas com 40 peças (Para técnicos de automação e telecom)","un",2,"",null,null,13]
["8.2.27",null,"Caixa de ferramentas tipo sanfonada, confeccionada  em chapa de aço, com rodas e puxador","un",13,"",null,null,2]
["8.2.28",null,"Câmera fotográfica digital 20MP, 5x Zoom Óptico","un",2,"",null,null,10]
["8.2.29",null,"Chave com catraca 4 bocas 8x9x10x11 mm (Ref. 44637101 ou similar)","un",10,"",null,null,2]
["8.2.30",null,"Conjunto de aterramento rápido e temporário para cubículos até 35kV","un",2,"",null,null,2]
["8.2.31",null,"Conjunto de aterramento rápido e temporário para redes isoladas até 1kV","un",2,"",null,null,2]
["8.2.32",null,"Conjunto de aterramento temporário até 15 kV","un",2,"",null,null,10]
["8.2.33",null,"Conjunto de chaves básicas para eletricista com 06 peças","un",10,"",null,null,23]
["8.2.34",null,"Detector de Tensão por contato 1kV","un",15,"",null,null,13]
["8.2.35",null,"Detector unipolar de tensão por aproximação - 10 KV","un",5,"",null,null,10]
["8.2.36",null,"Encerado de lona (3x2 m)","un",5,"",null,null,10]
["8.2.37","38477/SINAPI","Escada perfil \"U\" de fibra de vidro extensiva - altura esticada 8,40 m - 15 kV","un",5,"",null,null,2]
["8.2.38","Banco de Preços (Pregão Eletrônico - FUND.P/CONSERV.PROD.FLORESTAL DO EST.SP\nGOVERNO DO ESTADO DE SÃO PAULO), 04/2022","Escada de fibra de vidro tipo \"A\" - 10 degraus","un",2,"",null,null,10]
["8.2.39","12 - SINAPI","Escova com cerdas de aço para condutores","un",10,"",null,null,10]
["8.2.40",null,"Ferramenta universal para bastão de manobra - Cabeçote para grampo de aterramento","un",2,"",null,null,2]
["8.2.41",null,"Fumigador para apicultura","un",10,"",null,null,10]
["8.2.42","11248/ORSE","Furadeira elétrica de impacto 1/2\" Ø 13mm, 800W, 1050 A, 2800 rpm e 220V","un",10,"",null,null,3]
["8.2.43","Licitação - Banco de preços (SECRETARIA DA SEGURANCA PUBLICA\nSãO PAULO-06/2022)","Jogo de chave canhão com 12 unidades","un",10,"",null,null,10]
["8.2.44",null,"Jogo de chave combinada com 16 unidades (sextavado/boca fixa) de 1/4\" a 1.1/4\" (6,35 mm a 31,75 mm)","un",10,"",null,null,10]
["8.2.45",null,"Jogo de soquetes estriado com encaixe 1/2\" com 38 soquetes - 10-32mmn","un",10,"",null,null,2]
["8.2.46",null,"Jogo de chaves biela 12 peças tipo L 8 a 19mm","un",10,"",null,null,10]
["8.2.47",null,"Jogo de chave de fenda e philips com haste protegida para eletricista com 07 peças","un",10,"",null,null,2]
["8.2.48",null,"Kit de reparo eletrônico (ferro de solda, sugador de placa de circuito impresso, componentes sobressalentes)","un",2,"",null,null,2]
["8.2.49",null,"Kit ferramenta fibra óptica (clivador +alicate decapador + alicate stripper + bolsa + 2 chaves allen + recipiente para álcool + guia) + Medidor de potência para fibra óptica (Power Meter Medidor Potência Fibra Óptica + Caneta Laser 10W)","un",2,"",null,null,2]
["8.2.50",null,"Kit ferramentas telecom ( tipo TRAMONTINA PRO 44970053 ou similar)","un",2,"",null,null,10]
["8.2.51","11396 - ORSE","Lanterna tática grande - 5.500.000 lumens","un",10,"",null,null,1]
["8.2.52","10592/ORSE","Lima chata murça 8\" com cabo","un",1,"",null,null,1]
["8.2.53","J040001106/EMBASA","Lima chata bastarda 10\"","un",1,"",null,null,13]
["8.2.54","036147/SINAPI","Luva isolante classe 00 - 2,5kV","un",13,"",null,null,13]
["8.2.55","\tB.07.000.049767/CPOS","Luva isolante classe 3 - 30kV","un",13,"",null,null,10]
["8.2.56","J020000076/EMBASA","Marreta de 5kg com cabo de madeira","un",10,"",null,null,1]
["8.2.57",null,"Martelete Perfurador/Rompedor Profissional 220V, 800W, 870 RPM","un",1,"",null,null,10]
["8.2.58","J030000145/EMBASA","Martelo-bola 1kg com cabo de madeira","un",10,"",null,null,10]
["8.2.59","11244/ORSE","Martelo universal (de unha) 25mm com cabo de madeira","un",10,"",null,null,1]
["8.2.60","31.41.36/SUDECAP","Pá-de-bico com cabo de madeira","un",10,"",null,null,10]
["8.2.61","11248/ORSE","Parafusadeira/Furadeira elétrica com fio - 220V, 400W","un",10,"",null,null,2]
["8.2.62",null,"Punho saca fusível NH tamanho 000 a 4, 1kV","un",10,"",null,null,2]
["8.2.63",null,"Soprador Costal 2T 59,2CC à Gasolina","un",2,"",null,null,1]
["8.2.64",null,"Soprador térmico 2000W, 220V","un",1,"",null,null,1]
["8.2.65","I2587/SEINFRA","Talha manual Tirfor 1.600kgf/cm² com alavanca","un",1,"",null,null,6]
["8.2.66",null,"Testador de bastão de manobra para isolador","un",1,"",null,null,2]
["8.2.67",null,"Teste de Bateria Digital com Impressora Térmica Embutida","un",6,""]
["8.2.68",null,"Testador Teste Crimpagem Cabo Rede Lan Rj45 Rj11","un",2,""]
[]
["8.3.",null,"FERRAMENTAS - CIVIL"]
["8.3.1",null," Alavanca sextavada ponta pá curva para construção civil","un",29,"",null,null,59]
["8.3.2",null," Ansinho curvo robusto 12 dentes com cabo de madeira","un",29,"",null,null,59]
["8.3.3","10585 - ORSE","Arco de Serra manual (com serra)","un",12,"",null,null,12]
["8.3.4","10 - SINAPI"," Balde 10 l ","un",57,"",null,null,118]
["8.3.5",null,"Binóculo Profissional Ampliação 8 à 24x 50mm","un",10,"",null,null,10]
["8.3.6",null,"Câmera fotográfica digital 20MP, 5x Zoom Óptico","un",6,"",null,null,6]
["8.3.7",null," Carrinho para transporte de motor de popa até 40 Hp","un",12,"",null,null,12]
["8.3.8","2711 - SINAPI"," Carro de mão ","un",114,"",null,null,236]
["8.3.9",null," Cavador articulado com cabo de madeira 110cm","un",29,"",null,null,59]
["8.3.10",null," Chibanca metálica com cabo de madeira","un",100,"",null,null,207]
["8.3.11","J040001052/EMBASA"," Colher de pedreiro nº 9 ","un",2,"",null,null,7]
["8.3.12",null," Conjunto de ferramentas básicas para encanador ","un",3,"",null,null,3]
["8.3.13",null," Conjunto de ferramentas básicas para pedreiro ","un",2,"",null,null,7]
["8.3.14","38200/COMPESA"," Corda de bombeiro semi estática em nylon trançado (rolo de 100 m) ","un",5,"",null,null,9]
["8.3.15",null," Desempenadeira de aço dentada ","un",5,"",null,null,9]
["8.3.16","4174/ORSE"," Desempenadeira de aço lisa ","un",5,"",null,null,9]
["8.3.17","M0076/SICRO3"," Disco corte abrasivo 18\" para aço 178x1,6x22,2mm","un",3,"",null,null,6]
["8.3.18","38403 - SINAPI"," Enxada estreita de 240 x 230 mm, sem cabo ","un",100,"",null,null,207]
["8.3.19","38477 - SINAPI"," Escada articulada multifuncional 16 degraus ","un",7,"",null,null,12]
["8.3.20","12 - SINAPI","Escova de aco, com cabo, *4 x 15* fileiras de cerdas ","un",7,"",null,null,12]
["8.3.21","38367 - SINAPI","Espátula aço inox, 8cm - cabo de madeira ","un",7,"",null,null,12]
["8.3.22","38368 - SINAPI","Espátula de plástico lisa, largura 10 cm ","un",7,"",null,null,12]
["8.3.23","D249722458/EMBASA"," Esponja de limpeza ","un",60,"",null,null,105]
["8.3.24","38380 - SINAPI","Esquadro 90º x 30cm (12\") ","un",3,"",null,null,6]
["8.3.25","J020000046/EMBASA"," Estrovenga com cabo de madeira","un",100,"",null,null,207]
["8.3.26",null,"Facão para mato, 18 pol","un",102,"",null,null,211]
["8.3.27","J020000052/EMBASA","Foice 33mm com cabo de madeira","un",102,"",null,null,211]
["8.3.28",null," Fumigador para apicultura ","un",14,"",null,null,30]
["8.3.29","11400/ORSE"," Lanterna grande - 10 Million ","un",12,"",null,null,12]
["8.3.30","J020000061/EMBASA"," Machado lâmica 3,5 cabo de madeira 90 cm","un",43,"",null,null,89]
["8.3.31","M2462/SICRO"," Mangueira de ¾ 50 MTS ","un",9,"",null,null,15]
["8.3.32","00037458/SINAPI"," Mangueira de nível 5/16x1,3mm","un",10,"",null,null,18]
["8.3.33","11269 - ORSE"," Marreta de 1/2 kg com cabo ","un",11,"",null,null,24]
["8.3.34","J020000073/EMBASA"," Marreta oitavada de 2kg com cabo de madeira","un",11,"",null,null,24]
["8.3.35","J020000076/EMBASA","Marreta de 5kg com cabo de madeira","un",11,"",null,null,24]
["8.3.36","11244/ORSE"," Martelo com unha 25mm","un",11,"",null,null,24]
["8.3.37","11265/ORSE"," Martelo de borracha 32 Cm","un",3,"",null,null,5]
["8.3.38",null," Nível c/ bolha ajustável de inclinação, bolha fixa e prumo – 250mm ","un",3,"",null,null,5]
["8.3.39","10789/ORSE"," Nível de bolha de madeira ","un",3,"",null,null,5]
["8.3.40","10788/ORSE"," Pá quadrada com cabo de madeira","un",100,"",null,null,207]
["8.3.41",null," Pé-de-cabra 3/4x60cm","un",29,"",null,null,59]
["8.3.42","830101/IOPES"," Picareta 4 libras com cabo 90 cm","un",100,"",null,null,207]
["8.3.43","038394/SINAPI"," Pistola para pintura pulverizadora 1L","un",3,"",null,null,5]
["8.3.44","4720/ORSE"," Ponteiro de aço liso 3/4","un",29,"",null,null,59]
["8.3.45","38377 - SINAPI"," Prumo de centro ","un",3,"",null,null,5]
["8.3.46","38376 - SINAPI"," Prumo de parede ","un",3,"",null,null,5]
["8.3.47","31.42.17/SUDECAP"," Rastelo (ASG) de plástico com cabo","un",29,"",null,null,59]
["8.3.48","8606/ORSE","Refletor redondo em alumínio anodizado para lâmpada vapor de mercúrio/sódio, corpo em aluminio com pintura epoxi, para lâmpada E-27 de 300 W, com suporte redondo e alça regulável para fixação. ","un",30,"",null,null,30]
["8.3.49",null," Régua de alumínio - 2,00m ","un",3,"",null,null,5]
["8.3.50","10577/ORSE"," Serrote madeira 40cm ","un",11,"",null,null,24]
["8.3.51","4728/ORSE"," Talhadeira de aço chato 10\" ","un",29,"",null,null,59]
["8.3.52",null," Torqueza 8\"","un",15,"",null,null,15]
["8.3.53","078296/SBC","Trena Metálica 8 m","un",20,"",null,null,20]
["8.3.54","83.25.53/SUDECAP"," Trena de Fita 20m ","un",3,"",null,null,3]
["8.3.55","F099703003/EMBASA"," Trena de Fita 50m ","un",3,"",null,null,3]
[]
["9.",null,"EQUIPAMENTOS"]
["9.1.",null,"EQUIPAMENTOS - MECÂNICA"]
["9.1.1","COT_AFER","Aferidor de manômetro de 0 a 150 bar ","un x mês",6,"",null,null,12]
["9.1.2","COT_ALMO_FLEX","Almotolia de bico flexível 500ml","un x mês",18,"",null,null,36]
["9.1.3","COT_ALMO_RIG","Almotolia de bico rígido 500ml","un x mês",18,"",null,null,36]
["9.1.4","\t4154/ORSE","Andaime metálico tipo fachadeiro Dim: Largura= 1,20m / Altura por peça= 2,00m. (Altura Total=10m - 5 peças por conjunto)","m² x mês",864,"",null,null,1728]
["9.1.5","COT_BANC_OFIC","Bancada para oficina (Dim: 1,2m x 2,5m) ","un x mês",36,"",null,null,72]
["9.1.6","COT_BOMB_GRAX","Bomba de graxa manual 5kg ","un x mês",18,"",null,null,36]
["9.1.7","13914 - SINAPI/PE","Talha Manual de Corrente com Alavanca 1,5 t Elevação 1,5m (Catraca 1,5 ton) ","un x mês",6,"",null,null,12]
["9.1.8","COT_CHAV_46","Chave de impacto 46mm boca/estria ","un x mês",12,"",null,null,24]
["9.1.9","COT_CHAV_55","Chave de impacto 55mm boca/estria ","un x mês",12,"",null,null,24]
["9.1.10","COT_CHAV_60","Chave de impacto 60mm boca/estria ","un x mês",12,"",null,null,24]
["9.1.11","COT_CHAV_65","Chave de impacto 65mm boca/estria ","un x mês",12,"",null,null,24]
["9.1.12","COT_CHAV_70","Chave de impacto 70mm boca/estria ","un x mês",12,"",null,null,24]
["9.1.13","COT_CHAV_75","Chave de impacto 75mm boca/estria","un x mês",24,"",null,null,48]
["9.1.14","COT_CHAV_85","Chave de impacto 85mm boca/estria","un x mês",24,"",null,null,48]
["9.1.15","COT_CINT_3T","Cinta para elevação de carga (comprimento: 3m / capacidade de carga: 3t)","un x mês",12,"",null,null,24]
["9.1.16","COT_CINT_20T","Cinta para elevação de carga  (comprimento: 6m / capacidade de carga: 20t)","un x mês",12,"",null,null,24]
["9.1.17","COT_CORT","Cortador a frio para tubos - Cortador Tubo Ferro Ferrari 1/8\" - 2\"","un x mês",12,"",null,null,24]
["9.1.18","COT_CURV","Curvador de tubos (Até 1”) - Curvador e Dobrador De Tubos Manual","un x mês",12,"",null,null,24]
["9.1.19","38476 - SINAPI/PE","Escada de abrir com 2 x 8 degraus (2,40m) em alumínio ","un x mês",24,"",null,null,48]
["9.1.20","38477 - SINAPI/PE","Escada de marinheiro extensível em duraluníno com 10 x 20 degraus (3,00m / 6,00m) ","un x mês",18,"",null,null,36]
["9.1.21","COT_ESCA_07","Escada metálica de 07 degraus ","un x mês",18,"",null,null,36]
["9.1.22","COT_ESCA_16","Escada articulada multifuncional 4x4 16 degraus","un x mês",6,"",null,null,12]
["9.1.23","COT_ESME","Esmerilhadeira angular de 4 ½” ","un x mês",12,"",null,null,24]
["9.1.24","11359 - SINAPI/PE","Esmerilhadeira angular de 7” ","un x mês",12,"",null,null,24]
["9.1.25","I9376 - SEINFRA/CE","Furadeira Manual 650W 1050 – 1450 RPM 220V Ø 13mm","un x mês",12,"",null,null,24]
["9.1.26","COT_INDU","Indutor elétrico para aquecimento de rolamentos (JM 500) ","un x mês",6,"",null,null,24]
["9.1.27","COT_LIXA","Lixadeira 4 1/2\" ","un x mês",12,"",null,null,24]
["9.1.28","COT_MACA_20T","Macaco de comando a distância 20 t - Macaco Hidráulico 20 Toneladas Tipo Garrafa","un x mês",12,"",null,null,24]
["9.1.29","COT_MACA_50T","Macaco de comando a distância 50 t - Macaco Hidráulico 50 Toneladas Tipo Garrafa","un x mês",12,"",null,null,24]
["9.1.30","COT_MACA_2T","Macaco tipo elevador capacidade de 2 t - Macaco Hidráulico 2 Toneladas tipo Garrafa","un x mês",12,"",null,null,24]
["9.1.31","COT_MACA_GIR","Macaco tipo girafa de 2 t - Guincho Hidráulico 2 Toneladas com Prolongador","un x mês",12,"",null,null,24]
["9.1.32","40403 - SINAPI/PE","Máquina de solda elétrica de 250 A com kit.","un x mês",12,"",null,null,72]
["9.1.33","COT_MORS","Morsa para bancada nº 08 ","un x mês",36,"",null,null,12]
["9.1.34","E9630-DNIT/PE","Conjunto Motor bomba 7,5 CV, 380 V, Q=75,6 m3/h e H=17 mca. (Poço de rebaixamento da EBV-3)","un x mês",6,"",null,null,12]
["9.1.35","COT_BOMB_SUB","Bomba Submersível 5 Cv Trifásica 380V, Q=2 - 52 m3/h e H= 3-25 mca.(Poço de rebaixamento do Res. de areias (Estrutura de Controle)","un x mês",6,"",null,null,72]
["9.1.36","COT_MOTO_ESMER","Motoesmeril de 1cv - 3.500 RPM ","un x mês",36,"",null,null,12]
["9.1.37","COT_MULT","Multiplicador de Torque Manual 2700 N.m/2000 lb.ft CDI GA190","un x mês",6,"",null,null,12]
["9.1.38","E9552 - DNIT/PE","Nível de precisão  ","un x mês",6,"",null,null,24]
["9.1.39","COT_PARA","Parafusadeira elétrica a bateria ","un x mês",12,"",null,null,24]
["9.1.40","COT_PREN","Prensa hidráulica de 10 ton ","un x mês",12,"",null,null,24]
["9.1.41","E9207-DNIT/PE","Retífica elétrica ","un x mês",12,"",null,null,12]
["9.1.42","E9748-DNIT/PE","Rosqueadeira ( para tubos de ½” a 4”) -Rosqueadeira Elétrica 1/2 A 4 Pol. 750w 220v-Br Motors-Brr124bsp","un x mês",6,"",null,null,24]
["9.1.43","10740 - SINAPI/PE","Talha capacidade 3t","un x mês",12,"",null,null,24]
["9.1.44","COT_TIFO","Tifor 3t","un x mês",12,""]
[]
["9.2.",null,"EQUIPAMENTOS - ELÉTRICA"]
["9.2.1","COT_ANAL","Analisador de grandezas elétricas trifásico, display LCD colorido 5,6\", TRMS 1.000 V, corrente 3.000A ","un x mês",6,"",null,null,12]
["9.2.2","COT_BANC_TESTE","Bancada de teste, amperimetro 150A, voltímetro 40V ","un x mês",6,"",null,null,12]
["9.2.3","COT_BANC_PROT","Bancada protegida contra eletricidade estática ","un x mês",6,"",null,null,12]
["9.2.4","COT_DATA","Data Logger de 4 a 20 mA (verificação de intermitência em instrumentação) ","un x mês",6,"",null,null,12]
["9.2.5","13761 - SINAPI/PE","Estação de solda com temperatura ajustável e proteção antiestático ","un x mês",6,"",null,null,12]
["9.2.6","10236 - ORSE/SE","Fonte de alimentação com tensão variável de 0 a 30Vcc de 3 A ","un x mês",6,"",null,null,12]
["9.2.7","COT_FONT","Fonte de bancada 12 V ","un x mês",6,"",null,null,12]
["9.2.8","I9376 - SEINFRA/CE","Furadeira Manual 650W 1050 – 1450 RPM 220V Ø 13mm","un x mês",6,"",null,null,12]
["9.2.9","COT_GERA","Gerador de corrente e tensão de 0 a 20 mA e 0 a 10V, precisão de 0,1% ","un x mês",6,"",null,null,12]
["9.2.10","COT_TTR ","TTR - medidor digital de relação de espiras, escala de medição 0,8000:1 a 8.000,0: 1 ","un x mês",6,"",null,null,12]
["9.3.",null,"EQUIPAMENTOS - CIVIL"]
["9.3.1","E9630-DNIT/PE","Bomba submersível com capacidade de 75 m³/h - 3,6 kW","un x mês",12,"",null,null,24]
["9.3.2","\t4154/ORSE","Andaime metálico tipo fachadeiro Dim: Largura= 1,20m / Altura por peça= 2,00m. (Altura Total=10m - 5 peças por conjunto)","m² x mês",432,"",null,null,1728]
["9.3.3","E9519 - DNIT/PE","Betoneira com motor a gasolina com capacidade de 600 l - 10 kW","un x mês",12,"",null,null,36]
["9.3.4","746 - SINAPI/PE","Lavadora de alta pressão a diesel, partida elétrica, motor de 10 hp","un x mês",6,"",null,null,12]
["9.3.5","36503 - SINAPI/PE","MOTOBOMBA TRASH (PARA AGUA SUJA) AUTO ESCORVANTE, MOTOR GASOLINA DE 6,41 HP, DIAMETROS DE SUCCAO X RECALQUE: 3\" X 3\", HM/Q: 10/60 A 23/0","un x mês",12,"",null,null,24]
["9.3.6","E9630-DNIT/PE","Bomba submersível com capacidade de 75 m³/h - 3,6 kW","un x mês",12,"",null,null,48]
["9.3.7","E9579-DNIT/PE","CAMINHÃO BASCULANTE 10 M3, TRUCADO CABINE SIMPLES, PESO BRUTO TOTAL 23.000 KG, CARGA ÚTIL MÁXIMA 15.935 KG, DISTÂNCIA ENTRE EIXOS 4,80 M, POTÊNCIA 230 CV INCLUSIVE CAÇAMBA METÁLICA ","un x mês",24,"",null,null,72]
["9.3.8","E9592-DNIT/PE","CAMINHÃO TRUCADO (C/ TERCEIRO EIXO) ELETRÔNICO - POTÊNCIA 231CV - PBT = 22000KG - DIST. ENTRE EIXOS 5170 MM - INCLUI CARROCERIA FIXA ABERTA DE MADEIRA","un x mês",24,"",null,null,72]
["9.3.9","E9509-DNIT/PE","Caminhão Comboio para lubrificação e abastecimento (melosa), convencional totalmente equipado (Capacidade de Combustível: 5.000 l, Capacidade de Lubrificante: 500 l, Capacidade de Graxa: 200 kg, Capacidade de Água: 300 l, Recipiente para Óleo Usado: 200 l, Compressor de Ar e Bomba- d’agua).","un x mês",6,"",null,null,12]
["9.3.10","E9686-DNIT/PE","Caminhão guindauto com capacidade de carga até 10,0 t.","un x mês",12,"",null,null,36]
["9.3.11","6259 - SINAPI/PE","Caminhão tanque, capacidade de volume  6000 l e potência 136,0 hp .","un x mês",30,"",null,null,36]
["9.3.12","89883-SINAPI/PE","Cavalo Mecânico com Reboque M. Benz Randon LS-1634/45 29,5 t, ou similar","un x mês",6,"",null,null,12]
["9.3.13","E9107-DNIT/PE","Compactador de solo a percussão (soquete), com motor gasolina de 4 tempos, peso entre 55 e 65 kg, força de impacto de 1.000 a 1.500 kgf, frequência de 600 a 700 golpes por minuto,velocidade de trabalho entre 10 e 15 m/min, potência entre 2 e 3 hp.","un x mês",6,"",null,null,108]
["9.3.14","E9556-DNIT/PE","Compactador de solo, tipo placa vibratória reversível, com motor a diesel, peso entre 700 e 820 kg, força centrífuga entre 6.200 e 10.000 kgf, largura de trabalho entre 650 e 720 mm, frequência de vibração entre 3.000 e 3.500 rpm, velocidade de trabalho entre 25 e 30 m/min, potência entre 13,0 e 15,0 hp.","un x mês",6,"",null,null,60]
["9.3.15","E9513-DNIT/PE","Compressor de ar rebocável, vazão 400 pcm, pressão efetiva de trabalho 102 psi, motor diesel, potência 110 cv.","un x mês",3,"",null,null,12]
["9.3.16","COT_CONJ_30","Conjunto motorbomba com 30 kW de potência no motor elétrico (25 mca x 0,1 m³/s) para esgotamento, com respectivos mangotes de sucção e descarga a serem especificados em função dos diâmetros. ","un x mês",3,"",null,null,12]
["9.3.17","36483 - SINAPI/PE","ESCAVADEIRA HIDRAULICA SOBRE ESTEIRAS CACAMBA 0,40 A 1,20 M3, PESO OPERACIONAL 21,19 T, POTENCIA LIQUIDA 173 HP","un x mês",6,"",null,null,24]
["9.3.18","E9066-DNIT/PE","Grupo gerador de 13/14 KVA, 220v, trifásico, silenciado, com 100 metros de cabos e 01 QTA. ","un x mês",6,"",null,null,12]
["9.3.19","E9776 - DNIT/PE","Grupo gerador de 145/160 kVA","un x mês",6,"",null,null,24]
["9.3.20","E9778 - DNIT/PE","Grupo gerador de 310/340 kVA","un x mês",6,"",null,null,36]
["9.3.21","E9535 - DNIT/PE","Serra circular de bancada, modelo pica-pau, diâmetro de 350 mm. Características do motor: trifásico, potência de 5 hp, frequência de 60 H.","un x mês",12,"",null,null,36]
["9.3.22","40403 - SINAPI/PE","Máquina de solda elétrica de 250 A com kit.","un x mês",12,"",null,null,36]
["9.3.23","E9568-DNIT/PE","Furadeira elétrica profissional.","un x mês",12,"",null,null,36]
["9.3.24","13192 - SINAPI/PE","Lixadeira elétrica angular para concreto, potência 1.400 W, prato diamantado de 5''.","un x mês",12,"",null,null,36]
["9.3.25","14619 - SINAPI/PE","Máquina para corte com disco abrasivo de diâmetro de 18'' (450 mm), com motor elétrico trifásico de 10 cv.","un x mês",12,"",null,null,36]
["9.3.26","40703 - SINAPI/PE","Martelete rompedor 33 kg.","un x mês",6,"",null,null,24]
["9.3.27","36533 - SINAPI/PE","Martelo demolidor pneumático manual, com redução de vibração, peso de 31,5 kg.","un x mês",12,"",null,null,24]
["9.3.28","13227 - SINAPI/PE","MOTONIVELADORA POTENCIA BASICA LIQUIDA (PRIMEIRA MARCHA) 171 HP, PESO BRUTO 14768 KG, LARGURA DA LAMINA DE 3,7 M","un x mês",6,"",null,null,12]
["9.3.29","E9585 - DNIT/PE","Motoserra portátil com motor a gosolina de 60 cc.","un x mês",18,"",null,null,72]
["9.3.30","11651 - SINAPI/PE","Perfuratriz pneumática manual de peso médio, 18 kg, comprimento de curso de 6 m, diâmetro do pistão de 5,5 cm","un x mês",3,"",null,null,72]
["9.3.31","E9526-DNIT/PE","Retroescavadeira sobre rodas com carregadeira, tração 4x4, potência líquida 72 hp, peso operacional mínimo de 7.140 kg, capacidade mínima da carregadeira de 0,79 m³ e da retroescavadeira mínima de 0,18 m³, profundidade de escavação máxima de 4,50 m.","un x mês",24,"",null,null,36]
["9.3.32","E9089 - DNIT/PE","Roçadeira costal com motor a gasolina de  32 cc.","un x mês",24,"",null,null,36]
["9.3.33","COT - SOLD","Soldador manual para mantas Leister Triac-st","un x mês",12,"",null,null,36]
["9.3.34","COT_TORR","Torre de iluminação 4000 W","un x mês",12,"",null,null,12]
["9.3.35","COT - TRIT","Triturador de Galhos e Resíduos TR-500G à Gasolina Motor 13HP","un x mês",24,"",null,null,36]
["9.3.36","39628 - SINAPI/PE","Motor a diesel para vibrador de imersão de 4,7 cv.","un x mês",6,"",null,null,36]
["9.3.37","39399 - SINAPI/PE","Vibrador de imersão, com ponteira de 35 mm, mangote de 5 m, sem motor.","un x mês",2,"",null,null,36]
["9.3.38","39400 - SINAPI/PE","Vibrador de imersão, com ponteira de 45 mm, mangote de 5 m, sem motor.","un x mês",2,""]
["9.3.39","39401 - SINAPI/PE","Vibrador de imersão, com ponteira de 60 mm, mangote de 5 m, sem motor.","un x mês",2,""]
[]
["10.",null,"INSTRUMENTOS"]
["10.1.",null,"INSTRUMENTOS - MECÂNICA"]
["10.1.1",null,"Analisador de vibração VIB 496FFY VIBOTRON","un x mês",6,"",null,null,12]
["10.1.2","Banco de preços (NºPregão:102022 / UASG:153029, MINISTÉRIO DA EDUCAÇÃO\nUniversidade Tecnológica Federal do Paraná\nUTFPR - Campus Medianeira - Pregão Eletrônico, 06/2022)","Base magnética para relógio comparador","un x mês",24,"",null,null,48]
["10.1.3","Banco de preços (NºPregão:282022 / UASG:984723, PREFEITURA MUNICIPAL DE JOÃO MONLEVADE/MG - Pregão Eletrônico, 07/2022)","Estetoscópio Kent","un x mês",12,"",null,null,24]
["10.1.4",null,"Micrômetro 100 à 200 externo","un x mês",12,"",null,null,24]
["10.1.5","Banco de preços (NºPregão:752021 / UASG:168008, MINISTÉRIO DA DEFESA\nComando do Exército\nIndustria de Material Belico do Brasil/FE/RJ - Pregão Eletrônico, 01/2022)","Micrômetro externo 0 – 100mm","un x mês",12,"",null,null,24]
["10.1.6","Banco de preços (NºPregão:222022 / UASG:153178 - MINISTÉRIO DA EDUCAÇÃO\nUniversidade Tecnológica Federal do Paraná\nUTFPR - Campus Ponta Grossa, Pregão Eletrônico - 07/2022)","Micrômetro interno 50 – 800mm","un x mês",12,"",null,null,24]
["10.1.7",null,"Nível ótico (Topcon AT-B2) ou similar","un x mês",6,"",null,null,12]
["10.1.8","Banco de preços (NºPregão:252022 / UASG:154043, MINISTÉRIO DA EDUCAÇÃO\nUniversidade Federal de Uberlândia - Pregão Eletrônico, 06/2022)","Paquímetro digital 0 – 150mm/0,01mm","un x mês",12,"",null,null,24]
["10.1.9",null,"Paquímetro universal 0 - 650mm/0,02mm","un x mês",12,"",null,null,24]
["10.1.10","Banco de preços (NºPregão:832021 / UASG:742050, MINISTÉRIO DA DEFESA\nCOMANDO DA MARINHA\nCentro de Intendência Tecnológico da Marinha em São Paulo - Pregão Eletrônico, 01/2022)","Relógio comparador 0 – 10/0,01mm digital","un x mês",24,"",null,null,48]
["10.1.11","Banco de preços (NºPregão:62022 / UASG:158445, MINISTÉRIO DA EDUCAÇÃO\nSECRETARIA DE EDUCAÇÃO PROFISSIONAL E TECNOLÓGICA\nInstituto Federal de Educação, Ciência e Tecnologia do Amazonas\nCampus Manaus Centro - Pregão Eletrônico, 07/2022)","Tacômetro digital 0,1 - 1,0 RPM DT - 2234 A","un x mês",6,"",null,null,12]
["10.1.12","Banco de preços (NºPregão:7982021 / UASG:925373 - GOVERNO DO ESTADO DE RONDONIA\nSuperintendência Estadual de Compras e Licitações, Pregão Eletrônico - 01/2022)","Termômetro mira laser escala de -20 a 500ºC","un x mês",6,"",null,null,12]
["10.1.13",null,"Termovisor, com resolução Infravermelha de 120 x 90, Sensibilidade Térmica menor que 0,10 ºC, frequência da imagem de 9 Hz e faixa de temperatura –20 a 250 °C. ","un x mês",18,"",null,null,36]
["10.2.",null,"INSTRUMENTOS - ELÉTRICA"]
["10.2.1",null,"Alicate Amperímetro (mod. 381 CA/CC True-rms 1000V CAT III (ou similar)","un x mês",78,"",null,null,156]
["10.2.2","Banco de preços (UNIVERSIDADE ESTADUAL DE CAMPINAS\nSECR. DESENV. ECONOMICO\nCAMPINAS - Dispensa de Licitação, 01/2022)","Alicate amperímetro CA/CC de 600V, digital, CAT III FLUKE 305","un x mês",60,"",null,null,120]
["10.2.3",null,"Alicate Medidor de qualidade de energia (mod. Fluke 345 ou  similar) ","un x mês",12,"",null,null,24]
["10.2.4",null,"Boroscópio Digital Tela LCD 2,7 Pol. com Câmera de Inspeção e Saída USB ","un x mês",12,"",null,null,24]
["10.2.5",null,"Calibrador de processos multifunção digital (mod. Fluke 725 ou  similar) ","un x mês",12,"",null,null,120]
["10.2.6",null,"Fasímetro, digital, categoria IV, 40~700Vca, 600V ","un x mês",60,"",null,null,12]
["10.2.7",null,"Freqüencímetro gitital de bancada , 1GHz de 8 dígitos ","un x mês",6,"",null,null,12]
["10.2.8",null,"Medidor de distância, laser, amplitude de medição 1mm a 80m ","un x mês",6,"",null,null,12]
["10.2.9",null,"Medidor de resistência de aterramento e resistividade do solo (Faixa de medição de 0,02Ω a 300KΩ; Alcance de até 2 K Ω) com 02 pinças ","un x mês",6,"",null,null,12]
["10.2.10",null,"Medidor de vazão portátil tipo Clamp-on ","un x mês",6,"",null,null,24]
["10.2.11",null,"Megôhmetro digital de 15 kV, alcance de até 1 TΩ, Interface USB, IP54 ","un x mês",12,"",null,null,156]
["10.2.12",null,"Multímetro digital, tensão DC/AC 50,000 mV a 1000V, 0,4% (True/RMS), frequencia 99,999Hz a 999,99KHz  \"FLUKE-87-V\" com pontas prova TWIST GUARD","un x mês",78,"",null,null,156]
["10.2.13",null,"Multímetro digital para teste de equipotencialização (medições de baixas resistências), 100V, 10A, 0,1 Ω a 50 Ω ","un x mês",78,"",null,null,12]
["10.2.14","Banco de preços (NºPregão:42022 / UASG:784810, MINISTÉRIO DA DEFESA\nCOMANDO DA MARINHA\nCentro de Intendencia da Marinha em Belem - Pregão Eletrônico, 03/2022)","Osciloscópio portátil com frequência de trabalho de 100Mhz, LCD Colorido 7”,  CAT II 600V ","un x mês",6,"",null,null,24]
["10.2.15",null,"Power Meter (Medidor Potência Fibra Óptica) potência 1310 nm, 1490 nm e 1550 nm  + Caneta Laser 10w ","un x mês",12,"",null,null,156]
["10.2.16","Banco de preços (NºPregão:7982021 / UASG:925373, GOVERNO DO ESTADO DE RONDONIA\nSuperintendência Estadual de Compras e Licitações - Pregão Eletrônico, 01/2022)","Termômetro mira laser escala de -30ºC a 500ºc ","un x mês",78,"",null,null,36]
["10.2.17","Banco de preços (NºPregão:22022 / UASG:156654, HOSPITAL DAS CLÍNICAS DA UNIVERSIDADE FEDERAL DE UBERLÂNDIA - Pregão Eletrônico, 01/2022)","Termovisor -20ºC a 350ºC, com camera de 5 megapixels, visor LCD de 3,5 polegadas ","un x mês",18,"",null,null,24]
["10.2.18",null,"Testador de cabos RJ45 / 11, frequencia 200kHz, display LCD 3 ½ digitos, 600V ","un x mês",12,"",null,null,156]
["10.2.19",null,"Verificador elétrico de tensão 1000V, sem contato com cabo (mod. T6-1000 Fluke ou similar) ","un x mês",78,""]
["10.3.","COT_BANC_TESTE","INSTRUMENTOS - CIVIL"]
["10.3.1","H019701007/EMBASA","GPS Geodésico portátil com visor 65K de cores legível sob luz solar, à prova d'água, geocaching informatizado e recurso de mapeamento ampliados.","un x mês",6,"",null,null,12]
["10.3.2","Banco de preços - NºPregão:12021 / UASG:154849 - 01/2022 (MINISTÉRIO DA EDUCAÇÃO\nSecretaria Executiva\nSubsecretaria de Planejamento e Orçamento\nInstituto Federal de Educação, Ciência e Tecnologia de Pernambuco\n/Campus Cabo de Santo Agostinho)","Estação Total com leitura direta de 1 segundo e precisão de 2\". Prumo óptico na alidade. Interface com principais softwares do mercado, à prova d'água e poeira conforme norma internacional: IEC529. Com kit completo, inclusive tripé com pernas extensíveis.","un x mês",6,"",null,null,12]
["10.3.3",null,"Nível automático com precisão de ± 1,0 mm/km duplo de nivelamento, aumento de imagem 32 vezes, limbo horizontal com escala de 1º, abertura da objetiva 45 mm, foco mínimo 1,60 m. Com tripé e mira.","un x mês",6,"",null,null,12]
["10.3.4",null,"(GNSS GPS Geodésico modo RTK Precisão horizontal 8mm + 1ppm e Precisão Vertical 15mm + 1ppm modelo CHC X91+)","un x mês",6,""]
[]
["11.",null,"SEGURANÇA E MANUTENÇÃO DE BARRAGENS"]
["11.1.",null,"MÃO DE OBRA - SEGURANÇA DE BARRAGENS"]
["11.1.1","P1","Engenheiro Pleno  - Esp. Em Seg. de Barragem","homem x mês",6,"",null,null,12]
["11.1.2","P1","Engenheiro. Civil  (Geotecnico)","homem x mês",6,"",null,null,12]
["11.1.3","P2","Engenheiro Junior - Civil","homem x mês",6,"",null,null,12]
["11.1.4","A1","Assistente Administrativo (Assistente social)","homem x mês",12,"",null,null,24]
["11.1.5","AS","Assistente Administrativo (administrativo)","homem x mês",12,"",null,null,24]
["11.1.6","A1","Auxiliar Administrativo","homem x mês",6,"",null,null,12]
["11.1.7","TS","Topógrafo ","homem x mês",6,"",null,null,24]
["11.1.8","T3","Auxiliar de Topografia","homem x mês",12,"",null,null,48]
["11.1.9","T2","Técnico Pleno","homem x mês",6,"",null,null,12]
["11.2.",null,"EQUIPAMENTOS - SEGURANÇA DE BARRAGENS"]
["11.2.1","E9763-DNIT/PE","Grupo Gerador - 32,0 kVA, 220 V, trifásico, silenciado, com 100 metros de cabos e 01 QTA. ","un x mês",6,"",null,null,12]
["11.2.2","13227 - SINAPI/PE","MOTONIVELADORA POTENCIA BASICA LIQUIDA (PRIMEIRA MARCHA) 171 HP, PESO BRUTO 14768 KG, LARGURA DA LAMINA DE 3,7 M","un x mês",6,"",null,null,12]
["11.2.3","36483 - SINAPI/PE","ESCAVADEIRA HIDRAULICA SOBRE ESTEIRAS CACAMBA 0,40 A 1,20 M3, PESO OPERACIONAL 21,19 T, POTENCIA LIQUIDA 173 HP","un x mês",6,"",null,null,12]
["11.2.4","E9540-DNIT/PE","Trator de esteiras, potência de 150 hp, peso operacional de 16,7 t, com roda motriz elevada e lâmina com contato de 3,18 m³.","un x mês",6,"",null,null,12]
["11.2.5","89883-SINAPI/PE","Cavalo Mecânico com Reboque M. Benz Randon LS-1634/45 29,5 t, ou similar","un x mês",6,"",null,null,12]
["11.2.6","E9685-DNIT/PE","Rolo compactador pé-de-carneiro vibratório, potência 125 hp, peso operacional sem/com lastro 11,95/13,30 t, impacto dinâmico 38,5/22,5 t, largura de trabalho 2,15 m.","un x mês",6,"",null,null,12]
["11.2.7","E9043-DNIT/PE","Embarcação de alumínio com comprimento de 6 m e motor de popa - 18,60 kW (inclusive barqueiro)","un x mês",18,"",null,null,36]
["11.2.8","A9382-DNIT/PE","Dolly intermediário com 2 eixos para semirreboque (para embarcação)","un x mês",18,"",null,null,36]
["11.3.",null,"VEÍCULOS - SEGURANÇA DE BARRAGENS"]
["11.3.1","B4","TIPO SEDAN 1.6 FLEX (115CV)","un x mês",6,"",null,null,24]
["11.3.2","B11","Veículo Tipo Pick Up Cabine Dupla 4 x 4 (163 CV)","un x mês",6,"",null,null,24]
[]
["12.",null,"SERVIÇOS ADICIONAIS"]
["12.1.",null,"FORNECIMENTO DE ÁGUA POTÁVEL PARA CANTEIRO"]
["12.1.1","I8949/SEINFRA","Estação de tratamento de água","un x mês",12,"",null,null,12]
["12.1.2","220497/SEDOP","Poço Tubular","un x mês",12,"",null,null,12]
["12.2.",null,"ANÁLISES DE EFLUENTES"]
["12.2.1","COT - AQA","Análise de Efluentes - Conama nº 357 e Resolução ANA nº 85/18 ","un x mês",6,""]
[]
["13.",null,"AQUISIÇÃO DE PEÇAS SOBRESSALENTES PISF - EIXOS LESTE"]
["13.1.",null,"SOBRESSALENTES - MECÂNICA"]
["13.1.1",null,"Barra Roscada M-16 _ plicação: Vedação das juntas Dresser. Especificação: Aço inox A304","mt",80,"",null,null,80]
["13.1.2",null,"Borracha de vedação _ Especificação: Vedante trapezidal 50x25x20x6 - EPDM Shore A70","mt",50,"",null,null,50]
["13.1.3",null,"Borracha Neoprene 5mm _ Especificação: 2,5m x 20m (Junta de válvulas)","mtr",20,"",null,null,20]
["13.1.4",null,"Cavalete porta escova (mola)","pç",10,"",null,null,10]
["13.1.5",null,"Escova de aterramento do eixo _ Dimensões 10x25x40mm (AxLxC) - (Ref.: J12 item WEG 10169828) (Metal Grafite)","pç",12,"",null,null,12]
["13.1.6",null,"Escova para o motor 6,9kV _ Escova Carvão J12  dimen.32x25x64mm (Ref. Felca FCE-100A)","pç",96,"",null,null,96]
["13.1.7",null,"Filtro de ar do motor (entrada de ar) EBV-1, 2, 3 _  Especificação: Filtro de ar 345x925x25mm.Modelo Aeroglass FMT-C","pç",16,"",null,null,16]
["13.1.8",null,"Filtro de ar do motor (entrada de ar) EBV-5 _  Especificação: Filtro de ar 670x280x25mm.Modelo Aeroglass FMT-C","pç",16,"",null,null,16]
["13.1.9",null,"Filtro de ar do motor (entrada de ar) EBV-6 _  Especificação: Filtro de ar 750x225x25mm.Modelo Aeroglass FMT-C","pç",16,"",null,null,16]
["13.1.10",null,"Filtro de ar para caixa coletora (porta escovas) _ Especificação: Filtro de ar 330x185x50mm.Modelo Aeroglass PD-U GALV","pç",36,"",null,null,36]
["13.1.11",null,"Filtro de ar para caixa coletora (porta escovas) _ Especificação: Filtro de ar 450x400x50mm.Modelo Aeroglass PD-U GALV","pç",24,"",null,null,24]
["13.1.12",null,"Gaxeta grafitada ¾” Quadrada.","mt",60,"",null,null,60]
["13.1.13",null,"Gaxeta grafitada 1” Quadrada","mt",396,"",null,null,396]
["13.1.14",null,"Óleo lubrificante ISO VG-46","lt",200,"",null,null,600]
["13.1.15",null,"Óleo lubrificante ISO VG-68","lt",1400,"",null,null,200]
["13.1.16",null,"O'ring Ø10 - Especificação: O'ring Ø10 x 370 - Shore 70A SBR","mt",40,"",null,null,40]
["13.1.17",null,"O'ring Ø8 - Especificação: O'ring Ø8 x 370 - Shore 70A SBR","mt",20,"",null,null,20]
["13.1.18","421/COMPESA","Pòrca M-16 _ Especificação: Aço inox A304","pç",240,"",null,null,240]
["13.1.19",null,"PT 100 _ Especificação: Modelo T 01628 531166","pç",12,"",null,null,12]
["13.1.20",null,"PT 100 _ Especificação: Modelo TR10-D CC22 2RØ11QD","pç",16,"",null,null,96]
["13.1.21",null,"Sensor de fluxo _ Especificação: Modelo FC10B02","pç",24,"",null,null,24]
["13.1.22",null,"Sensor de nível do óleo mancal -  Especificação: Modelo HNS 3228-5-0410-000","pç",12,"",null,null,12]
["13.1.23",null,"Sensor de nível do óleo mancal - Especificação: Modelo VB400-12GM+V1","pç",12,"",null,null,12]
["13.1.24",null,"Sensor de vibração (acelerômetro) - Especificação: Modelo ST5484E-152-412-00 (Metrix)","pç",12,"",null,null,12]
["13.1.25",null,"Termômetro - Especificação: Modelo BIE-IN 114 69M 100MM 0/150 C XGV XNH CD1 XN6 (ASHCROFT WILLY)","pç",12,"",null,null,12]
["13.1.26","11586/SETOP","Tubo em aço galvanizado - Especificação: Tubo A/C galvanizado Ø 2\" SCH 40","mt",72,"",null,null,72]
[]
["13.2.",null,"SOBRESSALENTES - ELÉTRICA"]
["13.2.1",null,"CARREGADOR RETIFICADOR MODULAR 380Vca/ 125Vcc, 5x20A. ESPECIFICAÇÃO TECNICA: PISF-000-92000. 1635-DEF-2810-60-08-071-R00","pç",2,"",null,null,1]
["13.2.2",null,"CARREGADOR  RETIFICADOR  MODULAR  380Vca/  125Vcc,  2x25A,  CONFORME  ESPECIFICAÇÃO  TÉCNICA  nº 1600‐EST‐2811‐ 60‐08‐003  (ET  PARA  CARREGADOR  RETIFICADOR MODULAR) DESENHO DE FABRICAÇÃO: 1637‐DEF‐2819‐60‐08‐012-R02","pç",4,"",null,null,4]
["13.2.3",null,"Contator Tripolar de Barra 300A, 1NF + 2N, 125VCC (CV1-BH2H1HKD22)","pç",2,"",null,null,2]
["13.2.4",null,"Mufla, terminal, 6,9/10kV, monofásica, uso interno, cabo condutor cobre/alumínio, isolamento sólido, material termocontrátil.","pç",6,"",null,null,6]
["13.2.5",null,"RETIFICADOR FSE 380VCA/125VCC 10,8KVA/8,44KW 18,2A/60A (uma unidade será substituida por completo para a retirada servir de sobressalente)","pç",1,"",null,null,1]
["13.2.6",null,"SENSOR DE TEMPERATURA PT100 IOPE","pç",12,"",null,null,12]
["13.2.7",null,"SENSOR DE VIBRAÇÃO METRIX Modelo ST5484E-152-412-00","pç",12,"",null,null,12]
["13.2.8",null,"Terminação contrátil à frio para cabos de 120mm²,  15kV, Fab. Prysmian","pç",13,"",null,null,13]
["13.2.9",null,"Terminação contrátil à frio para cabos de 240mm²,  15kV, Fab. Prysmian","pç",13,"",null,null,13]
["13.2.10",null,"Terminação contrátil à frio para cabos de 400mm²,  15kV, Fab. Prysmian","pç",7,"",null,null,7]
["13.2.11",null,"Terminação contrátil à frio para cabos de 70mm²,  15kV, Fab. Prysmian","pç",13,"",null,null,13]
["13.2.12",null,"Terminação contrátil à frio para cabos de 95mm²,  15kV, Fab. Prysmian","pç",13,"",null,null,13]
["13.2.13","001425/SBC","Terminal à compressão dois furos e duas compressões para cabos de 120mm². Cod.637400, Fab. Magnet","pç",7,"",null,null,7]
["13.2.14",null,"Terminal à compressão dois furos e duas compressões para cabos de 400mm². Cod.637900, Fab. Magnet","pç",7,"",null,null,7]
["13.2.15","008331/SBC","Terminal à compressão dois furos e duas compressões para cabos de 95mm². Cod.637303, Fab. Magnet","pç",13,"",null,null,13]
["13.2.16",null,"Terminal à compressão um furo e uma compressão para cabos de 120mm². Cod.631103, Fab. Magnet","pç",7,"",null,null,7]
["13.2.17",null,"Terminal à compressão um furo e uma compressão para cabos de 70mm². Cod.631000, Fab. Magnet","pç",13,"",null,null,13]
[]
["13.3.",null,"Peças para reposições nas manutenções preventivas e corretivas dos condicionadores de ar"]
["13.3.1",null,"Vareta de solda foscoper 2,5 mm com banho","un.",20,"",null,null,20]
["13.3.2",null,"gás inflamável para maçarico portátil","kg",2,"",null,null,2]
["13.3.3",null,"placa universal de 30.000 BTUs","un.",5,"",null,null,5]
["13.3.4",null,"placa universal de 18.000 BTUs","un.",5,"",null,null,5]
["13.3.5",null,"placa universal de 12.000 BTUs","un.",5,"",null,null,5]
["13.3.6",null,"Capacitor duplo de 30 HF 440 Vac","un.",10,"",null,null,10]
["13.3.7",null,"Capacitor duplo de 35 HF 440 Vac","un.",24,"",null,null,24]
["13.3.8",null,"Capacitor  duplo de 40 HF 440 Vac","un.",46,"",null,null,46]
["13.3.9",null,"Capacitor duplo de 50 HF","un.",40,"",null,null,40]
["13.3.10","12440/ORSE","Gás refrigerante R-22a","kg",27.2,"",null,null,27.2]
["13.3.11",null,"Gás refrigerante R-410a","kg",22.6,"",null,null,22.6]
["13.3.12",null,"Motor de ventilador de condensadora redonda (Midea) de 30.000 BTUs","un.",10,"",null,null,10]
["13.3.13",null,"Motor de ventilador de condensadora redonda (Midea) de 18.000 BTUs","un.",10,"",null,null,10]
["13.3.14",null,"Motor de ventilador de condensadora redonda (Midea) de 12.000 BTUs","un.",10,"",null,null,10]
[]
["13.4.",null,"PEÇAS PARA MANUTENÇÃO GERADOR - MECÂNICA"]
["13.4.1",null,"FILTRO ÓLEO COMB PERKINS/MWM D3152/T4236/P4001/410/410T/D6 - PN 423651E / RC-253-A","pç",6,"",null,null,6]
["13.4.2",null,"Filtro de óleo lub perkins 404D-22G - pn 140517050\nMarca: PERKINS","pç",6,"",null,null,6]
["13.4.3",null,"Arruela do bujão do carter perkins 1104 - pn 2415715eMarca: PERKIN","pç",6,"",null,null,6]
["13.4.4",null,"Filtro de óleo comb perkins 1104a/1104c - pn 4816636Marca: PERKINS","pç",5,"",null,null,5]
["13.4.5",null,"Solenoide de parada bomba perkins 404D-22G - pn U85206452Marca: PERKINS","pç",3,"",null,null,3]
["13.4.6",null,"Correia alter/vent perkins 1104C-44TAG2 - pn 2614B653Marca: PERKINS","pç",1,"",null,null,1]
["13.4.7",null,"BOMBA D'ÁGUA","pç",2,"",null,null,2]
["13.4.8",null,"VALVULA TERMOSTÁTICA","pç",2,"",null,null,2]
["13.4.9",null,"BOMBA ELÉTRICA+FILTRO","pç",2,"",null,null,2]
["13.4.10",null,"BICOS INJETORES","pç",2,"",null,null,2]
["13.4.11",null,"CABEÇOTE E RECUPERAÇÃO","pç",2,"",null,null,2]
[]
["14.",null,"SERVIÇOS ESPECIALIZADOS (EIXO LESTE)"]
[]
["14.1.",null,"Serviços de recarga de extintores de incêndio (EB / SE / Canteiros)"]
["14.1.1","2.04.39/FDE","Recarga Extintor AP 10 L BC","Unid.",8,"",null,null,8]
["14.1.2","05554/EMOP","Recarga Extintor CO2 06 Kg BC","Unid.",47,"",null,null,47]
["14.1.3","07066/EMOP","Recarga Extintor PQS 04 Kg BC","Unid.",13,"",null,null,13]
["14.1.4","05563/EMOP","Recarga Extintor PQS 06 Kg BC","Unid.",28,"",null,null,28]
["14.1.5","Banco de preços -  MINISTÉRIO DA DEFESA\nCOMANDO DA MARINHA\nCentro de Intendencia da Marinha em Salvador (NºPregão:132022 / UASG:782802 - 07/2022)","Recarga Extintor PQS 08 Kg BC","Unid.",2,"",null,null,2]
["14.1.6","Banco de preços -  MINISTÉRIO DA DEFESA\nCOMANDO DA MARINHA\nCentro de Intendencia da Marinha em Salvador (NºPregão:132022 / UASG:782802 - 07/2022)","Recarga Extintor PQS 12 Kg BC","Unid.",50,"",null,null,50]
["14.1.7","Banco de preços - MINISTÉRIO DA DEFESA\nComando da Aeronáutica\nBASE AÉREA DE ANAPOLIS (NºPregão:672021 / UASG:120624 - 10/2021)","Recarga Extintor PQS 50 Kg BC","Unid.",36,"",null,null,36]
[{"$nulls":9},{"$f":"(G7/(G7-G796))-1","v":{"$error":"#DIV/0!"}}]
[]
["15.",null,"CUSTOS INDIRETOS"]
["15.1",null,"Custos Indiretos (Taxa de 5,93% de Adm Central, Seg e Garantias, Risco e Desp. Fin.)","%",5.9299999999999999E-2,0,null,null,9.0300000000000005E-2,6.1899999999999997E-2,null,4664078.0999999996,{"$f":"L797-G797","v":4664078.0999999996},"ARRED(L799*M799;2)"]
["15.2",null,"Lucro (Taxa de 6,00% para remuneração da contratada)","%",0.06,0,null,null,7.8899999999999998E-2,7.8899999999999998E-2,null,4450406.32,{"$f":"L798-G798","v":4450406.32},"ARRED(L798*M798;2)"]
["15.3",null,"Despesas Fiscais (9,46% dos Custos Diretos + Custos Indiretos + Lucro)","%",9.4600000000000004E-2,0,null,null,7.1199999999999986E-2,null,null,5598017.7599999998,5598017.7599999998,"TRUNCAR(L799*M799;2)"]
[{"$nulls":9},5930919.8799999999]
[]
["NOME DO INFORMANTE:",{"$nulls":5},"QUALIFICAÇÃO:"]
[{"$nulls":8},"SUBTOTAL(109;G872:G874)"]
["ASSINATURA:",{"$nulls":5},"DATA:"]
[]
["OBSERVAÇÃO:"]

{"sheet":"Manutenção de canteiro","index":2,"n_rows":41,"n_cols":7,"rows_kept":41,"cut":false,"hidden":false,"merged":[[24,0,24,6],[16,0,16,2],[15,0,15,2],[17,0,17,2],[18,0,18,2],[19,0,19,2],[21,0,23,6],[32,0,32,4],[32,5,32,6],[33,0,33,6],[34,0,34,6],[29,0,29,4],[29,5,29,6],[30,0,30,4],[30,5,30,6],[31,0,31,4],[31,5,31,6],[10,5,10,6],[0,2,0,6],[1,2,1,6],[2,2,2,6],[4,0,5,6],[7,0,7,6],[10,0,11,0],[10,1,11,1],[10,2,11,2],[10,3,11,3],[10,4,11,4]]}
[null,null,"Ministério do Desenvolvimento Regional  - MDR"]
[null,null,"Companhia de Desenvolvimento dos Vales do São Francisco e do Parnaíba"]
[null,null,"Gerência de Operação do PISF - Centro de Controle e Operação (AD / GOI / CCO)"]
[]
[{"$f":"Equipamentos!A5","v":"TERMO DE REFERÊNCIA PARA CONTRATAÇÃO DOS RECURSOS NECESSÁRIOS À OPERAÇÃO E MANUTENÇÃO DAS INFRAESTRUTURAS DO EIXO LESTE DO PISF - PROJETO DE INTEGRAÇÃO DO SÃO FRANCISCO COM AS BACIAS HIDROGRÁFICAS DO NORDESTE SETENTRIONAL"}]
[]
[]
[{"$f":"'ORCAMENTO_CONSOLIDADO (2)'!C322","v":"MANUTENÇÃO DE CANTEIRO - ESCRITÓRIO"}]
[]
[]
["ITEM","CÓDIGO","DESCRIÇÃO","UNIDADE","QUANTIDADE","VALOR (R$)"]
[{"$nulls":5},"UNITARIO","TOTAL"]
[{"$f":"'ORCAMENTO_CONSOLIDADO (2)'!A159","v":"7."},null,{"$f":"'ORCAMENTO_CONSOLIDADO (2)'!C159","v":"MATERIAL DE CONSUMO - ALMOXARIFADOS"}]
[{"$f":"'ORCAMENTO_CONSOLIDADO (2)'!A322","v":"7.4."},null,{"$f":"'ORCAMENTO_CONSOLIDADO (2)'!C322","v":"MANUTENÇÃO DE CANTEIRO - ESCRITÓRIO"}]
[]
["VALOR ATUAL DO BOLETIM DE MEDIÇÃO",null,null,"VBM"]
["VALOR TOTAL DO SERVIÇO DE MANUTENÇÃO DE CANTEIRO",null,null,"VSMC"]
["VALOR TOTAL DO SERVIÇO DE MANUTENÇÃO DE CANTEIRO - ANTERIOR",null,null,"VSMC.ANT"]
["VALOR TOTAL DA PLANILHA",null,null,"VTP"]
["VALOR DO BOLETIM DE MEDIÇÃO - ANTERIOR",null,null,"VBM.ANT"]
[]
["VALOR MANT. CANTEIRO = VBM*((VSMC - VSMC.ANT) / (VTP - VBM.ANT))"]
[]
[]
[]
[{"$f":"\"TOTAL - \"&C14&\" - (R$):\"","v":"TOTAL - MANUTENÇÃO DE CANTEIRO - ESCRITÓRIO - (R$):"},{"$nulls":5},{"$f":"SUBTOTAL(9,G16:G25)","v":0}]
[]
[]
[]
["NOME DO INFORMANTE:",{"$nulls":4},"QUALIFICAÇÃO:"]
[]
["ASSINATURA:",{"$nulls":4},"DATA:"]
[]
["OBSERVAÇÃO:"]
["TABELAS DE REFERÊNCIA"]
["SINAPI 04/2022"]
["ORSE 03/2022"]
["SBC 07/2022"]
["EMBASA 01/2022"]
["SETOP 03/2022"]
["COMPESA 01/2022"]

{"sheet":"Mao_de_Obra_VALORES_ADICIONAIS","index":3,"n_rows":51,"n_cols":21,"rows_kept":51,"cut":false,"hidden":false,"merged":[[41,0,41,18],[11,17,12,17],[11,18,12,18],[11,9,11,10],[11,13,12,13],[9,5,11,6],[9,3,12,3],[10,8,10,13],[10,7,12,7],[10,15,10,18],[10,14,12,14],[9,7,9,13],[9,14,9,18],[38,0,38,16],[39,0,40,17],[9,0,12,0],[52,0,52,18],[42,0,42,18],[43,0,43,18],[44,0,44,18],[45,0,45,18],[46,0,46,18],[47,0,47,18],[48,0,48,18],[49,0,49,18],[50,0,50,18],[51,0,51,18],[9,1,12,1],[9,2,12,2],[9,4,12,4],[11,16,12,16],[0,2,0,18],[1,2,1,18],[2,2,2,18],[4,0,5,18],[7,0,7,18]]}
[null,null,"Ministério do Desenvolvimento Regional  - MDR"]
[null,null,"Companhia de Desenvolvimento dos Vales do São Francisco e do Parnaíba"]
[null,null,"Gerência de Operação do PISF - Centro de Controle e Operação (AD / GOI / CCO)"]
[]
["TERMO DE REFERÊNCIA PARA CONTRATAÇÃO DOS RECURSOS NECESSÁRIOS À OPERAÇÃO E MANUTENÇÃO DAS INFRAESTRUTURAS DO EIXO LESTE DO PISF - PROJETO DE INTEGRAÇÃO DO SÃO FRANCISCO COM AS BACIAS HIDROGRÁFICAS DO NORDESTE SETENTRIONAL"]
[]
[]
["MÃO DE OBRA - VALORES ADICIONAIS"]
[]
["ITEM","DESCRIÇÃO","CLASSE","Und.","Prazo (Mês)","Quantidade (undxmês)",null,"VALOR ADICIONAL - UNITÁRIO",{"$nulls":6},"VALOR ADICIONAL - TOTAL"]
[{"$nulls":7},"VALOR BASE (Com Encargo)","CÁLCULO DO VALOR ADICIONAL",{"$nulls":5},"VALOR BASE (Com Encargo)","CÁLCULO DO VALOR ADICIONAL - TOTAL (R$)"]
[{"$nulls":8},"Periculosidade ","Adicional Noturno",null,"Hora Extra 100%","Hora Extra 50%","VALOR DO ADICIONAL (Incluindo: encargos)",null,"Periculosidade","Adicional Noturno (c/ intrajornada)","Horas Extras","VALOR DO ADICIONAL - COMPLETO (Incluindo: encargos)"]
[{"$nulls":5},"Unitária","Total",null,0.3,"Valor da Hora Noturna","Valor do Adicional Noturno (c/ intrajornada)","Valor Unitário","Valor Unitário",null,null,0.3]
["1.","ADICIONAL DE PERICULOSIDADE PARA OS ENGENHEIROS E COORDENADORES",{"$nulls":18},{"$f":"SUM(#REF!)","v":{"$error":"#REF!"}}]
["1.1","Engenheiro Pleno","P1","homem x mês",6,7,42,""]
["1.2","Engenheiro Júnior","P2","homem x mês",6,3,18,""]
["1.3","Técnico Sênior","T0","homem x mês",6,2,12,""]
["1.4","Técnico Pleno","T2","homem x mês",6,5,30,""]
["1.5","Técnico Auxiliar","T3","homem x mês",6,6,36,""]
["2.","MÃO DE OBRA - HORA EXTRA 50%"]
["2.1","Engenheiro Pleno - Hora Extra 50% - C/ Periculosidade","P1","Homem x Hora",6,32,192,"",{"$nulls":12},{"$f":"SUBTOTAL(9,S21:S27)","v":0}]
["2.2","Técnico Pleno - Hora Extra 50% - C/ Periculosidade","T2","Homem x Hora",6,32,192,""]
["2.3","Técnico Júnior- Hora Extra 50%","T2","Homem x Hora",6,32,192,""]
["2.4","Técnico Júnior- Hora Extra 50% - C/ Periculosidade","T2","Homem x Hora",6,32,192,""]
["2.5","Técnico Auxiliar - Hora Extra 50% - C/ Periculosidade","T3","Homem x Hora",6,32,192,""]
["2.6","Auxiliar - Hora Extra 50% - C/ Periculosidade","T3","Homem x Hora",6,32,192,""]
["2.7","Servente - Hora Extra 50% - C/ Periculosidade","A11","Homem x Hora",6,180,1080,""]
["3.","MÃO DE OBRA - HORA EXTRA 100%"]
["3.1","Engenheiro Pleno - Hora Extra 100% - C/ Periculosidade","P1","Homem x Hora",6,16,96,"",{"$nulls":12},{"$f":"SUBTOTAL(9,S29:S35)","v":0}]
["3.2","Técnico Pleno - Hora Extra 100% - C/ Periculosidade","T2","Homem x Hora",6,16,96,""]
["3.3","Técnico Júnior- Hora Extra 100%","T2","Homem x Hora",6,16,96,""]
["3.4","Técnico Júnior- Hora Extra 100% - C/ Periculosidade","T2","Homem x Hora",6,16,96,""]
["3.5","Técnico Auxiliar - Hora Extra 100% - C/ Periculosidade","T3","Homem x Hora",6,16,96,""]
["3.6","Auxiliar - Hora Extra 100% - C/ Periculosidade","T3","Homem x Hora",6,16,96,""]
["3.7","Servente - Hora Extra 100% - C/ Periculosidade","A11","Homem x Hora",6,120,720,""]
["Total Geral - VALORES ADICIONAIS - MÃO DE OBRA (R$):"]
[]
["NOME DO INFORMANTE:"]
[]
["ASSINATURA:"]
[]
["OBSERVAÇÕES:"]
["1. Considerado a carga horária de 176 horas/mês"]
["2. Os cálculos de cada parcela que compõe o salário completo foram calculadas isoladamente. (Salário Base + Adicional de Periculosidade (quando houver) + Adicional Noturno (quando houver) + Adicional de Horas Extras (quando houver) +  Encargos Sociais)"]
["3. Adicional de Periculosidade 30%: foi previsto para todos os profissionais eletricitários (Operação e Manutenção) que trabalham em contato com rede elétrica (nas estações de bombeamento, sub-estações, etc.) "]
["4. Hora Noturna: Hora Diurna x 20%"]
["5. Adicional Noturno: *Considerado 120 horas/profissional/mês (Total de 8h noturnas: Período de 22h as 5h = 8h noturnas + 1h até as 6h => Súmula 60 do TST)    *(Incide sobre Salário Base + Periculosidade => Súmula 191 do TST)"]
["6. Período noturno – 22 às 5 horas, o valor da hora tem 52 minutos e 30 segundos; logo, nesse período, há 8 horas"]
["6. Foi considerado intervalo intrajornada para todos os profissionais que trabalham em escala 12h x 36h "]
["7. Foi considerado para o cálculo de horas extras os percentuais de: *5% para as horas remuneradas a 50%  sobre o valor da hora normal; e *2,5% para as horas trabalhadas remuneradas a 100% sobre o valor da hora normal"]
["8. Horas Extras: Foi estimado um percentual de 20% de horas extras no total de contrato para todos os profissionais da manutenção. Essas horas só serão pagas se houver demanda."]

{"sheet":"MC - VALORES ADICIONAIS","index":4,"n_rows":32,"n_cols":5,"rows_kept":32,"cut":false,"hidden":false,"merged":[[171,0,172,0],[173,0,174,0],[0,2,0,4],[1,2,1,4],[2,2,2,4],[4,0,5,4],[6,0,6,4],[8,0,9,0],[8,1,9,1],[8,2,9,2],[8,3,9,3],[8,4,9,4]]}
[null,null,"Ministério do Desenvolvimento Regional  - MDR"]
[null,null,"Companhia de Desenvolvimento dos Vales do São Francisco e do Parnaíba"]
[null,null,"Gerência de Operação do PISF - Centro de Controle e Operação (AD / GOI / CCO)"]
[]
[{"$f":"ORCAMENTO_RESUMO!A5","v":"TERMO DE REFERÊNCIA PARA CONTRATAÇÃO DOS RECURSOS NECESSÁRIOS À OPERAÇÃO E MANUTENÇÃO DAS INFRAESTRUTURAS DO EIXO LESTE DO PISF - PROJETO DE INTEGRAÇÃO DO SÃO FRANCISCO COM AS BACIAS HIDROGRÁFICAS DO NORDESTE SETENTRIONAL"}]
[]
["MEMÓRIA DE CÁLCULO - VALORES ADICIONAIS"]
[]
["ITEM","CÓDIGO","CATEGORIA / DESCRIÇÃO","UND.","QUANTID."]
[]
["1.",null,"ADICIONAL DE PERICULOSIDADE PARA OS ENGENHEIROS E COORDENADORES"]
["1.1","P1","Engenheiro Pleno","homem",7]
["1.2","P2","Engenheiro Júnior","homem",3]
["1.3","T0","Técnico Sênior","homem",2]
["1.4","T2","Técnico Pleno","homem",5]
["1.5","T3","Técnico Auxiliar","homem",6]
["2.",null,"MÃO DE OBRA - HORA EXTRA 50%"]
["2.1","P1","Engenheiro Sênior - Hora Extra 50% - C/ Periculosidade","Hora/mês",32]
["2.2","T2","Técnico Pleno - Hora Extra 50% - C/ Periculosidade","Hora/mês",32]
["2.3","T2","Técnico Júnior- Hora Extra 50%","Hora/mês",32]
["2.4","T2","Técnico Júnior- Hora Extra 50% - C/ Periculosidade","Hora/mês",32]
["2.5","T3","Técnico Auxiliar - Hora Extra 50% - C/ Periculosidade","Hora/mês",32]
["2.6","T3","Auxiliar - Hora Extra 50% - C/ Periculosidade","Hora/mês",32]
["2.7","A11","Servente - Hora Extra 50% - C/ Periculosidade","Hora/mês",180]
["3.",null,"MÃO DE OBRA - HORA EXTRA 100%"]
["3.1","P1","Engenheiro Sênior - Hora Extra 100% - C/ Periculosidade","Hora/mês",16]
["3.2","T2","Técnico Pleno - Hora Extra 100% - C/ Periculosidade","Hora/mês",16]
["3.3","T2","Técnico Júnior- Hora Extra 100%","Hora/mês",16]
["3.4","T2","Técnico Júnior- Hora Extra 100% - C/ Periculosidade","Hora/mês",16]
["3.5","T3","Técnico Auxiliar - Hora Extra 100% - C/ Periculosidade","Hora/mês",16]
["3.6","T3","Auxiliar - Hora Extra 100% - C/ Periculosidade","Hora/mês",16]
["3.7","A11","Servente - Hora Extra 100% - C/ Periculosidade","Hora/mês",120]

{"sheet":"Moveis_Equipamentos","index":5,"n_rows":153,"n_cols":7,"rows_kept":153,"cut":false,"hidden":false,"merged":[[10,0,11,0],[10,2,11,2],[10,3,11,3],[10,4,11,4],[10,5,10,6],[10,1,11,1],[0,2,0,6],[1,2,1,6],[2,2,2,6],[4,0,5,6],[7,0,7,6],[92,0,92,6],[93,0,93,6],[75,5,75,6],[76,5,76,6],[77,5,77,6],[78,5,78,6],[77,0,78,4],[79,0,79,6],[80,0,90,6],[76,0,76,4],[91,0,91,4],[91,5,91,6],[72,5,72,6],[72,0,72,4],[66,0,66,5],[69,0,69,6],[70,2,70,4],[70,5,70,6],[71,2,71,4],[71,5,71,6]]}
[null,null,"Ministério do Desenvolvimento Regional -MDR"]
[null,null,"Companhia de Desenvolvimento dos Vales do São Francisco e do Parnaíba"]
[null,null,"Gerência de Operação do PISF-Centro de Controle e Operação (AD / GOI / CCO)"]
[]
[{"$f":"'MC - VALORES ADICIONAIS'!A5:E6","v":"TERMO DE REFERÊNCIA PARA CONTRATAÇÃO DOS RECURSOS NECESSÁRIOS À OPERAÇÃO E MANUTENÇÃO DAS INFRAESTRUTURAS DO EIXO LESTE DO PISF - PROJETO DE INTEGRAÇÃO DO SÃO FRANCISCO COM AS BACIAS HIDROGRÁFICAS DO NORDESTE SETENTRIONAL"}]
[]
[]
["MOBILIÁRIO E EQUIPAMENTOS DE ESCRITÓRIO"]
[]
[]
["ITEM","CÓDIGO","DESCRIÇÃO","UNIDADE","QUANTIDADE","VALOR (R$)"]
[{"$nulls":5},"UNITARIO","TOTAL"]
["1.",null,"MOBILIÁRIO E EQUIPAMENTOS DE ESCRITÓRIO"]
["1.1","E209300236-EMBASA/BA","Aluguel de impressora colorida-Laser com cartuchos-formatos A4 e A3 (inclusive suprimentos)","un x mês",108,"",""]
["1.2","I8612-SEINFRA/CE","Aluguel de Plotter (inclusive suprimentos)","un x mês",12,"",""]
["1.3"," I8610-SEINFRA/CE","Servidor para backup - EQUIPAMENTO SIMILAR","un x mês",12,"",""]
["1.4"," I8610-SEINFRA/CE","Desktop com software-tipo 1 (i7, 1T, 8GB, monitor 19\", S.O. Windows 10 e Office última versão) - EQUIPAMENTO SIMILAR","un x mês",210,"",""]
["1.5"," I8610-SEINFRA/CE","Notebook-tipo 1 (i7, 1T, 8GB, S.O. Windows 10 e Office última versão) - EQUIPAMENTO SIMILAR","un x mês",216,"",""]
["1.6","COT_ANTE","Kit Antena Digital 4K Externa Log 16 elementos Mastro 45cm e cabo coaxial 12m","un x mês",6,"",""]
["1.7","I0123-SEINFRA/CE","Armário de escritório","un x mês",342,"",""]
["1.8","73.72.07-SUDECAP/MG","Bebedouro industrial (canteiro)","un x mês",12,"",""]
["1.9","11534-ORSE/SE","Cadeira giratória, com braço, tipo executiva","un x mês",702,"",""]
["1.10","11543-ORSE","Cadeira de plástico sem braço, cor branca","un x mês",138,"",""]
["1.11","COT_CAM_FOTO","Câmera fotográfica digital 20 mp 5x HD","un x mês",12,"",""]
["1.12","COT - CAR - LIX","Lixeira Carro Coletor 120L","un x mês",24,"",""]
["1.13","COT_CESTO","Cestos Telado de lixo 9,6L","un x mês",48,"",""]
["1.14","39555-SINAPI/PE","Condicionador de ar 12.000 BTU","un x mês",246,"",""]
["1.15","COT_GPS","GPS com cabo e software (conforme especificação)","un x mês",12,"",""]
["1.16","COT_MESA_REUN","Mesa de reunião 10 lugares com 10 cadeiras","un x mês",42,"",""]
["1.17","COT_MESA_PVC","Mesa retangular em Polipropileno 119x75cm","un x mês",36,"",""]
["1.18","COT_MESA_ESCR","Mesas de escritório com gavetas (conforme especificação)","un x mês",702,"",""]
["1.19","F030000293-EMBASA/BA","Projetor multimídia (Datashow)","un x mês",12,"",""]
["1.20","COT_RACK","Rack para TV até 60 Polegadas 1 Porta","un x mês",12,"",""]
["1.21","I0122-SEINFRA/CE","Armário de cozinha completo","un x mês",12,"",""]
["1.22","COT_MES_06","Conjunto de Mesa 1,40 com Tampo MDP com 6 cadeiras","un x mês",12,"",""]
["1.23","10231-ORSE/SE","Fogão ","un x mês",12,"",""]
["1.24","029028-IOPES","Cilindro de Gás de Cozinha 45 kg","un x mês",30,"",""]
["1.25","4226-SINAPI/PE","Gás de cozinha-GLP (kg)","un x mês",1350,"",""]
["1.26","F020000716-EMBASA/BA","Geladeira 280 litros","un x mês",12,"",""]
["1.27","COT_MICROOND","Forno Microondas 20L","un x mês",12,"",""]
["1.28","COT_FAQUEI","Faqueiro com 24 peças","un x mês",204,"",""]
["1.29","COT_PRATO","Pratos rasos redondo em cerâmica","un x mês",468,"",""]
["1.30","COT_COPO","Conjunto  copos em vidro 350ml com 8 unidades","un x mês",24,"",""]
["1.31","COT_TELEVISOR","Smart Tv LED 32\"","un x mês",42,"",""]
["1.32","AP_JANTAR","Aparelho de jantar para 06 pessoas","un x mês",78,"",""]
["1.33","11645-ORSE/SE","Armário para vestiário, em aço, com 12 portas, com cadeado","un x mês",12,"",""]
["1.34","COT_CHAP","Chapa gás 65 cm para grelhar","un x mês",12,"",""]
["1.35","08600-ORSE/SE","Coifa","un x mês",12,"",""]
["1.36","COT_UTENS","Conjunto de utensílios gadgets inox para cozinha","un x mês",12,"",""]
["1.37","COT_FOGAO","Fogão industrial 6 bocas 30x30 baixa pressão perfil 5","un x mês",12,"",""]
["1.38","COT_FORNO","Forno elétrico 46L 1500W","un x mês",12,"",""]
["1.39","F020000719-EMBASA/BA","Freezer 246 l","un x mês",12,"",""]
["1.40","\t10232-ORSE/SE","Geladeira industrial 300 litros","un x mês",12,"",""]
["1.41","COT_PANEL","Conjunto de panelas antiaderente com 7 peças","un x mês",12,"",""]
["1.42","COT_LIQUID","Liquidificadores industriais alta rotação 2L","un x mês",12,"",""]
["1.43","COT_MAQ_LAVA_LOUCA","Máquina de lavar louças industrial B.30 ","un x mês",12,"",""]
["1.44","COT_MAQ_LAVA_ROUPA","Máquina de Lavar roupa 11kg ","un x mês",12,"",""]
["1.45","COT_MESA_BUF","Carrinho Buffet Térmico Self Service Inox 8 cubas","un x mês",12,"",""]
["1.46","COT_MESA_REFEIT","Mesa de refeitório 10 lugares com cadeiras MDF branco de 25mm","un x mês",30,"",""]
["1.47","COT_REFRESQUEIRA","Refresqueira BBS2 Inox","un x mês",12,"",""]
["1.48","COT_TABUA","Tábuas para carnes 19x35x1,6cm","un x mês",12,"",""]
["1.49","COT_CAMA_BOX","Cama box conjugada solteiro","un x mês",168,"",""]
["1.50","COT_GUARDA_ROUPA","Guarda-Roupa solteiro 4 Portas","un x mês",12,"",""]
["1.51","COT_ROUPA_CAMA","Jogo de roupa de cama solteiro 100% Algodão","un x mês",336,"",""]
["1.52","COT_ROUPA_BANHO","Jogo de Roupa de banho 5 Peças","un x mês",168,"",""]
["1.53","COT_SOFA","Conjunto de sofá 2 e 3 lugares","un x mês",12,"",""]
[{"$f":"\"TOTAL-\"&C13&\"-(R$):\"","v":"TOTAL-MOBILIÁRIO E EQUIPAMENTOS DE ESCRITÓRIO-(R$):"}]
[]
[]
[{"$f":"\"RESUMO-\"&A$8","v":"RESUMO-MOBILIÁRIO E EQUIPAMENTOS DE ESCRITÓRIO"}]
["ITEM",null,"DESCRIÇÃO",null,null,"VALOR TOTAL (R$)"]
[1,null,{"$f":"C13","v":"MOBILIÁRIO E EQUIPAMENTOS DE ESCRITÓRIO"}]
[{"$f":"\"TOTAL GERAL-\"&A70&\"- (R$):\"","v":"TOTAL GERAL-RESUMO-MOBILIÁRIO E EQUIPAMENTOS DE ESCRITÓRIO- (R$):"}]
[]
[]
["NOME DO INFORMANTE:",{"$nulls":4},"QUALIFICAÇÃO:"]
[]
["ASSINATURA:",{"$nulls":4},"DATA:"]
[]
["OBSERVAÇÃO:"]
["1. Fonte de Preços:\n- Sistema Nacional de Pesquisa de Custos e Índices da Construção (Tabela SINAPI/PE). Data base: Abril/2022.\n- Empresa Baiana de Águas e Saneamento S.A. (Tabela de preços EMBASA). Data base: 10/2021.\n- Secretaria da Infraestrutura do Estado do Ceará (Tabela 027 SEINFRA/CE). Data base: 03/2021.\n- Sistema de Orçamento de Obras de Sergipe (ORSE). Data base: 03/2022.\n- Companhia Paulista de Obras e Serviços (Boletim Referencial de Custos CPOS). Data base: 07/2019\n- Superintendência de Desenvolvimento da Capital-Prefeitura de Belo Horizonte (Tabela de Preços SUDECAP/MG). Data base: 02/2022.\n- Companhia de Águas e Esgotos do Rio Grande do Norte (Tabela de Preços CAERN/RN). Data base: 05/2019.\n- Sistemas e Consultoria de Custos (Base de Dados SBC/PE). Data base: 11/2019.\n- Instituto de Obras Públicas do Estado do Espírito Santo (Tabela REferencial de Preços IOPES/ES). Data base: 03/2022."]
{"$rows_empty":16}
[null,"Código","Descrição","Unid.","R$/unit"]
[null,"E209300236-EMBASA/BA","Aluguel de impressora colorida-Laser com cartuchos-formatos A4 e A3","un x mês",225.08]
[null,"E209300236-EMBASA/BA","Aluguel de impressora colorida-Laser com cartuchos-formatos A4 e A3","un x mês",225.08]
[null,"I8612-SEINFRA/CE","Aluguel de Plotter","un x mês",320,"ok"]
[null," I2677-SEINFRA/CE","Servidor para backup","un",4685,"ok"]
[null,"3671-ORSE/SE","Desktop com software-tipo 1 (i7, 1T, 8GB, monitor 19\", S.O. Windows 10 e Office última versão)","un",2505.11,"ok"]
[null,"I6395-SEINFRA/CE","Notebook-tipo 1 (i7, 1T, 8GB, S.O. Windows 10 e Office última versão)","un",2583.64,"ok"]
[null,"P.17.000.042561-CPOS/SP","Antena externa","un",326.55]
[null,"AP_JANTAR","Aparelho de jantar para 06 pessoas","un",199.97]
[null,"I0122-SEINFRA/CE","Armário de cozinha completo","un",550.15,"ok"]
[null,"I0123-SEINFRA/CE","Armário de escritório","un",215.35,"ok"]
[null,"11645-ORSE/SE","Armário para vestiário, em aço, com 12 portas, com cadeado","un",1842.89,"ok"]
[null,"73.72.07-SUDECAP/MG","Bebedouro industrial (canteiro)","un",1488,"ok"]
[null,"11534-ORSE/SE","Cadeira giratória, com braço, tipo executiva","un",280,"ok"]
[null,"11543-ORSE","Cadeira de plástico sem braço, cor branca","un",21,"ok"]
[null,"COT_CAMA_BOX","Cama box solteiro","un",279.3]
[null,"COT_CAM_FOTO","Câmera fotográfica digital","un",1835.21,null,"Esclarescimento 05"]
[null,"DV_16-CAERN/RN","Carrinhos de lixo","un",429.02]
[null,"\t040117-SBC/PE","Cestos de lixo","un",96]
[null,"COT_CHAP","Chapa gás para grelhar","un",674.19]
[null,"08600-ORSE/SE","Coifa","un",1898.17,"ok","2020-06-01"]
[null,"39555-SINAPI/PE","Condicionador de ar 12.000 BTU","un",1719.34]
[null,"COT_COPO","Conjunto  copos em vidro com 8 unidades","un",31.32]
[null,"COT_MES_06","Conjunto de Mesa com 06 lugares (para cozinha)","un",550.63]
[null,"COT_PANEL","Conjunto de panelas com 7 peças","un",235.96]
[null,"COT_SOFA","Conjunto de sofá 2 e 3 lugares","un",495.67]
[null,"COT_UTENS","Conjunto de utensílios para cozinha","conj.",55.15]
[null,"COT_FAQUEI","Faqueiro com 24 peças","un",45.61]
[null,"10231-ORSE/SE","Fogão ","un",605.19000000000005]
[null,"78052-SIURB/SP","Fogão industrial 6 bocas ","un",1797.94]
[null,"COT_FORNO","Forno elétrico","un",1670.61]
[null,"COT_MICROOND","Forno Microondas","un",469]
[null,"F020000719-EMBASA/BA","Freezer 246 l","un",1183.99]
[null,"029028-IOPES","Cilindro de Gás de Cozinha 45 kg","un",566.66999999999996,"ok"]
[null,"4226-SINAPI/PE","Gás de cozinha-GLP","kg",5.9]
[null,"F020000716-EMBASA/BA","Geladeira 280 litros","un",789.33]
[null,"\t10232-ORSE/SE","Geladeira industrial 300 litros","un",1652.46,"ok","2020-06-01"]
[null,"COT_GPS","GPS com cabo e software (conforme especificação)","un",321.97000000000003]
[null,"COT_GUARDA_ROUPA","Guarda-Roupa 4 Portas","un",287.26]
[null,"COT_ROUPA_BANHO","Jogo de Roupa de banho 5 Peças","un",96.63]
[null,"COT_ROUPA_CAMA","Jogo de roupa de cama solteiro","un",147.63]
[null,"COT_LIQUID","Liquidificadores industriais","un",616.16999999999996]
[null,"COT_MAQ_LAVA_LOUCA","Máquina de lavar louças industrial","um",1050]
[null,"COT_MAQ_LAVA_ROUPA","Máquina de Lavar roupa 11kg","un",1450.07]
[null,"COT_MESA_BUF","Mesa buffets","un",1577.7]
[null,"COT_MESA_REFEIT","Mesa de refeitório 10 lugares com cadeiras","un",1280.48]
[null,"COT_MESA_REUN","Mesa de reunião 10 lugares com 10 cadeiras","un",3669.74]
[null,"COT_MESA_PVC","Mesa retangular em PVC","un",188]
[null,"COT_MESA_ESCR","Mesas de escritório com gavetas (conforme especificação)","un",390.96]
[null,"COT_PRATO","Pratos rasos","un",6.73]
[null,"F030000293-EMBASA/BA","Projetor multimídia (Datashow)","un",1587.81]
[null,"COT_RACK","Rack (sala)","un",210.3]
[null,"COT_REFRESQUEIRA","Refresqueira","un",1606.88]
[null,"COT_TABUA","Tábuas para carnes","un",91.6]
[null,"COT_TELEVISOR","Televisor LCD com 27,5\"","un",913.48]
[null,"01885-ORSE/SE","Prateleira de madeira revestida com fórmica","m",64.98]

{"sheet":"CPU_Móveis e Equipamentos","index":6,"n_rows":88,"n_cols":10,"rows_kept":88,"cut":false,"hidden":false,"merged":[[9,6,10,7],[75,2,78,5],[80,3,80,5],[69,0,72,5],[11,0,12,0],[11,2,12,2],[9,0,10,5],[11,3,12,3],[11,4,12,4],[11,1,12,1],[0,2,0,7],[1,2,1,7],[2,2,2,7],[4,0,5,7],[7,0,7,7],[11,6,12,6],[80,0,80,2],[74,0,74,5],[81,3,82,5],[87,0,87,7]]}
[null,null,"Ministério do Desenvolvimento Regional -MDR"]
[null,null,"Companhia de Desenvolvimento dos Vales do São Francisco e do Parnaíba"]
[null,null,"Gerência de Operação do PISF-Centro de Controle e Operação (AD / GOI / CCO)"]
[]
[{"$f":"Moveis_Equipamentos!A5","v":"TERMO DE REFERÊNCIA PARA CONTRATAÇÃO DOS RECURSOS NECESSÁRIOS À OPERAÇÃO E MANUTENÇÃO DAS INFRAESTRUTURAS DO EIXO LESTE DO PISF - PROJETO DE INTEGRAÇÃO DO SÃO FRANCISCO COM AS BACIAS HIDROGRÁFICAS DO NORDESTE SETENTRIONAL"}]
[]
[]
["COMPOSIÇÃO DE PREÇO - MÓVEIS E EQUIPAMENTOS"]
[]
["VALOR DE AQUISIÇÃO (*Exceto itens : 1.1, 1.2, 1.3, 1.4, 1.5 e 1.25)",{"$nulls":5},"VALOR DE LOCAÇÃO "]
[]
["ITEM","CÓDIGO","DESCRIÇÃO","UNIDADE","QUANTIDADE","VALOR (R$)","UNIDADE","VALOR (R$)"]
[{"$nulls":5},"UNITARIO",null,"UNITARIO"]
["1."]
["1.1","E209300236-EMBASA/BA","Aluguel de impressora colorida-Laser com cartuchos-formatos A4 e A3 (inclusive suprimentos)","un x mês",{"$f":"Moveis_Equipamentos!E14","v":108},null,"un x mês",{"$f":"IF(F15=\"\",\"\",F15)","v":""}]
["1.2","I8612-SEINFRA/CE","Aluguel de Plotter (inclusive suprimentos)","un x mês",{"$f":"Moveis_Equipamentos!E15","v":12},null,"un x mês",{"$f":"IF(F16=\"\",\"\",F16)","v":""}]
["1.3"," I8610-SEINFRA/CE","Servidor para backup","un x mês",{"$f":"Moveis_Equipamentos!E16","v":12},null,"un x mês",{"$f":"IF(F17=\"\",\"\",F17)","v":""}]
["1.4"," I8610-SEINFRA/CE","Desktop com software-tipo 1 (i7, 1T, 8GB, monitor 19\", S.O. Windows 10 e Office última versão)","un x mês",{"$f":"Moveis_Equipamentos!E17","v":210},null,"un x mês",{"$f":"IF(F18=\"\",\"\",F18)","v":""}]
["1.5"," I8610-SEINFRA/CE","Notebook-tipo 1 (i7, 1T, 8GB, S.O. Windows 10 e Office última versão)","un x mês",{"$f":"Moveis_Equipamentos!E18","v":216},null,"un x mês",{"$f":"IF(F19=\"\",\"\",F19)","v":""}]
["1.6","COT_ANTE","Kit Antena Digital 4K Externa Log 16 elementos Mastro 45cm e cabo coaxial 12m","un",{"$f":"Moveis_Equipamentos!E19/12","v":0.5},null,"un x mês",{"$f":"IF(F20=\"\",\"\",((F20*$C$82))/'MC - VALORES ADICIONAIS'!$B$170)","v":""}]
["1.7","I0123-SEINFRA/CE","Armário de escritório","un",{"$f":"Moveis_Equipamentos!E20/12","v":28.5},null,"un x mês",{"$f":"IF(F21=\"\",\"\",((F21*$C$82))/'MC - VALORES ADICIONAIS'!$B$170)","v":""}]
["1.8","73.72.07-SUDECAP/MG","Bebedouro industrial (canteiro)","un",{"$f":"Moveis_Equipamentos!E21/12","v":1},null,"un x mês",{"$f":"IF(F22=\"\",\"\",((F22*$C$82))/'MC - VALORES ADICIONAIS'!$B$170)","v":""}]
["1.9","11534-ORSE/SE","Cadeira giratória, com braço, tipo executiva","un",{"$f":"Moveis_Equipamentos!E22/12","v":58.5},null,"un x mês",{"$f":"IF(F23=\"\",\"\",((F23*$C$82))/'MC - VALORES ADICIONAIS'!$B$170)","v":""}]
["1.10","11543-ORSE","Cadeira de plástico sem braço, cor branca","un",{"$f":"Moveis_Equipamentos!E23/12","v":11.5},null,"un x mês",{"$f":"IF(F24=\"\",\"\",((F24*$C$82))/'MC - VALORES ADICIONAIS'!$B$170)","v":""}]
["1.11","COT_CAM_FOTO","Câmera fotográfica digital 20 mp 5x HD","un",{"$f":"Moveis_Equipamentos!E24/12","v":1},null,"un x mês",{"$f":"IF(F25=\"\",\"\",((F25*$C$82))/'MC - VALORES ADICIONAIS'!$B$170)","v":""}]
["1.12","COT - CAR - LIX","Lixeira Carro Coletor 120L","un",{"$f":"Moveis_Equipamentos!E25/12","v":2},null,"un x mês",{"$f":"IF(F26=\"\",\"\",((F26*$C$82))/'MC - VALORES ADICIONAIS'!$B$170)","v":""}]
["1.13","COT_CESTO","Cestos Telado de lixo 9,6L","un",{"$f":"Moveis_Equipamentos!E26/12","v":4},null,"un x mês",{"$f":"IF(F27=\"\",\"\",((F27*$C$82))/'MC - VALORES ADICIONAIS'!$B$170)","v":""}]
["1.14","39555-SINAPI/PE","Condicionador de ar 12.000 BTU","un",{"$f":"Moveis_Equipamentos!E27/12","v":20.5},null,"un x mês",{"$f":"IF(F28=\"\",\"\",((F28*$C$82))/'MC - VALORES ADICIONAIS'!$B$170)","v":""}]
["1.15","COT_GPS","GPS com cabo e software (conforme especificação)","un",{"$f":"Moveis_Equipamentos!E28/12","v":1},null,"un x mês",{"$f":"IF(F29=\"\",\"\",((F29*$C$82))/'MC - VALORES ADICIONAIS'!$B$170)","v":""}]
["1.16","COT_MESA_REUN","Mesa de reunião 10 lugares com 10 cadeiras","un",{"$f":"Moveis_Equipamentos!E29/12","v":3.5},null,"un x mês",{"$f":"IF(F30=\"\",\"\",((F30*$C$82))/'MC - VALORES ADICIONAIS'!$B$170)","v":""}]
["1.17","COT_MESA_PVC","Mesa retangular em Polipropileno 119x75cm","un",{"$f":"Moveis_Equipamentos!E30/12","v":3},null,"un x mês",{"$f":"IF(F31=\"\",\"\",((F31*$C$82))/'MC - VALORES ADICIONAIS'!$B$170)","v":""}]
["1.18","COT_MESA_ESCR","Mesas de escritório com gavetas (conforme especificação)","un",{"$f":"Moveis_Equipamentos!E31/12","v":58.5},null,"un x mês",{"$f":"IF(F32=\"\",\"\",((F32*$C$82))/'MC - VALORES ADICIONAIS'!$B$170)","v":""}]
["1.19","F030000293-EMBASA/BA","Projetor multimídia (Datashow)","un",{"$f":"Moveis_Equipamentos!E32/12","v":1},null,"un x mês",{"$f":"IF(F33=\"\",\"\",((F33*$C$82))/'MC - VALORES ADICIONAIS'!$B$170)","v":""}]
["1.20","COT_RACK","Rack para TV até 60 Polegadas 1 Porta","un",{"$f":"Moveis_Equipamentos!E33/12","v":1},null,"un x mês",{"$f":"IF(F34=\"\",\"\",((F34*$C$82))/'MC - VALORES ADICIONAIS'!$B$170)","v":""}]
["1.21","I0122-SEINFRA/CE","Armário de cozinha completo","un",{"$f":"Moveis_Equipamentos!E34/12","v":1},null,"un x mês",{"$f":"IF(F35=\"\",\"\",((F35*$C$82))/'MC - VALORES ADICIONAIS'!$B$170)","v":""}]
["1.22","COT_MES_06","Conjunto de Mesa 1,40 com Tampo MDP com 6 cadeiras","un",{"$f":"Moveis_Equipamentos!E35/12","v":1},null,"un x mês",{"$f":"IF(F36=\"\",\"\",((F36*$C$82))/'MC - VALORES ADICIONAIS'!$B$170)","v":""}]
["1.23","10231-ORSE/SE","Fogão ","un",{"$f":"Moveis_Equipamentos!E36/12","v":1},null,"un x mês",{"$f":"IF(F37=\"\",\"\",((F37*$C$82))/'MC - VALORES ADICIONAIS'!$B$170)","v":""}]
["1.24","029028-IOPES","Cilindro de Gás de Cozinha 45 kg","un",{"$f":"Moveis_Equipamentos!E37/12","v":2.5},null,"un x mês",{"$f":"IF(F38=\"\",\"\",((F38*$C$82))/'MC - VALORES ADICIONAIS'!$B$170)","v":""}]
["1.25","4226-SINAPI/PE","Gás de cozinha-GLP (kg)","kg",{"$f":"Moveis_Equipamentos!E38","v":1350},null,"un x mês",{"$f":"IF(F39=\"\",\"\",F39)","v":""}]
["1.26","F020000716-EMBASA/BA","Geladeira 280 litros","un",{"$f":"Moveis_Equipamentos!E39/12","v":1},null,"un x mês",{"$f":"IF(F40=\"\",\"\",((F40*$C$82))/'MC - VALORES ADICIONAIS'!$B$170)","v":""}]
["1.27","COT_MICROOND","Forno Microondas 20L","un",{"$f":"Moveis_Equipamentos!E40/12","v":1},null,"un x mês",{"$f":"IF(F41=\"\",\"\",((F41*$C$82))/'MC - VALORES ADICIONAIS'!$B$170)","v":""}]
["1.28","COT_FAQUEI","Faqueiro com 24 peças","un",{"$f":"Moveis_Equipamentos!E41/12","v":17},null,"un x mês",{"$f":"IF(F42=\"\",\"\",((F42*$C$82))/'MC - VALORES ADICIONAIS'!$B$170)","v":""}]
["1.29","COT_PRATO","Pratos rasos redondo em cerâmica","un",{"$f":"Moveis_Equipamentos!E42/12","v":39},null,"un x mês",{"$f":"IF(F43=\"\",\"\",((F43*$C$82))/'MC - VALORES ADICIONAIS'!$B$170)","v":""}]
["1.30","COT_COPO","Conjunto  copos em vidro 350ml com 8 unidades","un",{"$f":"Moveis_Equipamentos!E43/12","v":2},null,"un x mês",{"$f":"IF(F44=\"\",\"\",((F44*$C$82))/'MC - VALORES ADICIONAIS'!$B$170)","v":""}]
["1.31","COT_TELEVISOR","Smart Tv LED 32\"","un",{"$f":"Moveis_Equipamentos!E44/12","v":3.5},null,"un x mês",{"$f":"IF(F45=\"\",\"\",((F45*$C$82))/'MC - VALORES ADICIONAIS'!$B$170)","v":""}]
["1.32","AP_JANTAR","Aparelho de jantar para 06 pessoas","un",{"$f":"Moveis_Equipamentos!E45/12","v":6.5},null,"un x mês",{"$f":"IF(F46=\"\",\"\",((F46*$C$82))/'MC - VALORES ADICIONAIS'!$B$170)","v":""}]
["1.33","11645-ORSE/SE","Armário para vestiário, em aço, com 12 portas, com cadeado","un",{"$f":"Moveis_Equipamentos!E46/12","v":1},null,"un x mês",{"$f":"IF(F47=\"\",\"\",((F47*$C$82))/'MC - VALORES ADICIONAIS'!$B$170)","v":""}]
["1.34","COT_CHAP","Chapa gás 65 cm para grelhar","un",{"$f":"Moveis_Equipamentos!E47/12","v":1},null,"un x mês",{"$f":"IF(F48=\"\",\"\",((F48*$C$82))/'MC - VALORES ADICIONAIS'!$B$170)","v":""}]
["1.35","08600-ORSE/SE","Coifa","un",{"$f":"Moveis_Equipamentos!E48/12","v":1},null,"un x mês",{"$f":"IF(F49=\"\",\"\",((F49*$C$82))/'MC - VALORES ADICIONAIS'!$B$170)","v":""}]
["1.36","COT_UTENS","Conjunto de utensílios gadgets inox para cozinha","conj.",{"$f":"Moveis_Equipamentos!E49/12","v":1},null,"un x mês",{"$f":"IF(F50=\"\",\"\",((F50*$C$82))/'MC - VALORES ADICIONAIS'!$B$170)","v":""}]
["1.37","COT_FOGAO","Fogão industrial 6 bocas 30x30 baixa pressão perfil 5","un",{"$f":"Moveis_Equipamentos!E50/12","v":1},null,"un x mês",{"$f":"IF(F51=\"\",\"\",((F51*$C$82))/'MC - VALORES ADICIONAIS'!$B$170)","v":""}]
["1.38","COT_FORNO","Forno elétrico 46L 1500W","un",{"$f":"Moveis_Equipamentos!E51/12","v":1},null,"un x mês",{"$f":"IF(F52=\"\",\"\",((F52*$C$82))/'MC - VALORES ADICIONAIS'!$B$170)","v":""}]
["1.39","F020000719-EMBASA/BA","Freezer 246 l","un",{"$f":"Moveis_Equipamentos!E52/12","v":1},null,"un x mês",{"$f":"IF(F53=\"\",\"\",((F53*$C$82))/'MC - VALORES ADICIONAIS'!$B$170)","v":""}]
["1.40","\t10232-ORSE/SE","Geladeira industrial 300 litros","un",{"$f":"Moveis_Equipamentos!E53/12","v":1},null,"un x mês",{"$f":"IF(F54=\"\",\"\",((F54*$C$82))/'MC - VALORES ADICIONAIS'!$B$170)","v":""}]
["1.41","COT_PANEL","Conjunto de panelas antiaderente com 7 peças","un",{"$f":"Moveis_Equipamentos!E54/12","v":1},null,"un x mês",{"$f":"IF(F55=\"\",\"\",((F55*$C$82))/'MC - VALORES ADICIONAIS'!$B$170)","v":""}]
["1.42","COT_LIQUID","Liquidificadores industriais alta rotação 2L","un",{"$f":"Moveis_Equipamentos!E55/12","v":1},null,"un x mês",{"$f":"IF(F56=\"\",\"\",((F56*$C$82))/'MC - VALORES ADICIONAIS'!$B$170)","v":""}]
["1.43","COT_MAQ_LAVA_LOUCA","Máquina de lavar louças industrial B.30 ","un",{"$f":"Moveis_Equipamentos!E56/12","v":1},null,"un x mês",{"$f":"IF(F57=\"\",\"\",((F57*$C$82))/'MC - VALORES ADICIONAIS'!$B$170)","v":""}]
["1.44","COT_MAQ_LAVA_ROUPA","Máquina de Lavar roupa 11kg ","un",{"$f":"Moveis_Equipamentos!E57/12","v":1},null,"un x mês",{"$f":"IF(F58=\"\",\"\",((F58*$C$82))/'MC - VALORES ADICIONAIS'!$B$170)","v":""}]
["1.45","COT_MESA_BUF","Carrinho Buffet Térmico Self Service Inox 8 cubas","un",{"$f":"Moveis_Equipamentos!E58/12","v":1},null,"un x mês",{"$f":"IF(F59=\"\",\"\",((F59*$C$82))/'MC - VALORES ADICIONAIS'!$B$170)","v":""}]
["1.46","COT_MESA_REFEIT","Mesa de refeitório 10 lugares com cadeiras MDF branco de 25mm","un",{"$f":"Moveis_Equipamentos!E59/12","v":2.5},null,"un x mês",{"$f":"IF(F60=\"\",\"\",((F60*$C$82))/'MC - VALORES ADICIONAIS'!$B$170)","v":""}]
["1.47","COT_REFRESQUEIRA","Refresqueira BBS2 Inox","un",{"$f":"Moveis_Equipamentos!E60/12","v":1},null,"un x mês",{"$f":"IF(F61=\"\",\"\",((F61*$C$82))/'MC - VALORES ADICIONAIS'!$B$170)","v":""}]
["1.48","COT_TABUA","Tábuas para carnes 19x35x1,6cm","un",{"$f":"Moveis_Equipamentos!E61/12","v":1},null,"un x mês",{"$f":"IF(F62=\"\",\"\",((F62*$C$82))/'MC - VALORES ADICIONAIS'!$B$170)","v":""}]
["1.49","COT_CAMA_BOX","Cama box conjugada solteiro","un",{"$f":"Moveis_Equipamentos!E62/12","v":14},null,"un x mês",{"$f":"IF(F63=\"\",\"\",((F63*$C$82))/'MC - VALORES ADICIONAIS'!$B$170)","v":""}]
["1.50","COT_GUARDA_ROUPA","Guarda-Roupa solteiro 4 Portas","un",{"$f":"Moveis_Equipamentos!E63/12","v":1},null,"un x mês",{"$f":"IF(F64=\"\",\"\",((F64*$C$82))/'MC - VALORES ADICIONAIS'!$B$170)","v":""}]
["1.51","COT_ROUPA_CAMA","Jogo de roupa de cama solteiro 100% Algodão","un",{"$f":"Moveis_Equipamentos!E64/12","v":28},null,"un x mês",{"$f":"IF(F65=\"\",\"\",((F65*$C$82))/'MC - VALORES ADICIONAIS'!$B$170)","v":""}]
["1.52","COT_ROUPA_BANHO","Jogo de Roupa de banho 5 Peças","un",{"$f":"Moveis_Equipamentos!E65/12","v":14},null,"un x mês",{"$f":"IF(F66=\"\",\"\",((F66*$C$82))/'MC - VALORES ADICIONAIS'!$B$170)","v":""}]
["1.53","COT_SOFA","Conjunto de sofá 2 e 3 lugares","un",{"$f":"Moveis_Equipamentos!E66/12","v":1},null,"un x mês",{"$f":"IF(F67=\"\",\"\",((F67*$C$82))/'MC - VALORES ADICIONAIS'!$B$170)","v":""}]
["Observações",{"$nulls":8},{"$f":"SUM(H15:H67)","v":0}]
[{"$nulls":9},{"$f":"(J68/2906.02)-1","v":-1}]
[" art. 305 do RIR/1999 esclarece que:\n\n\"Art. 305. Poderá ser computada, como custo ou encargo, em cada período de apuração, a importância correspondente à diminuição do valor dos bens do ativo resultante do desgaste pelo uso, ação da natureza e obsolescência normal (Lei nº 4.506, de 1964, art. 57).\""]
[]
[]
[]
[]
[" Instrução Normativa da Secretaria da Receita Federal (SRF)"]
["Da","Depreciação","Da = (VN - VR) / N"]
["VN","Valor Novo"]
["VR","Valor Residual"]
["N","Vída útil (anos)"]
[]
["DADOS - MÓVEIS  UTENSÍLIOS",null,null,"CONSIDERAÇÕES"]
["Depreciação anual (%)",null,0.4,"*Taxas adotadas dos itens 1.6 até 1.54 (exceto o item 1.25, visto que o valor adotado para gás de cozinha já está com a unidade \"kg\")"]
["Vida últil (anos)",null,2.5]
[]
[]
[]
["1. Valor unitário final = (Depreciação anual) / (Tempo de contrato)"]
["2. A vida útil adotada, leva em consideração o uso serevero dos itens listados, visto que são utilizados em canteiros de obras e frequentemente são deslocados entre canteiros e postos de serviço em campo."]

{"sheet":"Mobilizacao_Desmobilizacao","index":7,"n_rows":42,"n_cols":9,"rows_kept":42,"cut":false,"hidden":false,"merged":[[27,0,27,6],[19,2,19,6],[22,0,22,5],[40,0,40,6],[29,2,29,4],[36,0,37,2],[38,0,38,6],[30,2,30,4],[31,0,31,4],[24,0,24,5],[28,2,28,4],[35,5,35,6],[35,0,35,4],[17,0,17,5],[14,2,14,6],[0,2,0,6],[1,2,1,6],[2,2,2,6],[4,0,5,6],[7,0,7,6],[10,0,11,0],[10,2,11,2],[10,3,11,3],[10,4,11,4],[10,5,10,6],[12,2,12,6],[10,1,11,1],[44,0,44,6],[28,5,28,6],[29,5,29,6],[30,5,30,6],[31,5,31,6],[43,0,43,6],[39,0,39,6],[41,0,41,6],[42,0,42,6],[37,5,37,6]]}
[null,null,"Ministério do Desenvolvimento Regional  - MDR"]
[null,null,"Companhia de Desenvolvimento dos Vales do São Francisco e do Parnaíba"]
[null,null,"Gerência de Operação do PISF - Centro de Controle e Operação (AD / GOI / CCO)"]
[]
[{"$f":"Moveis_Equipamentos!A5","v":"TERMO DE REFERÊNCIA PARA CONTRATAÇÃO DOS RECURSOS NECESSÁRIOS À OPERAÇÃO E MANUTENÇÃO DAS INFRAESTRUTURAS DO EIXO LESTE DO PISF - PROJETO DE INTEGRAÇÃO DO SÃO FRANCISCO COM AS BACIAS HIDROGRÁFICAS DO NORDESTE SETENTRIONAL"}]
[]
[]
["MOBILIZAÇÃO E DESMOBILIZAÇAO"]
[]
[]
["ITEM","CÓDIGO","DESCRIÇÃO","UNIDADE","QUANTIDADE","VALOR (R$)"]
[{"$nulls":5},"UNITARIO","TOTAL"]
[null,null,{"$f":"A8","v":"MOBILIZAÇÃO E DESMOBILIZAÇAO"}]
[]
["1.",null,"MOBILIZAÇÃO (Máquinas, Equipamentos, Ferramentas, Instrumentos, Materiais, Mobiliário)"]
["1.1",null,"Mobilização da Equipe - Canteiro apoio geral (Floresta/PE)","un",1,{"$f":"IF(CPU_MOBILIZAÇAO!I98=0,\"\",CPU_MOBILIZAÇAO!I98)","v":""},{"$f":"IF(F16=\"\",\"\",ROUND(E16*F16,2))","v":""}]
["1.2",null,"Mobilização da Equipe - Canteiro central (Sertânia/PE)","un",1,{"$f":"IF(CPU_MOBILIZAÇAO!I57=0,\"\",CPU_MOBILIZAÇAO!I57)","v":""},{"$f":"IF(F17=\"\",\"\",ROUND(E17*F17,2))","v":""}]
["TOTAL - MOBILIZAÇÃO DA EQUIPE (R$):",{"$nulls":5},{"$f":"SUBTOTAL(9,G16:G17)","v":0}]
[]
["2.",null,"DESMOBILIZAÇÃO (Máquinas, Equip., Ferramentas, Instrumentos, Materiais, Mobiliário)"]
["2.1",null,"Desmobilização da Equipe - Canteiro apoio geral (Floresta/PE)","un",1,{"$f":"F16","v":""},{"$f":"IF(F21=\"\",\"\",ROUND(E21*F21,2))","v":""}]
["2.2",null,"Desmobilização da Equipe - Canteiro central (Sertânia/PE)","un",1,{"$f":"F17","v":""},{"$f":"IF(F22=\"\",\"\",ROUND(E22*F22,2))","v":""}]
["TOTAL - DESMOBILIZAÇÃO DA EQUIPE (R$):",{"$nulls":5},{"$f":"SUBTOTAL(9,G21:G22)","v":0}]
[]
[{"$f":"\"TOTAL - \"&C13&\" - (R$):\"","v":"TOTAL - MOBILIZAÇÃO E DESMOBILIZAÇAO - (R$):"},{"$nulls":5},{"$f":"SUBTOTAL(9,G15:G24)","v":0}]
[]
[]
[{"$f":"\"RESUMO - \"&A$8","v":"RESUMO - MOBILIZAÇÃO E DESMOBILIZAÇAO"}]
["ITEM",null,"DESCRIÇÃO",null,null,"VALOR TOTAL (R$)"]
["01",null,{"$f":"C15","v":"MOBILIZAÇÃO (Máquinas, Equipamentos, Ferramentas, Instrumentos, Materiais, Mobiliário)"},null,null,{"$f":"G18","v":0}]
["02",null,{"$f":"C20","v":"DESMOBILIZAÇÃO (Máquinas, Equip., Ferramentas, Instrumentos, Materiais, Mobiliário)"},null,null,{"$f":"G23","v":0}]
[{"$f":"\"TOTAL GERAL - \"&A$8&\" - (R$):\"","v":"TOTAL GERAL - MOBILIZAÇÃO E DESMOBILIZAÇAO - (R$):"},{"$nulls":4},{"$f":"SUM(F30:G31)","v":0},null,null,230168.14]
[{"$nulls":8},{"$f":"Mob_Desmob/I32","v":0}]
[]
["NOME DO INFORMANTE:",{"$nulls":4},"QUALIFICAÇÃO:\n"]
[]
["ASSINATURA:",{"$nulls":4},"DATA:"]
[]
["OBSERVAÇÃO:"]
["1. Considerou-se na Mobilizaçao: Transporte dos materiais e equipamentos / Instalação de Pessoal, entre outras despesas."]
["2. Considerou-se na Desmobilização: Retirada de máquinas e equipamentos / Demolições e/ou Recuperação de Canteiro, entre outras despesas."]
["3. Mobilização e Desmobilização do Quadro de Pessoal: Será realizada  com os veículos previstos no contrato."]

{"sheet":"CPU_MOBILIZAÇAO","index":8,"n_rows":125,"n_cols":13,"rows_kept":125,"cut":false,"hidden":false,"merged":[[89,0,89,8],[60,0,60,8],[62,0,62,2],[64,0,64,8],[74,0,74,7],[76,0,76,8],[62,4,62,7],[54,3,54,7],[56,0,56,7],[112,0,112,8],[111,0,111,8],[110,0,110,8],[108,0,108,8],[101,7,101,8],[102,7,102,8],[109,0,109,8],[107,0,107,8],[106,0,106,8],[54,0,54,1],[59,0,59,8],[81,0,81,7],[83,0,83,8],[87,0,87,7],[105,0,105,8],[104,7,104,8],[101,0,101,6],[102,0,102,6],[103,0,103,6],[104,0,104,6],[0,0,0,8],[1,0,1,8],[2,0,2,8],[9,0,9,8],[8,0,8,8],[11,0,11,2],[13,0,13,8],[11,4,11,7],[4,0,5,8],[103,7,103,8],[97,0,97,7],[46,0,46,7],[48,0,48,8],[33,0,33,7],[35,0,35,8],[40,0,40,7],[42,0,42,8],[95,3,95,7],[95,0,95,1],[93,0,93,7],[52,0,52,7]]}
["Ministério do Desenvolvimento Regional -MDR"]
["Companhia de Desenvolvimento dos Vales do São Francisco e do Parnaíba"]
["Gerência de Operação do PISF-Centro de Controle e Operação (AD / GOI / CCO)"]
[]
["SERVIÇOS DE OPERAÇÃO E MANUTENÇÃO DAS INFRAESTRUTURAS DO EIXO LESTE DO PROJETO DE INTEGRAÇÃO DO RIO SÃO FRANCISCO COM AS BACIAS HIDROGRÁFICAS DO NORDESTE SETENTRIONAL – PISF"]
[]
[]
[]
["COMPOSIÇÃO DE PREÇO UNITÁRIO-MOBILIZAÇÃO"]
["Local / Canteiros: EIXO LESTE-Canteiro Central (Sertânia/PE)"]
[]
["Distância entre Recife/PE-Canteiro Central (km):",null,null,{"$f":"Canteiros!H18","v":320},"Veloc. Média (km/h):",null,null,null,60]
[]
["EQUIPAMENTO"]
["CÓDIGO","DESCRIÇÃO","MEIO DE\nLOCOMOÇÃO","QUANTIDADE","FU","K","DMT\n(km)","CHP\n(R$)","CUSTO TOTAL\n(R$)"]
["E9592-DNIT/PE","CAMINHÃO TRUCADO (C/ TERCEIRO EIXO) ELETRÔNICO - POTÊNCIA 231CV - PBT = 22000KG - DIST. ENTRE EIXOS 5170 MM - INCLUI CARROCERIA FIXA ABERTA DE MADEIRA","Rodando",{"$f":"(Equipamentos!E85/Equipamentos!E85)*3","v":3},1,1,{"$f":"$D$12","v":320},{"$f":"IF(VLOOKUP(A16,A$117:C$125,3,FALSE)=\"\",\"\",VLOOKUP(A16,A$117:C$125,3,FALSE))","v":""},{"$f":"IF(H16=\"\",\"\",ROUND(D16*(((G16*F16*E16)/$I$12)*H16),2))","v":""},null,null,null,"CAMINHÃO TRUCADO (C/ TERCEIRO EIXO) ELETRÔNICO - POTÊNCIA 231CV - PBT = 22000KG - DIST. ENTRE EIXOS 5170 MM - INCLUI CARROCERIA FIXA ABERTA DE MADEIRA"]
["E9579-DNIT/PE","CAMINHÃO BASCULANTE 10 M3, TRUCADO CABINE SIMPLES, PESO BRUTO TOTAL 23.000 KG, CARGA ÚTIL MÁXIMA 15.935 KG, DISTÂNCIA ENTRE EIXOS 4,80 M, POTÊNCIA 230 CV INCLUSIVE CAÇAMBA METÁLICA ","Rodando",{"$f":"(Equipamentos!E84/Equipamentos!E84)*3","v":3},1,1,{"$f":"$D$12","v":320},{"$f":"IF(VLOOKUP(A17,A$117:C$125,3,FALSE)=\"\",\"\",VLOOKUP(A17,A$117:C$125,3,FALSE))","v":""},{"$f":"IF(H17=\"\",\"\",ROUND(D17*(((G17*F17*E17)/$I$12)*H17),2))","v":""},null,null,null,"CAMINHÃO BASCULANTE 10 M3, TRUCADO CABINE SIMPLES, PESO BRUTO TOTAL 23.000 KG, CARGA ÚTIL MÁXIMA 15.935 KG, DISTÂNCIA ENTRE EIXOS 4,80 M, POTÊNCIA 230 CV INCLUSIVE CAÇAMBA METÁLICA "]
["E9509-DNIT/PE","Caminhão Comboio para lubrificação e abastecimento (melosa), convencional totalmente equipado (Capacidade de Combustível: 5.000 l, Capacidade de Lubrificante: 500 l, Capacidade de Graxa: 200 kg, Capacidade de Água: 300 l, Recipiente para Óleo Usado: 200 l, Compressor de Ar e Bomba- d’agua)","Rodando",{"$f":"Equipamentos!E86/Equipamentos!E86","v":1},1,1,320,"","",null,null,null,"Caminhão guindauto com capacidade de carga até 10,0 t"]
["E9686-DNIT/PE","Caminhão guindauto com capacidade de carga até 10,0 t","Rodando",{"$f":"Equipamentos!E87/Equipamentos!E87","v":1},1,1,320,"","",null,null,null,"Caminhão tanque, capacidade de volume  6000 l e potência 136,0 hp"]
["E9605-DNIT/PE","Caminhão tanque, capacidade de volume  6000 l e potência 136,0 hp","Rodando",{"$f":"(Equipamentos!E88/Equipamentos!E88)*4","v":4},1,1,320,"","",null,null,null,"Carreta Reboque (para embarcação)"]
["A9353-DNIT/PE","Carreta Reboque (para embarcação)","Rodando",{"$f":"('SEGURANÇA DE BARRAGENS'!E37/'SEGURANÇA DE BARRAGENS'!E37)*2","v":2},1,1,320,"","",null,null,null,"Minicarregadeira sobre rodas, potência líquida de 47 hp, capacidade nominal de operação de 646 kg"]
["E9666-DNIT/PE","ESCAVADEIRA HIDRAULICA SOBRE ESTEIRAS CACAMBA 0,40 A 1,20 M3, PESO OPERACIONAL 21,19 T, POTENCIA LIQUIDA 173 HP","Carreta",{"$f":"Equipamentos!E94/Equipamentos!E94+'SEGURANÇA DE BARRAGENS'!E32/'SEGURANÇA DE BARRAGENS'!E32","v":2},1,2,320,"","",null,null,null,"Retroescavadeira sobre rodas com carregadeira, tração 4x4, potência líquida 72 hp, peso operacional mínimo de 7.140 kg, capacidade mínima da carregadeira de 0,79 m³ e da retroescavadeira mínima de 0,18 m³, profundidade de escavação máxima de 4,50 m."]
["E9686-DNIT/PE",{"$f":"Equipamentos!C95","v":"Grupo gerador de 13/14 KVA, 220v, trifásico, silenciado, com 100 metros de cabos e 01 QTA. "},"Guindauto",{"$f":"Equipamentos!E95/Equipamentos!E95","v":1},1,2,320,"","",null,null,null,"Trator de esteiras, potência de 150 hp, peso operacional de 16,7 t, com roda motriz elevada e lâmina com contato de 3,18 m³."]
["E9686-DNIT/PE",{"$f":"Equipamentos!C96","v":"Grupo gerador de 145/160 kVA"},"Guindauto",{"$f":"Equipamentos!E96/Equipamentos!E96","v":1},1,2,320,"","",null,null,null,"Barco tipo Alumínio, 7 m de comprimento, Alumínio soldado, reforçado, borda sem corrimão, chapa de Alumínio 2,00 cm, boca 1,50 cm, borda 0,60 cm. / Motor popa, tipo partida manual, potência 15 hp, aplicação barco Alumínio, características adicionais: válvulas automáticas descompressão, refrigerado a ar, quantidade marchas 2 und, quantidade cilíndro 2 und, capacidade tanque 23 l, tipo motor: 2 tempos, velocidade: 4.500 a 5.800 rpm."]
["E9686-DNIT/PE",{"$f":"Equipamentos!C97","v":"Grupo gerador de 310/340 kVA"},"Guindauto",{"$f":"Equipamentos!E97/Equipamentos!E97","v":1},1,2,320,"",""]
["E9666-DNIT/PE","MOTONIVELADORA POTENCIA BASICA LIQUIDA (PRIMEIRA MARCHA) 171 HP, PESO BRUTO 14768 KG, LARGURA DA LAMINA DE 3,7 M","Carreta",{"$f":"Equipamentos!E105/Equipamentos!E105+'SEGURANÇA DE BARRAGENS'!E31/'SEGURANÇA DE BARRAGENS'!E31","v":2},1,2,320,"",""]
["E9666-DNIT/PE","Grupo Gerador-32,0 kVA, 220 V, trifásico, silenciado, com 100 metros de cabos e 01 QTA. ","Carreta",{"$f":"'SEGURANÇA DE BARRAGENS'!E30/'SEGURANÇA DE BARRAGENS'!E30","v":1},1,2,320,"",""]
["E9666-DNIT/PE","Cavalo Mecânico com Reboque M. Benz Randon LS-1634/45 29,5 t, ou similar","Carreta",{"$f":"Equipamentos!E89/Equipamentos!E89+('SEGURANÇA DE BARRAGENS'!E34/'SEGURANÇA DE BARRAGENS'!E34)","v":2},1,2,320,"",""]
["E9666-DNIT/PE","Retroescavadeira sobre rodas com carregadeira, tração 4x4, potência líquida 72 hp, peso operacional mínimo de 7.140 kg, capacidade mínima da carregadeira de 0,79 m³ e da retroescavadeira mínima de 0,18 m³, profundidade de escavação máxima de 4,50 m.","Carreta",{"$f":"(Equipamentos!E108/Equipamentos!E108)*3","v":3},1,2,320,"",""]
["E9666-DNIT/PE",{"$f":"'SEGURANÇA DE BARRAGENS'!C33","v":"Trator de esteiras, potência de 150 hp, peso operacional de 16,7 t, com roda motriz elevada e lâmina com contato de 3,18 m³."},"Carreta",{"$f":"'SEGURANÇA DE BARRAGENS'!E33/'SEGURANÇA DE BARRAGENS'!E33","v":1},1,2,320,"",""]
["E9666-DNIT/PE","Rolo compactador pé-de-carneiro vibratório, potência 125 hp, peso operacional sem/com lastro 11,95/13,30 t, impacto dinâmico 38,5/22,5 t, largura de trabalho 2,15 m.","Carreta",{"$f":"+('SEGURANÇA DE BARRAGENS'!E35/'SEGURANÇA DE BARRAGENS'!E35)","v":1},1,2,320,"",""]
["A9353-DNIT/PE","Barco tipo Alumínio, 7 m de comprimento, Alumínio soldado, reforçado, borda sem corrimão, chapa de Alumínio 2,00 cm, boca 1,50 cm, borda 0,60 cm. / Motor popa, tipo partida manual, potência 15 hp, aplicação barco Alumínio, características adicionais: válvulas automáticas descompressão, refrigerado a ar, quantidade marchas 2 und, quantidade cilíndro 2 und, capacidade tanque 23 l, tipo motor: 2 tempos, velocidade: 4.500 a 5.800 rpm.","Rodando",{"$f":"('SEGURANÇA DE BARRAGENS'!E36/'SEGURANÇA DE BARRAGENS'!E36)*2","v":2},1,1,320,"",""]
[]
["SUB-TOTAL (R$):"]
[]
["MATERIAL"]
["CÓDIGO","DESCRIÇÃO","UNIDADE","QUANTIDADE",null,null,null,"CUSTO UNIT.\n(R$)","CUSTO TOTAL\n(R$)"]
["SINDUSCON/PE","Alimentação (motorista que vai rodando)","und",{"$f":"SUMIF(C16:C32,\"RODANDO\",D16:D32)","v":16},null,null,null,{"$f":"IF($C$124=\"\",\"\",$C$124)","v":""},{"$f":"IF(H38=\"\",\"\",ROUND(D38*H38,2))","v":""}]
["SINDUSCON/PE","Alimentação (motorista que retorna)","und",{"$f":"SUMIF(C16:C32,\"CARRETA\",D16:D32)+SUMIF(C16:C32,\"REBOQUE\",D16:D32)+SUMIF(C16:C32,\"GUINDAUTO\",D16:D32)","v":15},null,null,null,{"$f":"IF($C$124=\"\",\"\",$C$124)","v":""},{"$f":"IF(H39=\"\",\"\",ROUND(D39*H39,2))","v":""}]
[]
["SUB-TOTAL (R$):"]
[]
["SERVIÇOS-COMPOSIÇÕES AUXILIARES"]
["CÓDIGO","DESCRIÇÃO","UNIDADE","QUANTIDADE",null,null,null,"CUSTO UNIT.\n(R$)","CUSTO TOTAL\n(R$)"]
[]
[]
["SUB-TOTAL (R$):"]
[]
["MÃO DE OBRA"]
["CÓDIGO","DESCRIÇÃO","UNIDADE","QUANTIDADE",null,null,null,"CUSTO UNIT.\n(R$)","CUSTO TOTAL\n(R$)"]
[]
[]
["SUB-TOTAL (R$):"]
[]
["PRODUÇÃO DA EQUIPE:",null,1,"CUSTO (R$):",{"$nulls":4},{"$f":"I53+I47+I41+I34","v":0}]
[]
["TOTAL-COMPOSIÇÃO DE PREÇO UNITÁRIO-MOBILIZAÇÃO-(R$):"]
[]
[]
["COMPOSIÇÃO DE PREÇO UNITÁRIO-MOBILIZAÇÃO"]
["Local / Canteiros: EIXO LESTE-Canteiro apoio geral (Floresta/PE)"]
[]
["Distância entre Recife/PE-Canteiro apoio geral (km):",null,null,{"$f":"Canteiros!H13","v":472},"Veloc. Média (km/h):",null,null,null,60]
[]
["EQUIPAMENTO"]
["CÓDIGO","DESCRIÇÃO","MEIO DE\nLOCOMOÇÃO","QUANTIDADE","FU","K","DMT\n(km)","CHP\n(R$)","CUSTO TOTAL\n(R$)"]
["E9592-DNIT/PE","CAMINHÃO TRUCADO (C/ TERCEIRO EIXO) ELETRÔNICO - POTÊNCIA 231CV - PBT = 22000KG - DIST. ENTRE EIXOS 5170 MM - INCLUI CARROCERIA FIXA ABERTA DE MADEIRA","Rodando",{"$f":"Equipamentos!E85/Equipamentos!E85","v":1},1,1,{"$f":"$D$63","v":472},{"$f":"IF(VLOOKUP(A67,A$117:C$125,3,FALSE)=\"\",\"\",VLOOKUP(A67,A$117:C$125,3,FALSE))","v":""},{"$f":"IF(H67=\"\",\"\",ROUND(D67*(((G67*F67*E67)/$I$12)*H67),2))","v":""}]
["E9579-DNIT/PE","CAMINHÃO BASCULANTE 10 M3, TRUCADO CABINE SIMPLES, PESO BRUTO TOTAL 23.000 KG, CARGA ÚTIL MÁXIMA 15.935 KG, DISTÂNCIA ENTRE EIXOS 4,80 M, POTÊNCIA 230 CV INCLUSIVE CAÇAMBA METÁLICA ","Rodando",{"$f":"Equipamentos!E84/Equipamentos!E84","v":1},1,1,{"$f":"$D$63","v":472},{"$f":"IF(VLOOKUP(A68,A$117:C$125,3,FALSE)=\"\",\"\",VLOOKUP(A68,A$117:C$125,3,FALSE))","v":""},{"$f":"IF(H68=\"\",\"\",ROUND(D68*(((G68*F68*E68)/$I$12)*H68),2))","v":""}]
["E9686-DNIT/PE","Caminhão guindauto com capacidade de carga até 10,0 t","Rodando",{"$f":"Equipamentos!E87/Equipamentos!E87","v":1},1,1,{"$f":"$D$63","v":472},"",""]
["E9605-DNIT/PE","Caminhão tanque, capacidade de volume  6000 l e potência 136,0 hp","Rodando",{"$f":"Equipamentos!E88/Equipamentos!E88","v":1},1,1,{"$f":"$D$63","v":472},"",""]
["A9353-DNIT/PE","Carreta Reboque (para embarcação)","Rodando",{"$f":"'SEGURANÇA DE BARRAGENS'!E37/'SEGURANÇA DE BARRAGENS'!E37","v":1},1,1,{"$f":"$D$63","v":472},"",""]
["E9666-DNIT/PE","Retroescavadeira sobre rodas com carregadeira, tração 4x4, potência líquida 72 hp, peso operacional mínimo de 7.140 kg, capacidade mínima da carregadeira de 0,79 m³ e da retroescavadeira mínima de 0,18 m³, profundidade de escavação máxima de 4,50 m.","Carreta",{"$f":"(Equipamentos!E108/Equipamentos!E108)*1","v":1},1,2,{"$f":"$D$12","v":320},"",""]
["A9353-DNIT/PE","Barco tipo Alumínio, 7 m de comprimento, Alumínio soldado, reforçado, borda sem corrimão, chapa de Alumínio 2,00 cm, boca 1,50 cm, borda 0,60 cm. / Motor popa, tipo partida manual, potência 15 hp, aplicação barco Alumínio, características adicionais: válvulas automáticas descompressão, refrigerado a ar, quantidade marchas 2 und, quantidade cilíndro 2 und, capacidade tanque 23 l, tipo motor: 2 tempos, velocidade: 4.500 a 5.800 rpm.","Rodando",{"$f":"'SEGURANÇA DE BARRAGENS'!E36/'SEGURANÇA DE BARRAGENS'!E36","v":1},1,1,{"$f":"$D$63","v":472},"",""]
[]
["SUB-TOTAL (R$):",{"$nulls":7},{"$f":"SUBTOTAL(9,I67:I73)","v":0}]
[]
["MATERIAL"]
["CÓDIGO","DESCRIÇÃO","UNIDADE","QUANTIDADE",null,null,null,"CUSTO UNIT.\n(R$)","CUSTO TOTAL\n(R$)"]
["SINDUSCON/PE","Alimentação (motorista que vai rodando)","und",{"$f":"SUMIF(C67:C73,\"RODANDO\",D67:D73)","v":6},null,null,null,{"$f":"IF($C$124=\"\",\"\",$C$124)","v":""},{"$f":"IF(H79=\"\",\"\",ROUND(D79*H79,2))","v":""}]
["SINDUSCON/PE","Alimentação (motorista que retorna)","und",{"$f":"SUMIF(C67:C73,\"CARRETA\",D67:D73)+SUMIF(C67:C73,\"REBOQUE\",D67:D73)+SUMIF(C67:C73,\"GUINDAUTO\",D67:D73)","v":1},null,null,null,{"$f":"IF($C$124=\"\",\"\",$C$124)","v":""},{"$f":"IF(H80=\"\",\"\",ROUND(D80*H80,2))","v":""}]
[]
["SUB-TOTAL (R$):",{"$nulls":7},{"$f":"SUM(I79:I81)","v":0}]
[]
["SERVIÇOS-COMPOSIÇÕES AUXILIARES"]
["CÓDIGO","DESCRIÇÃO","UNIDADE","QUANTIDADE",null,null,null,"CUSTO UNIT.\n(R$)","CUSTO TOTAL\n(R$)"]
[]
[]
["SUB-TOTAL (R$):",{"$nulls":7},0]
[]
["MÃO DE OBRA"]
["CÓDIGO","DESCRIÇÃO","UNIDADE","QUANTIDADE",null,null,null,"CUSTO UNIT.\n(R$)","CUSTO TOTAL\n(R$)"]
[]
[]
["SUB-TOTAL (R$):",{"$nulls":7},0]
[]
["PRODUÇÃO DA EQUIPE:",null,1,"CUSTO (R$):",{"$nulls":4},{"$f":"I94+I88+I82+I75","v":0}]
[]
["TOTAL-COMPOSIÇÃO DE PREÇO UNITÁRIO-MOBILIZAÇÃO-(R$):",{"$nulls":7},{"$f":"ROUND(I96*C96,2)","v":0}]
[]
[]
[]
["NOME DO INFORMANTE:",{"$nulls":6},"QUALIFICAÇÃO:"]
[]
["ASSINATURA:",{"$nulls":6},"DATA:"]
{"$rows_empty":11}
["Código","Descrição","R$/h"]
["E9592-DNIT/PE","Caminhão carroceria com capacidade de 15 t-188 kW",null,"ok"]
["E9579-DNIT/PE","Caminhão basculante com capacidade de 10 m³-188 kW",null,"ok"]
["E9509-DNIT/PE","Caminhão tanque distribuidor de asfalto com capacidade de 6.000 l-7 kW/136 kW",null,"ok"]
["E9686-DNIT/PE","Caminhão carroceria com guindauto com capacidade de 20 t.m-136 kW"]
["E9605-DNIT/PE","Caminhão tanque com capacidade de 6.000 l-136 kW",null,"ok"]
["A9353-DNIT/PE","Semirreboque com 2 eixos",null,"ok"]
["E9666-DNIT/PE","Cavalo mecânico com semirreboque com capacidade de 30 t-265 kW",null,"ok"]
["SINDCON/PE","Alimentação (motorista que vai rodando)-Convenção Coletiva de Trabalho 2021-2023-SINDCON/PE (Cláusula 19ª)"]
[{"$nulls":4},{"$f":"SUM(C117:C124)","v":0}]

{"sheet":"CPU_DESMOBILIZAÇAO","index":9,"n_rows":125,"n_cols":13,"rows_kept":125,"cut":false,"hidden":false,"merged":[[40,0,40,7],[0,0,0,8],[1,0,1,8],[2,0,2,8],[4,0,5,8],[8,0,8,8],[9,0,9,8],[11,0,11,2],[11,4,11,7],[13,0,13,8],[33,0,33,7],[35,0,35,8],[42,0,42,8],[46,0,46,7],[48,0,48,8],[52,0,52,7],[54,0,54,1],[54,3,54,7],[89,0,89,8],[56,0,56,7],[59,0,59,8],[60,0,60,8],[62,0,62,2],[62,4,62,7],[64,0,64,8],[74,0,74,7],[76,0,76,8],[81,0,81,7],[83,0,83,8],[87,0,87,7],[93,0,93,7],[95,0,95,1],[95,3,95,7],[97,0,97,7],[101,0,101,6],[101,7,101,8],[102,0,102,6],[102,7,102,8],[103,0,103,6],[103,7,103,8],[104,0,104,6],[104,7,104,8],[111,0,111,8],[112,0,112,8],[105,0,105,8],[106,0,106,8],[107,0,107,8],[108,0,108,8],[109,0,109,8],[110,0,110,8]]}
["Ministério do Desenvolvimento Regional -MDR"]
["Companhia de Desenvolvimento dos Vales do São Francisco e do Parnaíba"]
["Gerência de Operação do PISF-Centro de Controle e Operação (AD / GOI / CCO)"]
[]
["SERVIÇOS DE OPERAÇÃO E MANUTENÇÃO DAS INFRAESTRUTURAS DO EIXO LESTE DO PROJETO DE INTEGRAÇÃO DO RIO SÃO FRANCISCO COM AS BACIAS HIDROGRÁFICAS DO NORDESTE SETENTRIONAL – PISF"]
[]
[]
[]
["COMPOSIÇÃO DE PREÇO UNITÁRIO-DESMOBILIZAÇÃO"]
["Local / Canteiros: EIXO LESTE-Canteiro Central (Sertânia/PE)"]
[]
["Distância entre Recife/PE-Canteiro Central (km):",null,null,320,"Veloc. Média (km/h):",null,null,null,60]
[]
["EQUIPAMENTO"]
["CÓDIGO","DESCRIÇÃO","MEIO DE\nLOCOMOÇÃO","QUANTIDADE","FU","K","DMT\n(km)","CHP\n(R$)","CUSTO TOTAL\n(R$)"]
["E9592-DNIT/PE","CAMINHÃO TRUCADO (C/ TERCEIRO EIXO) ELETRÔNICO - POTÊNCIA 231CV - PBT = 22000KG - DIST. ENTRE EIXOS 5170 MM - INCLUI CARROCERIA FIXA ABERTA DE MADEIRA","Rodando",3,1,1,320,{"$nulls":5},"CAMINHÃO TRUCADO (C/ TERCEIRO EIXO) ELETRÔNICO - POTÊNCIA 231CV - PBT = 22000KG - DIST. ENTRE EIXOS 5170 MM - INCLUI CARROCERIA FIXA ABERTA DE MADEIRA"]
["E9579-DNIT/PE","CAMINHÃO BASCULANTE 10 M3, TRUCADO CABINE SIMPLES, PESO BRUTO TOTAL 23.000 KG, CARGA ÚTIL MÁXIMA 15.935 KG, DISTÂNCIA ENTRE EIXOS 4,80 M, POTÊNCIA 230 CV INCLUSIVE CAÇAMBA METÁLICA ","Rodando",3,1,1,320,{"$nulls":5},"CAMINHÃO BASCULANTE 10 M3, TRUCADO CABINE SIMPLES, PESO BRUTO TOTAL 23.000 KG, CARGA ÚTIL MÁXIMA 15.935 KG, DISTÂNCIA ENTRE EIXOS 4,80 M, POTÊNCIA 230 CV INCLUSIVE CAÇAMBA METÁLICA "]
["E9509-DNIT/PE","Caminhão Comboio para lubrificação e abastecimento (melosa), convencional totalmente equipado (Capacidade de Combustível: 5.000 l, Capacidade de Lubrificante: 500 l, Capacidade de Graxa: 200 kg, Capacidade de Água: 300 l, Recipiente para Óleo Usado: 200 l, Compressor de Ar e Bomba- d’agua)","Rodando",0.5,1,1,320,{"$nulls":5},"Caminhão guindauto com capacidade de carga até 10,0 t"]
["E9686-DNIT/PE","Caminhão guindauto com capacidade de carga até 10,0 t","Rodando",1,1,1,320,{"$nulls":5},"Caminhão tanque, capacidade de volume  6000 l e potência 136,0 hp"]
["E9605-DNIT/PE","Caminhão tanque, capacidade de volume  6000 l e potência 136,0 hp","Rodando",4,1,1,320,{"$nulls":5},"Carreta Reboque (para embarcação)"]
["A9353-DNIT/PE","Carreta Reboque (para embarcação)","Rodando",1,1,1,320,{"$nulls":5},"Minicarregadeira sobre rodas, potência líquida de 47 hp, capacidade nominal de operação de 646 kg"]
["E9666-DNIT/PE","ESCAVADEIRA HIDRAULICA SOBRE ESTEIRAS CACAMBA 0,40 A 1,20 M3, PESO OPERACIONAL 21,19 T, POTENCIA LIQUIDA 173 HP","Carreta",1.5,1,2,320,{"$nulls":5},"Retroescavadeira sobre rodas com carregadeira, tração 4x4, potência líquida 72 hp, peso operacional mínimo de 7.140 kg, capacidade mínima da carregadeira de 0,79 m³ e da retroescavadeira mínima de 0,18 m³, profundidade de escavação máxima de 4,50 m."]
["E9686-DNIT/PE","Grupo gerador de 13/14 KVA, 220v, trifásico, silenciado, com 100 metros de cabos e 01 QTA. ","Guindauto",0.5,1,2,320,{"$nulls":5},"Trator de esteiras, potência de 150 hp, peso operacional de 16,7 t, com roda motriz elevada e lâmina com contato de 3,18 m³."]
["E9686-DNIT/PE","Grupo gerador de 145/160 kVA","Guindauto",0.5,1,2,320,{"$nulls":5},"Barco tipo Alumínio, 7 m de comprimento, Alumínio soldado, reforçado, borda sem corrimão, chapa de Alumínio 2,00 cm, boca 1,50 cm, borda 0,60 cm. / Motor popa, tipo partida manual, potência 15 hp, aplicação barco Alumínio, características adicionais: válvulas automáticas descompressão, refrigerado a ar, quantidade marchas 2 und, quantidade cilíndro 2 und, capacidade tanque 23 l, tipo motor: 2 tempos, velocidade: 4.500 a 5.800 rpm."]
["E9686-DNIT/PE","Grupo gerador de 310/340 kVA","Guindauto",0.5,1,2,320]
["E9666-DNIT/PE","MOTONIVELADORA POTENCIA BASICA LIQUIDA (PRIMEIRA MARCHA) 171 HP, PESO BRUTO 14768 KG, LARGURA DA LAMINA DE 3,7 M","Carreta",1.5,1,2,320]
["E9666-DNIT/PE","Grupo Gerador-32,0 kVA, 220 V, trifásico, silenciado, com 100 metros de cabos e 01 QTA. ","Carreta",0.5,1,2,320]
["E9666-DNIT/PE","Cavalo Mecânico com Reboque M. Benz Randon LS-1634/45 29,5 t, ou similar","Carreta",1,1,2,320]
["E9666-DNIT/PE","Retroescavadeira sobre rodas com carregadeira, tração 4x4, potência líquida 72 hp, peso operacional mínimo de 7.140 kg, capacidade mínima da carregadeira de 0,79 m³ e da retroescavadeira mínima de 0,18 m³, profundidade de escavação máxima de 4,50 m.","Carreta",3,1,2,320]
["E9666-DNIT/PE","Trator de esteiras, potência de 150 hp, peso operacional de 16,7 t, com roda motriz elevada e lâmina com contato de 3,18 m³.","Carreta",1,1,2,320]
["E9666-DNIT/PE","Rolo compactador pé-de-carneiro vibratório, potência 125 hp, peso operacional sem/com lastro 11,95/13,30 t, impacto dinâmico 38,5/22,5 t, largura de trabalho 2,15 m.","Carreta",0.5,1,2,320]
["A9353-DNIT/PE","Barco tipo Alumínio, 7 m de comprimento, Alumínio soldado, reforçado, borda sem corrimão, chapa de Alumínio 2,00 cm, boca 1,50 cm, borda 0,60 cm. / Motor popa, tipo partida manual, potência 15 hp, aplicação barco Alumínio, características adicionais: válvulas automáticas descompressão, refrigerado a ar, quantidade marchas 2 und, quantidade cilíndro 2 und, capacidade tanque 23 l, tipo motor: 2 tempos, velocidade: 4.500 a 5.800 rpm.","Rodando",1,1,1,320]
[]
["SUB-TOTAL (R$):"]
[]
["MATERIAL"]
["CÓDIGO","DESCRIÇÃO","UNIDADE","QUANTIDADE",null,null,null,"CUSTO UNIT.\n(R$)","CUSTO TOTAL\n(R$)"]
["SINDUSCON/PE","Alimentação (motorista que vai rodando)","und",13.5]
["SINDUSCON/PE","Alimentação (motorista que retorna)","und",10.5]
[]
["SUB-TOTAL (R$):"]
[]
["SERVIÇOS-COMPOSIÇÕES AUXILIARES"]
["CÓDIGO","DESCRIÇÃO","UNIDADE","QUANTIDADE",null,null,null,"CUSTO UNIT.\n(R$)","CUSTO TOTAL\n(R$)"]
[]
[]
["SUB-TOTAL (R$):"]
[]
["MÃO DE OBRA"]
["CÓDIGO","DESCRIÇÃO","UNIDADE","QUANTIDADE",null,null,null,"CUSTO UNIT.\n(R$)","CUSTO TOTAL\n(R$)"]
[]
[]
["SUB-TOTAL (R$):"]
[]
["PRODUÇÃO DA EQUIPE:",null,1,"CUSTO (R$):"]
[]
["TOTAL-COMPOSIÇÃO DE PREÇO UNITÁRIO-DESMOBILIZAÇÃO-(R$):"]
[]
[]
["COMPOSIÇÃO DE PREÇO UNITÁRIO-DESMOBILIZAÇÃO"]
["Local / Canteiros: EIXO LESTE-Canteiro apoio geral (Floresta/PE)"]
[]
["Distância entre Recife/PE-Canteiro apoio geral (km):",null,null,472,"Veloc. Média (km/h):",null,null,null,60]
[]
["EQUIPAMENTO"]
["CÓDIGO","DESCRIÇÃO","MEIO DE\nLOCOMOÇÃO","QUANTIDADE","FU","K","DMT\n(km)","CHP\n(R$)","CUSTO TOTAL\n(R$)"]
["E9592-DNIT/PE","CAMINHÃO TRUCADO (C/ TERCEIRO EIXO) ELETRÔNICO - POTÊNCIA 231CV - PBT = 22000KG - DIST. ENTRE EIXOS 5170 MM - INCLUI CARROCERIA FIXA ABERTA DE MADEIRA","Rodando",1,1,1,472]
["E9579-DNIT/PE","CAMINHÃO BASCULANTE 10 M3, TRUCADO CABINE SIMPLES, PESO BRUTO TOTAL 23.000 KG, CARGA ÚTIL MÁXIMA 15.935 KG, DISTÂNCIA ENTRE EIXOS 4,80 M, POTÊNCIA 230 CV INCLUSIVE CAÇAMBA METÁLICA ","Rodando",1,1,1,472]
["E9686-DNIT/PE","Caminhão guindauto com capacidade de carga até 10,0 t","Rodando",1,1,1,472]
["E9605-DNIT/PE","Caminhão tanque, capacidade de volume  6000 l e potência 136,0 hp","Rodando",1,1,1,472]
["A9353-DNIT/PE","Carreta Reboque (para embarcação)","Rodando",0.5,1,1,472]
["E9666-DNIT/PE","Retroescavadeira sobre rodas com carregadeira, tração 4x4, potência líquida 72 hp, peso operacional mínimo de 7.140 kg, capacidade mínima da carregadeira de 0,79 m³ e da retroescavadeira mínima de 0,18 m³, profundidade de escavação máxima de 4,50 m.","Carreta",1,1,2,320]
["A9353-DNIT/PE","Barco tipo Alumínio, 7 m de comprimento, Alumínio soldado, reforçado, borda sem corrimão, chapa de Alumínio 2,00 cm, boca 1,50 cm, borda 0,60 cm. / Motor popa, tipo partida manual, potência 15 hp, aplicação barco Alumínio, características adicionais: válvulas automáticas descompressão, refrigerado a ar, quantidade marchas 2 und, quantidade cilíndro 2 und, capacidade tanque 23 l, tipo motor: 2 tempos, velocidade: 4.500 a 5.800 rpm.","Rodando",0.5,1,1,472]
[]
["SUB-TOTAL (R$):"]
[]
["MATERIAL"]
["CÓDIGO","DESCRIÇÃO","UNIDADE","QUANTIDADE",null,null,null,"CUSTO UNIT.\n(R$)","CUSTO TOTAL\n(R$)"]
["SINDUSCON/PE","Alimentação (motorista que vai rodando)","und",5]
["SINDUSCON/PE","Alimentação (motorista que retorna)","und",1]
[]
["SUB-TOTAL (R$):"]
[]
["SERVIÇOS-COMPOSIÇÕES AUXILIARES"]
["CÓDIGO","DESCRIÇÃO","UNIDADE","QUANTIDADE",null,null,null,"CUSTO UNIT.\n(R$)","CUSTO TOTAL\n(R$)"]
[]
[]
["SUB-TOTAL (R$):"]
[]
["MÃO DE OBRA"]
["CÓDIGO","DESCRIÇÃO","UNIDADE","QUANTIDADE",null,null,null,"CUSTO UNIT.\n(R$)","CUSTO TOTAL\n(R$)"]
[]
[]
["SUB-TOTAL (R$):"]
[]
["PRODUÇÃO DA EQUIPE:",null,1,"CUSTO (R$):"]
[]
["TOTAL-COMPOSIÇÃO DE PREÇO UNITÁRIO-DESMOBILIZAÇÃO-(R$):"]
[]
[]
[]
["NOME DO INFORMANTE:",{"$nulls":6},"QUALIFICAÇÃO:"]
[]
["ASSINATURA:",{"$nulls":6},"DATA:"]
[]
["OBSERVAÇÃO:"]
["1. Fonte de Preços: Sistemas de Custos Referenciais de Obras-DNIT/PE (Tabela SICRO/PE). Data base: Janeiro/2022."]
["1. Fonte de Preços: SINAPI/PE. Data base: Abril/2022."]
["2. Para o Cálculo do Custo da Mobilização foi utilizada a metodologia do DNIT/PE."]
["3. Distância considerada a partir da capital mais próxima ao canteiro"]
[]
[]
[]
[]
[]
["Código","Descrição","R$/h"]
["E9592-DNIT/PE","Caminhão carroceria com capacidade de 15 t-188 kW",248.2681,"ok"]
["E9579-DNIT/PE","Caminhão basculante com capacidade de 10 m³-188 kW",249.494,"ok"]
["E9509-DNIT/PE","Caminhão tanque distribuidor de asfalto com capacidade de 6.000 l-7 kW/136 kW",244.79,"ok"]
["E9686-DNIT/PE","Caminhão carroceria com guindauto com capacidade de 20 t.m-136 kW",279.49]
["E9605-DNIT/PE","Caminhão tanque com capacidade de 6.000 l-136 kW",234.19,"ok"]
["A9353-DNIT/PE","Semirreboque com 2 eixos",55.605600000000003,"ok"]
["E9666-DNIT/PE","Cavalo mecânico com semirreboque com capacidade de 30 t-265 kW",378.45,"ok"]
["SINDCON/PE","Alimentação (motorista que vai rodando)-Convenção Coletiva de Trabalho 2021-2023-SINDCON/PE (Cláusula 19ª)",16.5]
[{"$nulls":4},{"$f":"SUM(C117:C124)","v":1706.7877000000001}]

{"sheet":"Canteiros","index":10,"n_rows":31,"n_cols":8,"rows_kept":31,"cut":false,"hidden":false,"merged":[[12,3,16,3],[12,6,16,6],[12,7,16,7],[17,1,25,1],[17,2,25,2],[17,3,25,3],[17,6,25,6],[17,7,25,7],[29,6,29,7],[27,6,27,7],[28,6,28,7],[26,6,26,7],[4,0,5,7],[7,0,7,7],[10,0,11,0],[10,1,11,1],[10,4,11,4],[10,3,11,3],[10,6,10,7],[10,5,11,5],[17,0,25,0],[12,0,16,0],[12,1,16,1],[12,2,16,2]]}
[null,null,null,"Ministério do Desenvolvimento Regional  - MDR"]
[null,null,null,"Companhia de Desenvolvimento dos Vales do São Francisco e do Parnaíba"]
[null,null,null,"Gerência de Operação do PISF - Centro de Controle e Operação (AD / GOI / CCO)"]
[]
[{"$f":"Mobilizacao_Desmobilizacao!A5","v":"TERMO DE REFERÊNCIA PARA CONTRATAÇÃO DOS RECURSOS NECESSÁRIOS À OPERAÇÃO E MANUTENÇÃO DAS INFRAESTRUTURAS DO EIXO LESTE DO PISF - PROJETO DE INTEGRAÇÃO DO SÃO FRANCISCO COM AS BACIAS HIDROGRÁFICAS DO NORDESTE SETENTRIONAL"}]
[]
[]
["CANTEIROS - INFORMAÇÕES COMPLEMENTARES"]
[]
[]
["ITEM","CANTEIRO",null,"TRECHO","RESERVATÓRIOS","ESTAÇÕES DE\nBOMBEAMENTO","LOCALIZAÇÃO"]
[{"$nulls":6},"CAPITAL MAIS PRÓXIMA","DIST. ATÉ CAPITAL (km)"]
[1,"Canteiro apoio geral (Reforma e / ou Construção)","Floresta / PE","Trecho 1 - Do reservatório de Itaparica até o canal 2213","Areias","EBV-1","Recife / PE",472]
[{"$nulls":4},"Braúnas","EBV-2"]
[{"$nulls":4},"Mandantes","EBV-3"]
[{"$nulls":4},"Salgueiro"]
[{"$nulls":4},"Muquem"]
[2,"Canteiro Central (Reforma e / ou Construção)","Sertânia / PE","Trecho 2 - De Reservatório Cacimba Nova até Monteiro/PB.","Cacimba Nova","EBV-4","Recife / PE",320]
[{"$nulls":4},"Bagres"]
[{"$nulls":4},"Copiti"]
[{"$nulls":4},"Moxotó","EBV-5"]
[{"$nulls":4},"Barreiro","EBV-6"]
[{"$nulls":4},"Campos"]
[{"$nulls":4},"Barro Branco"]
[{"$nulls":4},"Monteiro"]
[{"$nulls":4},"Monteiro"]
["NOME DO INFORMANTE:",{"$nulls":5},"QUALIFICAÇÃO:"]
[]
["ASSINATURA:",{"$nulls":5},"DATA:"]
[]
["OBSERVAÇAO:"]

{"sheet":"Mao_de_Obra","index":11,"n_rows":75,"n_cols":9,"rows_kept":75,"cut":false,"hidden":false,"merged":[[77,0,77,6],[60,0,60,4],[61,0,61,4],[62,0,62,4],[63,0,63,4],[60,5,60,6],[61,5,61,6],[62,5,62,6],[63,5,63,6],[64,0,64,6],[75,0,75,6],[76,0,76,6],[65,0,65,6],[66,0,67,6],[68,0,69,6],[70,0,70,6],[10,5,10,6],[12,2,12,6],[51,0,51,5],[10,0,11,0],[10,2,11,2],[10,3,11,3],[10,4,11,4],[10,1,11,1],[0,2,0,6],[1,2,1,6],[2,2,2,6],[4,0,5,6],[7,0,7,6],[54,0,54,6],[55,2,55,4],[55,5,55,6],[56,2,56,4],[56,5,56,6],[71,0,72,6],[73,0,73,6],[74,0,74,6],[57,0,57,4],[57,5,57,6]]}
[null,null,"Ministério do Desenvolvimento Regional  - MDR"]
[null,null,"Companhia de Desenvolvimento dos Vales do São Francisco e do Parnaíba"]
[null,null,"Gerência de Operação do PISF - Centro de Controle e Operação (AD / GOI / CCO)"]
[]
[{"$f":"ORCAMENTO_RESUMO!A5","v":"TERMO DE REFERÊNCIA PARA CONTRATAÇÃO DOS RECURSOS NECESSÁRIOS À OPERAÇÃO E MANUTENÇÃO DAS INFRAESTRUTURAS DO EIXO LESTE DO PISF - PROJETO DE INTEGRAÇÃO DO SÃO FRANCISCO COM AS BACIAS HIDROGRÁFICAS DO NORDESTE SETENTRIONAL"}]
[]
[]
["EQUIPE - MÃO DE OBRA"]
[]
[]
["ITEM","CÓDIGO","DESCRIÇÃO","UNIDADE","QUANTIDADE","VALOR (R$)"]
[{"$nulls":5},"UNITARIO","TOTAL"]
["1.",null,"EQUIPE - MÃO DE OBRA"]
["1.1","A1","Almoxarife","homem x mês",6,null,null,47118.6]
["1.2","A1","Auxiliar Administrativo","homem x mês",6,null,null,188474.4]
["1.3","A9","Auxiliar de serviços gerais","homem x mês",36,null,null,466871.03999999998]
["1.4","T3","Auxiliar de Topografia","homem x mês",12,null,null,105009.36]
["1.5","A8","Carpinteiro","homem x mês",12,null,null,136999.44]
["1.6","CA","Coordenador - Chefe de Escritório","homem x mês",6,null,null,82067.759999999995]
["1.7","P0","Coordenador - Engenheiro Sênior (Civil / Eletricista / Mecânico) ","homem x mês",6,null,null,374418.84]
["1.8","P1","Coordenador Manutenção - Engenheiro Pleno (Civil / Eletricista / Mecânico) ","homem x mês",6,null,null,266942.76]
["1.9","P1","Coordenador Operação - Engenheiro Pleno (Civil / Eletricista / Mecânico) ","homem x mês",6,null,null,266942.76]
["1.10","A5","Eletricista","homem x mês",12,null,null,139231.44]
["1.11","A5","Eletricista (inclusive adicional de periculosidade)","homem x mês",18,null,null,844670.4]
["1.12","P1","Engenheiro de Segurança e Medicina do Trabalho (inclusive adicional de periculosidade)","homem x mês",6,null,null,347025.6]
["1.13","P2","Engenheiro Junior ","homem x mês",24,null,null,1235866.32]
["1.14","P1","Engenheiro Pleno ","homem x mês",36,null,null,3203313.12]
["1.15","A7","Ferreiro","homem x mês",6,null,null,137722.32]
["1.16","P1","Geólogo  (Geotecnia)","homem x mês",6,null,null,266942.76]
["1.17","P2","Médico do Trabalho","homem x mês",6,null,null,266942.76]
["1.18","A3","Motorista","homem x mês",6,null,null,62155.56]
["1.19","A6","Pedreiro","homem x mês",24,null,null,322656.59999999998]
["1.20","A11","Servente","homem x mês",360,null,null,4588992]
["1.21","T2","Técnico Automação - Especialista em SDSC (inclusive adicional de periculosidade)","homem x mês",6,null,null,99377.16]
["1.22","T3","Técnico Auxiliar","homem x mês",36,null,null,630056.16]
["1.23","T3","Técnico Auxiliar (inclusive adicional de periculosidade)","homem x mês",18]
["1.24","T2","Técnico de Segurança e Medicina do Trabalho (inclusive adicional de periculosidade)","homem x mês",6,null,null,198754.32]
["1.25","T2","Tecnico Edificações","homem x mês",12,null,null,229331.88]
["1.26","T2","Técnico - Cadista","homem x mês",6,null,null,229331.88]
["1.27","T2","Técnico Pleno - Eletrotécnico - Diurno (inclusive adicional de periculosidade)","homem x mês",72,null,null,2385051.84]
["1.28","T2","Técnico Pleno - Eletrotécnico -  Noturno (inclusive adicional de periculosidade)","homem x mês",72,null,null,2918610.01]
["1.29","T2","Técnico Junior - Mecânico - Diurno (inclusive adicional de periculosidade)","homem x mês",72,null,null,1192525.92]
["1.30","T2","Técnico Junior - Mecânico - Noturno (inclusive adicional de periculosidade)","homem x mês",72,null,null,1459305.01]
["1.31","T2","Técnico Pleno ","homem x mês",60,null,null,1070215.44]
["1.32","T2","Técnico Pleno (inclusive adicional de periculosidade)","homem x mês",18,null,null,496885.8]
["1.33","T1","Técnico Pleno - Analista em Tecnologia da Informação","homem x mês",6]
["1.34","T0","Técnico - Profissional Sênior (N. Médio/Especializado)","homem x mês",18,null,null,1647821.76]
["1.35","T2","Técnico Telecomunicações/Eletrônica (inclusive adicional de periculosidade)","homem x mês",6,null,null,99377.16]
["1.36","TS","Topógrafo","homem x mês",6,null,null,80742]
["1.37","A10","Vigia diurno ","homem x mês",24,null,null,295647.84000000003]
["1.38","A10","Vigia noturno","homem x mês",24]
[{"$f":"\"TOTAL - \"&C13&\" - (R$):\"","v":"TOTAL - EQUIPE - MÃO DE OBRA - (R$):"},{"$nulls":5},{"$f":"SUM(G14:G51)","v":0}]
[]
[]
[{"$f":"\"RESUMO - \"&A$8","v":"RESUMO - EQUIPE - MÃO DE OBRA"}]
["ITEM",null,"DESCRIÇÃO",null,null,"VALOR TOTAL (R$)"]
[1,null,{"$f":"C13","v":"EQUIPE - MÃO DE OBRA"},null,null,{"$f":"G52","v":0}]
[{"$f":"\"TOTAL GERAL - \"&A$8&\" -  (R$):\"","v":"TOTAL GERAL - EQUIPE - MÃO DE OBRA -  (R$):"},{"$nulls":4},{"$f":"SUM(F57:G57)","v":0},null,null,31038949.16]
[]
[]
["NOME DO INFORMANTE:",{"$nulls":4},"QUALIFICAÇÃO:"]
[]
["ASSINATURA:",{"$nulls":4},"DATA:"]
[]
["OBSERVAÇÕES:"]
["1. Considerado a carga horária de 176 horas/mês"]
["2. Os cálculos de cada parcela que compõe o salário completo foram calculadas isoladamente. (Salário Base + Adicional de Periculosidade (quando houver) + Adicional Noturno (quando houver) + Adicional de Horas Extras (quando houver) +  Encargos Sociais)"]
[]
["3. Adicional de Periculosidade 30%: foi previsto para todos os profissionais eletricitários (Operação e Manutenção) que trabalham em contato com rede elétrica (nas estações de bombeamento, sub-estações, etc.) "]
[]
["4. Hora Noturna: Hora Diurna x 20%"]
["5. Adicional Noturno: *Considerado 120 horas/profissional/mês (Total de 8h noturnas: Período de 22h as 5h = 8h noturnas + 1h até as 6h => Súmula 60 do TST)    *(Incide sobre Salário Base + Periculosidade => Súmula 191 do TST)"]
[]
["6. Período noturno – 22 às 5 horas, o valor da hora tem 52 minutos e 30 segundos; logo, nesse período, há 8 horas"]
["7. Foi considerado intervalo intrajornada para todos os profissionais que trabalham em escala 12h x 36h "]

{"sheet":"Mao_de_Obra (Total)","index":12,"n_rows":84,"n_cols":33,"rows_kept":84,"cut":false,"hidden":false,"merged":[[85,0,85,14],[76,0,76,14],[77,0,77,14],[75,0,75,14],[78,0,78,14],[79,0,79,14],[80,0,80,14],[81,0,81,14],[82,0,82,14],[83,0,83,14],[72,0,73,13],[84,0,84,14],[74,0,74,14],[71,0,71,13],[11,13,12,13],[11,8,11,9],[0,2,0,14],[1,2,1,14],[2,2,2,14],[4,0,5,14],[10,6,10,10],[7,0,7,14],[10,11,10,14],[11,28,12,28],[11,29,12,29],[11,30,12,30],[11,31,12,31],[11,32,12,32],[10,26,10,27],[11,26,12,26],[11,27,12,27],[10,24,10,25],[10,0,12,0],[10,1,12,1],[10,2,12,2],[10,3,12,3],[10,4,11,5],[11,6,12,6],[11,10,12,10],[11,11,12,11],[11,25,12,25],[11,24,12,24],[11,14,12,14]]}
[null,null,"Ministério do Desenvolvimento Regional  - MDR"]
[null,null,"Companhia de Desenvolvimento dos Vales do São Francisco e do Parnaíba"]
[null,null,"Gerência de Operação do PISF - Centro de Controle e Operação (AD / GOI / CCO)"]
[]
[{"$f":"Mao_de_Obra!A5","v":"TERMO DE REFERÊNCIA PARA CONTRATAÇÃO DOS RECURSOS NECESSÁRIOS À OPERAÇÃO E MANUTENÇÃO DAS INFRAESTRUTURAS DO EIXO LESTE DO PISF - PROJETO DE INTEGRAÇÃO DO SÃO FRANCISCO COM AS BACIAS HIDROGRÁFICAS DO NORDESTE SETENTRIONAL"}]
[]
[]
["MÃO DE OBRA - TOTAL"]
[]
[]
["ITEM","DESCRIÇÃO","CLASSE","Prazo (Mês)","Quantidade (undxmês)",null,"SALÁRIOS MENSAL (R$)",{"$nulls":4},"SALÁRIOS TOTAL (R$)"]
[{"$nulls":6},"SALÁRIO BASE (Com Encargo)","Periculosidade ","Adicional Noturno",null,"SALÁRIO COMPLETO (Incluindo: encargos, benefícios, adicionais e horas extras)","SALÁRIO BASE (Com Encargo)","Periculosidade","Adicional Noturno (c/ intrajornada)","SALÁRIO COMPLETO (Incluindo: encargos, adicionais e horas extras)"]
[{"$nulls":4},"Unitária","Total",null,0.3,"Valor da Hora Noturna","Valor do Adicional Noturno (c/ intrajornada)",null,null,{"$f":"H13","v":0.3}]
["1.","COORDENAÇÃO GERAL"]
["1.1","Coordenador - Engenheiro Sênior (Civil / Eletricista / Mecânico) ","P0",{"$f":"'ORCAMENTO_CONSOLIDADO (2)'!$K$1","v":6},{"$f":"Mem_Calculo_EQUIPE!F13","v":1},{"$f":"D15*E15","v":6},{"$nulls":18},1,{"$f":"AC15-$Y15","v":0},1,{"$f":"AC15-AA15","v":0},{"$f":"SUM(AD15:AG15)","v":1},1,0,0,0]
["2.","COORDENAÇÃO DA OPERAÇÃO"]
["2.1","Coordenador Operação - Engenheiro Pleno (Civil / Eletricista / Mecânico) ","P1",{"$f":"D$15","v":6},{"$f":"Mem_Calculo_EQUIPE!F16","v":1},{"$f":"D17*E17","v":6},{"$nulls":18},1,{"$f":"AC17-$Y17","v":0},1,{"$f":"AC17-AA17","v":0},{"$f":"SUM(AD17:AG17)","v":1},1,0,0,0]
["3.","COORDENAÇÃO DA MANUTENÇÃO "]
["3.1","Coordenador Manutenção - Engenheiro Pleno (Civil / Eletricista / Mecânico) ","P1",{"$f":"D$15","v":6},{"$f":"Mem_Calculo_EQUIPE!F19","v":1},{"$f":"D19*E19","v":6},{"$nulls":18},1,{"$f":"AC19-$Y19","v":0},1,{"$f":"AC19-AA19","v":0},{"$f":"SUM(AD19:AG19)","v":1},1,0,0,0]
["4.","COORDENAÇÃO ADMINISTRAÇÃO E LOGÍSTICA"]
["4.1","Coordenador - Chefe de Escritório","CA",{"$f":"D$15","v":6},{"$f":"Mem_Calculo_EQUIPE!F22","v":1},{"$f":"D21*E21","v":6},{"$nulls":18},1,{"$f":"AC21-$Y21","v":0},1,{"$f":"AC21-AA21","v":0},{"$f":"SUM(AD21:AG21)","v":1},1,0,0,0]
["4.2","Auxiliar Administrativo","A1",6,{"$f":"Mem_Calculo_EQUIPE!F23","v":1},6,{"$nulls":18},2,-1,2,-1,1,1,0,0,0]
["4.3","Técnico Pleno - Analista em Tecnologia da Informação","T1",6,{"$f":"Mem_Calculo_EQUIPE!F24","v":1},6,{"$nulls":18},1,0,1,0,1,1,0,0,0]
["4.4","Motorista","A3",6,{"$f":"Mem_Calculo_EQUIPE!F25","v":1},6,{"$nulls":18},9,-4,5,0,5,2,1,1,1]
["4.5","Almoxarife","A1",6,{"$f":"Mem_Calculo_EQUIPE!F26","v":1},6,{"$nulls":18},2,-1,1,0,1,1,0,0,0]
["4.6","Auxiliar de serviços gerais","A9",6,{"$f":"Mem_Calculo_EQUIPE!F27","v":6},{"$f":"D26*E26","v":36},{"$nulls":18},6,6,6,6,12,0,4,4,4]
["5.","SEGURANÇA E MEDICINA DO TRABALHO"]
["5.1","Engenheiro de Segurança e Medicina do Trabalho (inclusive adicional de periculosidade)","P1",{"$f":"D$15","v":6},{"$f":"Mem_Calculo_EQUIPE!F30","v":1},{"$f":"D28*E28","v":6},{"$nulls":18},1,{"$f":"AC28-$Y28","v":0},1,{"$f":"AC28-AA28","v":0},{"$f":"SUM(AD28:AG28)","v":1},1,0,0,0]
["5.2","Técnico de Segurança e Medicina do Trabalho (inclusive adicional de periculosidade)","T2",6,{"$f":"Mem_Calculo_EQUIPE!F32","v":1},{"$f":"D29*E29","v":6},{"$nulls":18},7,{"$f":"AC29-$Y29","v":-5},3,{"$f":"AC29-AA29","v":-1},{"$f":"SUM(AD29:AG29)","v":2},2,0,0,0]
["5.3","Médico do Trabalho","P2",6,1,{"$f":"D30*E30","v":6},{"$nulls":18},1,{"$f":"AC30-$Y30","v":0},1,{"$f":"AC30-AA30","v":0},{"$f":"SUM(AD30:AG30)","v":1},1,0,0,0]
["6.","PLANEJAMENTO E CONTROLE DA OPERAÇÃO"]
["6.1","Engenheiro Pleno ","P1",{"$f":"D$15","v":6},{"$f":"Mem_Calculo_EQUIPE!F35","v":1},{"$f":"D32*E32","v":6},{"$nulls":18},1,{"$f":"AC32-$Y32","v":0},1,{"$f":"AC32-AA32","v":0},{"$f":"SUM(AD32:AG32)","v":1},1,0,0,0]
["6.2","Engenheiro Junior ","P2",6,{"$f":"Mem_Calculo_EQUIPE!F36","v":1},{"$f":"D33*E33","v":6},{"$nulls":18},2,{"$f":"AC33-$Y33","v":-1},1,{"$f":"AC33-AA33","v":0},{"$f":"SUM(AD33:AG33)","v":1},1,0,0,0]
["7.","PLANEJAMENTO E CONTROLE DA MANUTENÇÃO "]
["7.1","Engenheiro Pleno ","P1",{"$f":"D$15","v":6},{"$f":"Mem_Calculo_EQUIPE!F39","v":5},{"$f":"D35*E35","v":30},{"$nulls":18},1,{"$f":"AC35-$Y35","v":0},1,{"$f":"AC35-AA35","v":0},{"$f":"SUM(AD35:AG35)","v":1},1,0,0,0]
["7.2","Engenheiro Junior ","P2",6,{"$f":"Mem_Calculo_EQUIPE!F40","v":3},18,{"$nulls":18},2,-2,1,-1,{"$f":"SUM(AD36:AG36)","v":0},0,0,0,0]
["7.3","Técnico Pleno ","T2",6,{"$f":"Mem_Calculo_EQUIPE!F41","v":3},18,{"$nulls":18},2,-1,2,-1,{"$f":"SUM(AD37:AG37)","v":1},1,0,0,0]
["7.4","Geólogo  (Geotecnia)","P1",6,{"$f":"Mem_Calculo_EQUIPE!F42","v":1},6,{"$nulls":18},2,-1,1,0,{"$f":"SUM(AD38:AG38)","v":1},1,0,0,0]
["8.","OPERAÇÃO"]
["8.1","Técnico Pleno - Eletrotécnico - Diurno (inclusive adicional de periculosidade)","T2",{"$f":"D$15","v":6},{"$f":"Mem_Calculo_EQUIPE!F45","v":12},{"$f":"D40*E40","v":72},{"$nulls":18},18,{"$f":"AC40-$Y40","v":-6},12,{"$f":"AC40-AA40","v":0},{"$f":"SUM(AD40:AG40)","v":12},0,6,2,4]
["8.2","Técnico Pleno - Eletrotécnico -  Noturno (inclusive adicional de periculosidade)","T2",6,{"$f":"Mem_Calculo_EQUIPE!F46","v":12},72,{"$nulls":18},18,-6,12,0,{"$f":"SUM(AD41:AG41)","v":12},0,6,2,4]
["8.3","Técnico Junior - Mecânico - Diurno (inclusive adicional de periculosidade)","T2",6,{"$f":"Mem_Calculo_EQUIPE!F47","v":12},{"$f":"D42*E42","v":72},{"$nulls":18},18,-6,12,0,{"$f":"SUM(AD42:AG42)","v":12},0,6,2,4]
["8.4","Técnico Junior - Mecânico - Noturno (inclusive adicional de periculosidade)","T2",6,{"$f":"Mem_Calculo_EQUIPE!F48","v":12},72]
["8.5","Técnico Auxiliar (inclusive adicional de periculosidade)","T3",6,{"$f":"Mem_Calculo_EQUIPE!F49","v":3},18,{"$nulls":18},18,-5,4,9,{"$f":"SUM(AD44:AG44)","v":13},{"$f":"1*(4+4+5)","v":13},0,0,0]
["8.6","Técnico - Profissional Sênior (N. Médio/Especializado)","T0",6,{"$f":"Mem_Calculo_EQUIPE!F50","v":3},18]
["9.","MANUTENÇÃO - MECÂNICA"]
["9.1","Técnico Pleno ","T2",{"$f":"D$15","v":6},{"$f":"Mem_Calculo_EQUIPE!F53","v":3},{"$f":"D47*E47","v":18},{"$nulls":18},7,{"$f":"AC47-$Y47","v":-4},2,{"$f":"AC47-AA47","v":1},{"$f":"SUM(AD47:AG47)","v":3},0,1,1,1]
["9.2","Técnico Auxiliar","T3",6,{"$f":"Mem_Calculo_EQUIPE!F54","v":6},36,{"$nulls":18},12,-8,5,-1,{"$f":"SUM(AD48:AG48)","v":4},0,2,1,1]
["10.","MANUTENÇÃO - EQUIPAMENTOS E SISTEMAS ELÉTRICOS"]
["10.1","Técnico Pleno (inclusive adicional de periculosidade)","T2",{"$f":"D$15","v":6},{"$f":"Mem_Calculo_EQUIPE!F57","v":3},{"$f":"D50*E50","v":18},{"$nulls":18},6,{"$f":"AC50-$Y50","v":-3},3,{"$f":"AC50-AA50","v":0},{"$f":"SUM(AD50:AG50)","v":3},0,1,1,1]
["10.2","Eletricista (inclusive adicional de periculosidade)","A5",6,{"$f":"Mem_Calculo_EQUIPE!F58","v":3},{"$f":"D51*E51","v":18},{"$nulls":18},8,{"$f":"AC51-$Y51","v":-4},4,{"$f":"AC51-AA51","v":0},{"$f":"SUM(AD51:AG51)","v":4},0,2,0,2]
["11.","MANUTENÇÃO SDSC"]
["11.1","Técnico Automação - Especialista em SDSC (inclusive adicional de periculosidade)","T2",{"$f":"D$15","v":6},{"$f":"Mem_Calculo_EQUIPE!F61","v":1},{"$f":"D53*E53","v":6},{"$nulls":18},2,{"$f":"AC53-$Y53","v":1},2,{"$f":"AC53-AA53","v":1},{"$f":"SUM(AD53:AG53)","v":3},0,1,1,1]
["12.","MANUTENÇÃO TELECOM"]
["12.1","Técnico Telecomunicações/Eletrônica (inclusive adicional de periculosidade)","T2",{"$f":"D$15","v":6},{"$f":"Mem_Calculo_EQUIPE!F64","v":1},{"$f":"D55*E55","v":6},{"$nulls":18},4,{"$f":"AC55-$Y55","v":-3},2,{"$f":"AC55-AA55","v":-1},{"$f":"SUM(AD55:AG55)","v":1},1,0,0,0]
["13.","MANUTENÇÃO - CIVIL"]
["13.1","Técnico Pleno ","T2",{"$f":"$D$55","v":6},{"$f":"Mem_Calculo_EQUIPE!F67","v":4},{"$f":"D57*E57","v":24},{"$nulls":9},{"$f":"SUBTOTAL(9,O57:O68)","v":0},5]
["13.2","Tecnico Edificações","T2",{"$f":"D$15","v":6},{"$f":"Mem_Calculo_EQUIPE!F68","v":2},12,{"$nulls":10},3,{"$nulls":7},3,{"$f":"AC58-$Y58","v":0},1,{"$f":"AC58-AA58","v":2},{"$f":"SUM(AD58:AG58)","v":3},0,1,1,1]
["13.3","Técnico - Cadista","T2",6,{"$f":"Mem_Calculo_EQUIPE!F69","v":1},6,{"$nulls":10},3,{"$nulls":7},3,0,2,1,{"$f":"SUM(AD59:AG59)","v":3},0,1,1,1]
["13.4","Topógrafo","TS",6,{"$f":"Mem_Calculo_EQUIPE!F70","v":1},6,{"$nulls":10},1]
["13.5","Auxiliar de Topografia","T3",6,{"$f":"Mem_Calculo_EQUIPE!F71","v":2},12,{"$nulls":10},2]
["13.6","Carpinteiro","A8",6,{"$f":"Mem_Calculo_EQUIPE!F72","v":2},12,{"$nulls":10},3]
["13.7","Eletricista","A5",6,{"$f":"Mem_Calculo_EQUIPE!F73","v":2},12,{"$nulls":10},3]
["13.8","Ferreiro","A7",6,{"$f":"Mem_Calculo_EQUIPE!F74","v":1},6,{"$nulls":10},3,2]
["13.9","Pedreiro","A6",6,{"$f":"Mem_Calculo_EQUIPE!F75","v":4},24,{"$nulls":10},7,2]
["13.10","Servente","A11",6,{"$f":"Mem_Calculo_EQUIPE!F76","v":60},360,{"$nulls":10},124,44]
["13.11","Vigia diurno ","A10",6,{"$f":"Mem_Calculo_EQUIPE!F77","v":4},24,{"$nulls":10},6,{"$nulls":7},4,-4,2,-2,{"$f":"SUM(AD67:AG67)","v":0},0,0,0,0]
["13.12","Vigia noturno","A10",6,{"$f":"Mem_Calculo_EQUIPE!F78","v":4},24,{"$nulls":10},6]
["Total Geral - Equipe com Vínculo Mensalista (R$):"]
[]
["NOME DO INFORMANTE:"]
[]
["ASSINATURA:"]
[]
["OBSERVAÇÕES:"]
["1. Considerado a carga horária de 176 horas/mês"]
["2. Os cálculos de cada parcela que compõe o salário completo foram calculadas isoladamente. (Salário Base + Adicional de Periculosidade (quando houver) + Adicional Noturno (quando houver) + Adicional de Horas Extras (quando houver) +  Encargos Sociais)"]
["3. Adicional de Periculosidade 30%: foi previsto para todos os profissionais eletricitários (Operação e Manutenção) que trabalham em contato com rede elétrica (nas estações de bombeamento, sub-estações, etc.) "]
["4. Hora Noturna: Hora Diurna x 20%"]
["5. Adicional Noturno: *Considerado 120 horas/profissional/mês (Total de 8h noturnas: Período de 22h as 5h = 8h noturnas + 1h até as 6h => Súmula 60 do TST)    *(Incide sobre Salário Base + Periculosidade => Súmula 191 do TST)"]
["6. Período noturno – 22 às 5 horas, o valor da hora tem 52 minutos e 30 segundos; logo, nesse período, há 8 horas"]
["6. Foi considerado intervalo intrajornada para todos os profissionais que trabalham em escala 12h x 36h "]
["7. Foi considerado para o cálculo de horas extras os percentuais de: *5% para as horas remuneradas a 50%  sobre o valor da hora normal; e *2,5% para as horas trabalhadas remuneradas a 100% sobre o valor da hora normal"]
["8. Horas Extras: Foi estimado um percentual de 20% de horas extras no total de contrato para todos os profissionais da manutenção. Essas horas só serão pagas se houver demanda."]

{"sheet":"Mem_Calculo_EQUIPE","index":13,"n_rows":84,"n_cols":16,"rows_kept":84,"cut":false,"hidden":false,"merged":[[83,0,83,6],[84,0,84,6],[81,0,81,5],[82,0,82,5],[79,0,79,5],[80,0,80,5],[0,1,0,6],[1,1,1,6],[2,1,2,6],[4,0,5,6],[7,0,7,6]]}
[null,"Ministério do Desenvolvimento Regional  - MDR"]
[null,"Companhia de Desenvolvimento dos Vales do São Francisco e do Parnaíba"]
[null,"Gerência de Operação do PISF - Centro de Controle e Operação (AD / GOI / CCO)"]
[]
[{"$f":"'Mao_de_Obra (Total)'!A5","v":"TERMO DE REFERÊNCIA PARA CONTRATAÇÃO DOS RECURSOS NECESSÁRIOS À OPERAÇÃO E MANUTENÇÃO DAS INFRAESTRUTURAS DO EIXO LESTE DO PISF - PROJETO DE INTEGRAÇÃO DO SÃO FRANCISCO COM AS BACIAS HIDROGRÁFICAS DO NORDESTE SETENTRIONAL"}]
[]
[]
["MEMORIAL DE CÁLCULO - EQUIPE DE MÃO DE OBRA"]
[]
[]
["ITEM","DESCRIÇÃO","CLASSE","LOTAÇÃO","MOBILIZAÇÃO","QUANTIDADE","OBSERVAÇÕES"]
["1.","COORDENAÇÃO GERAL"]
["1.1","Coordenador - Engenheiro Sênior (Civil / Eletricista / Mecânico) ","P0","Coordenação (à definir)","Escritório",1]
[]
["2.","COORDENAÇÃO DA OPERAÇÃO"]
["2.1","Coordenador Operação - Engenheiro Pleno (Civil / Eletricista / Mecânico) ","P1","Coordenação (à definir)","Escritório",1]
[]
["3.","COORDENAÇÃO DA MANUTENÇÃO"]
["3.1","Coordenador Manutenção - Engenheiro Pleno (Civil / Eletricista / Mecânico) ","P1","Coordenação (à definir)","Escritório",1]
[]
["4.","COORDENAÇÃO ADMINISTRAÇÃO E LOGÍSTICA"]
["4.1","Almoxarife","CA","Coordenação (à definir)","Não utilliza o Escritório",1]
["4.2","Auxiliar Administrativo","A1","Coordenação (à definir)","Escritório",1]
["4.3","Motorista","T1","Coordenação (à definir)","Não utilliza o Escritório",1]
["4.4","Coordenador - Chefe de Escritório","A3","Coordenação (à definir)","Escritório",1]
["4.5","Técnico Pleno - Analista em Tecnologia da Informação","A1","Coordenação (à definir)","Escritório",1]
["4.6","Auxiliar de serviços gerais","A9","Coordenação (à definir)","Não utilliza o Escritório",6]
[]
["5.","SEGURANÇA E MEDICINA DO TRABALHO"]
["5.1","Engenheiro de Segurança e Medicina do Trabalho","P1","Coordenação (à definir)","Escritório",1]
["5.2","Médico do Trabalho","T2","Coordenação (à definir)","Escritório",1]
["5.3","Técnico de Segurança e Medicina do Trabalho","P2","Coordenação (à definir)","Pode utilizar o escritório",1]
[]
["6.","PLANEJAMENTO E CONTROLE DA OPERAÇÃO"]
["6.1","Engenheiro Pleno - (Civil / Eletricista)","P1","Coordenação (à definir)","Planeja / Utiliza - Escritório",1]
["6.2","Engenheiro Junior - (Civil / Eletricista)","P2","Coordenação (à definir)","Planeja / Utiliza - Escritório",1]
[]
["7.","PLANEJAMENTO E CONTROLE DA MANUTENÇÃO"]
["7.1","Engenheiro Pleno ","P1","Coordenação (à definir)","Planeja / Utiliza - Escritório",5]
["7.2","Engenheiro Junior ","P2","Coordenação (à definir)","Planeja / Utiliza - Escritório",3]
["7.3","Técnico Pleno","T2","Coordenação (à definir)","Pode utilizar o escritório",3]
["7.4","Geólogo  (Geotecnia)","P1","Coordenação (à definir)","Pode utilizar o escritório",1]
[]
["8.","OPERAÇÃO"]
["8.1","Técnico Pleno - Eletrotécnico - Diurno (inclusive adicional de periculosidade)","T2","Coordenação (à definir)","Não utilliza o Escritório",12]
["8.2","Técnico Pleno - Eletrotécnico -  Noturno (inclusive adicional de periculosidade)","T2","Coordenação (à definir)","Não utilliza o Escritório",12]
["8.3","Técnico Junior - Mecânico - Diurno (inclusive adicional de periculosidade)","T2","Coordenação (à definir)","Não utilliza o Escritório",12]
["8.4","Técnico Junior - Mecânico - Noturno (inclusive adicional de periculosidade)","T2","Coordenação (à definir)","Não utilliza o Escritório",12]
["8.5","Técnico Auxiliar (inclusive adicional de periculosidade)","T3","Coordenação (à definir)","Não utilliza o Escritório",3]
["8.6","Técnico - Profissional Sênior (N. Médio/Especializado)","T0","Coordenação (à definir)","Não utilliza o Escritório",3]
[]
["9.","MANUTENÇÃO - MECÂNICA"]
["9.1","Técnico Pleno ","T2","Coordenação (à definir)","Pode utilizar o escritório",3]
["9.2","Técnico Auxiliar ","T3","Coordenação (à definir)","Não utilliza o Escritório",6]
[]
["10.","MANUTENÇÃO - EQUIPAMENTOS E SISTEMAS ELÉTRICOS"]
["10.1","Técnico Pleno ","T2","Coordenação (à definir)","Pode utilizar o escritório",3]
["10.2","Técnico Auxiliar","A5","Coordenação (à definir)","Não utilliza o Escritório",3]
[]
["11.","MANUTENÇÃO SDSC"]
["11.1","Técnico Automação - Especialista em SDSC (inclusive adicional de periculosidade)","T2","Coordenação (à definir)","Não utilliza o Escritório",1]
[]
["12.","MANUTENÇÃO TELECOM"]
["12.1","Técnico Telecomunicações/Eletrônica (inclusive adicional de periculosidade)","T2","Coordenação (à definir)","Não utilliza o Escritório",1,"Equipe: 01/EIXO"]
[]
["13.","MANUTENÇÃO - CIVIL",{"$nulls":7},14,"MANUTENÇÃO - CIVIL - SUBESTAÇÃO, LINHA DE TRANSMISSÃO E LINHA DE DISTRIBUIÇÃO"]
["13.1","Técnico Pleno ","T2","Coordenação (à definir)","Pode utilizar o escritório",4,null,null,null,"14.1","Tecnico Edificações - Inspeção (inclusive adicional de periculosidade)",null,null,null,"T2",0]
["13.2","Tecnico Edificações","T2","Coordenação (à definir)","Pode utilizar o escritório",2,null,null,null,"14.2","Carpinteiro (inclusive adicional de periculosidade)",null,null,null,"A8",0]
["13.3","Técnico - Cadista","T2","Coordenação (à definir)","Pode utilizar o escritório",1,null,null,null,"14.3","Eletricista (inclusive adicional de periculosidade)",null,null,null,"A5",0]
["13.4","Topógrafo","TS","Coordenação (à definir)","Pode utilizar o escritório",1,null,null,null,"14.4","Ferreiro (inclusive adicional de periculosidade)",null,null,null,"A7",0]
["13.5","Auxiliar de Topografia","T3","Coordenação (à definir)","Não utilliza o Escritório",2,null,null,null,"14.5","Pedreiro (inclusive adicional de periculosidade)",null,null,null,"A6",0]
["13.6","Carpinteiro","A8","Coordenação (à definir)","Não utilliza o Escritório",2,null,null,null,"14.6","Servente (inclusive adicional de periculosidade)",null,null,null,"A11",0]
["13.7","Eletricista","A5","Coordenação (à definir)","Não utilliza o Escritório",2]
["13.8","Ferreiro","A7","Coordenação (à definir)","Não utilliza o Escritório",{"$f":"1+P70","v":1}]
["13.9","Pedreiro","A6","Coordenação (à definir)","Não utilliza o Escritório",4]
["13.10","Servente","A11","Coordenação (à definir)","Não utilliza o Escritório",{"$f":"60+P72","v":60}]
["13.11","Vigia diurno ","A10","Coordenação (à definir)","Não utilliza o Escritório",4]
["13.12","Vigia noturno","A10","Coordenação (à definir)","Não utilliza o Escritório",4]
[]
["NOME DO INFORMANTE:",{"$nulls":5},"QUALIFICAÇÃO:"]
[]
["ASSINATURA:",{"$nulls":5},"DATA:"]
[]
["OBSERVAÇAO:"]

{"sheet":"SEGURANÇA DE BARRAGENS","index":14,"n_rows":49,"n_cols":21,"rows_kept":49,"cut":false,"hidden":false,"merged":[[4,0,5,15],[28,1,28,6],[41,5,41,6],[43,2,43,6],[46,0,46,5],[41,0,42,0],[41,1,42,1],[41,2,42,2],[41,3,42,3],[41,4,42,4],[7,0,7,15],[10,12,10,15],[11,12,12,12],[11,14,12,14],[11,15,12,15],[10,7,10,11],[48,0,48,5],[26,5,26,6],[26,0,27,0],[26,1,27,1],[26,2,27,2],[26,3,27,3],[26,4,27,4],[11,7,12,7],[11,9,11,10],[11,11,12,11],[10,0,12,0],[10,2,12,2],[10,3,12,3],[10,4,12,4],[10,5,11,6]]}
[null,null,null,"Ministério do Desenvolvimento Regional  - MDR"]
[null,null,null,"Companhia de Desenvolvimento dos Vales do São Francisco e do Parnaíba"]
[null,null,null,"Gerência de Operação do PISF - Centro de Controle e Operação (AD / GOI / CCO)"]
[]
[{"$f":"ORCAMENTO_RESUMO!A5","v":"TERMO DE REFERÊNCIA PARA CONTRATAÇÃO DOS RECURSOS NECESSÁRIOS À OPERAÇÃO E MANUTENÇÃO DAS INFRAESTRUTURAS DO EIXO LESTE DO PISF - PROJETO DE INTEGRAÇÃO DO SÃO FRANCISCO COM AS BACIAS HIDROGRÁFICAS DO NORDESTE SETENTRIONAL"}]
[]
[]
["SEGURANÇA DE BARRAGENS"]
[]
["1.0 ",null,"MÃO DE OBRA - SEGURANÇA DE BARRAGENS"]
["ITEM",null,"DESCRIÇÃO","CLASSE","Prazo (Mês)","Quantidade (undxmês)",null,"SALÁRIOS MENSAL (R$)",{"$nulls":4},"SALÁRIOS TOTAL (R$)"]
[{"$nulls":7},"SALÁRIO BASE (Com Encargo)","Periculosidade ","Adicional Noturno",null,"SALÁRIO COMPLETO (Incluindo: encargos, benefícios, adicionais e horas extras)","SALÁRIO BASE (Com Encargo)","Periculosidade","Adicional Noturno (c/ intrajornada)","SALÁRIO COMPLETO (Incluindo: encargos, adicionais e horas extras)"]
[{"$nulls":5},"Unitária","Total",null,0.3,"Valor da Hora Noturna","Valor do Adicional Noturno (c/ intrajornada)",null,null,0.3]
["1.1",null,"MÃO DE OBRA - SEGURAÇA DE BARRAGEM - LESTE"]
["1.1.1",null,"Engenheiro Pleno  - Esp. Em Seg. de Barragem","P1",6,1,6]
["1.1.2",null,"Engenheiro. Civil  (Geotecnico)","P1",6,1,6]
["1.1.3",null,"Engenheiro Junior - Civil","P2",6,1,6,{"$nulls":10},"ANTES P3"]
["1.1.4",null,"Assistente Administrativo (Assistente social)","AS",6,2,12,{"$nulls":10},"ANTES T1"]
["1.1.5",null,"Assistente Administrativo (administrativo)","A1",6,2,12]
["1.1.6",null,"Auxiliar Administrativo","A1",6,1,6]
["1.1.7",null,"Topógrafo ","TS",6,1,6,{"$nulls":10},"ANTES T1"]
["1.1.8",null,"Auxiliar de Topografia ","T3",6,2,12,{"$nulls":10},"ANTES T4"]
["1.1.9",null,"Técnico Pleno","T2",6,1,6]
["Total Geral - Equipe com Vínculo Mensalista (R$):"]
[]
["2.0",null,"EQUIPAMENTOS - SEGURANÇA DE BARRAGENS"]
["ITEM","CÓDIGO","DESCRIÇÃO","UNIDADE","QUANTIDADE","VALOR (R$)"]
[{"$nulls":5},"UNITARIO","TOTAL"]
["2.1","SEGURANÇA DE BARRAGEM",{"$nulls":17},12,{"$f":"'ORCAMENTO_CONSOLIDADO (2)'!$K$1","v":6}]
["2.1.1","E9763-DNIT/PE","Grupo Gerador - 32,0 kVA, 220 V, trifásico, silenciado, com 100 metros de cabos e 01 QTA. ","un x mês",6,null,"",{"$nulls":11},12,{"$f":"S30/$T$29","v":1},{"$f":"T30*$U$29","v":6}]
["2.1.2","13227 - SINAPI/PE","MOTONIVELADORA POTENCIA BASICA LIQUIDA (PRIMEIRA MARCHA) 171 HP, PESO BRUTO 14768 KG, LARGURA DA LAMINA DE 3,7 M","un x mês",6,null,"",{"$nulls":11},12,1,6]
["2.1.3","36483 - SINAPI/PE","ESCAVADEIRA HIDRAULICA SOBRE ESTEIRAS CACAMBA 0,40 A 1,20 M3, PESO OPERACIONAL 21,19 T, POTENCIA LIQUIDA 173 HP","un x mês",6,null,"",{"$nulls":11},12,1,6]
["2.1.4","E9540-DNIT/PE","Trator de esteiras, potência de 150 hp, peso operacional de 16,7 t, com roda motriz elevada e lâmina com contato de 3,18 m³.","un x mês",6,null,"",{"$nulls":11},12,1,6]
["2.1.5","89883-SINAPI/PE","Cavalo Mecânico com Reboque M. Benz Randon LS-1634/45 29,5 t, ou similar","un x mês",6,null,"",{"$nulls":11},12,1,6]
["2.1.6","E9685-DNIT/PE","Rolo compactador pé-de-carneiro vibratório, potência 125 hp, peso operacional sem/com lastro 11,95/13,30 t, impacto dinâmico 38,5/22,5 t, largura de trabalho 2,15 m.","un x mês",6,null,"",{"$nulls":11},12,1,6]
["2.1.7","E9043-DNIT/PE","Embarcação de alumínio com comprimento de 6 m e motor de popa - 18,60 kW (inclusive barqueiro)","un x mês",18,null,"",{"$nulls":11},36,3,18]
["2.1.8","A9382-DNIT/PE","Dolly intermediário com 2 eixos para semirreboque (para embarcação)","un x mês",18,null,"",{"$nulls":11},36,3,18]
["TOTAL - EQUIPAMENTOS DE SEGURANÇA DE BARRAGENS",{"$nulls":5},0]
[]
[]
["3.0",null,"VEÍCULOS - SEGURANÇA DE BARRAGENS"]
["ITEM","CÓDIGO","DESCRIÇÃO","UNIDADE","QUANTIDADE","VALOR (R$)"]
[{"$nulls":5},"UNITARIO","TOTAL"]
["3.1",null,"VEÍCULOS AUTOMOTORES"]
["3.1.1","B4","TIPO SEDAN 1.6 FLEX (115CV)","un x mês",6,"","",{"$nulls":11},12,{"$f":"S45/$T$29","v":1},{"$f":"T45*$U$29","v":6}]
["3.1.2","B11","Veículo Tipo Pick Up Cabine Dupla 4 x 4 (163 CV)","un x mês",6,"","",{"$nulls":11},12,{"$f":"S46/$T$29","v":1},{"$f":"T46*$U$29","v":6}]
["TOTAL - VEÍCULOS AUTOMOTORES - (R$):"]
[]
["TOTAL - SEGURANÇA DE BARRAGENS",{"$nulls":5},0]

{"sheet":"Mao_de_Obra (SEG.BARRAGENS)","index":15,"n_rows":45,"n_cols":11,"rows_kept":45,"cut":false,"hidden":false,"merged":[[43,0,43,6],[44,0,44,6],[45,0,45,6],[46,0,46,6],[47,0,47,6],[41,0,42,6],[31,0,31,4],[31,5,31,6],[32,0,32,4],[32,5,32,6],[33,0,33,4],[33,5,33,6],[34,0,34,6],[35,0,35,6],[36,0,37,6],[38,0,39,6],[40,0,40,6],[26,2,26,4],[26,5,26,6],[27,0,27,4],[27,5,27,6],[30,0,30,4],[30,5,30,6],[9,5,9,6],[11,2,11,6],[21,0,21,5],[24,0,24,6],[25,2,25,4],[25,5,25,6],[9,0,10,0],[9,1,10,1],[9,2,10,2],[9,3,10,3],[9,4,10,4],[0,2,0,6],[1,2,1,6],[2,2,2,6],[4,0,5,6],[7,0,7,6]]}
[null,null,"Ministério do Desenvolvimento Regional  - MDR"]
[null,null,"Companhia de Desenvolvimento dos Vales do São Francisco e do Parnaíba"]
[null,null,"Gerência de Operação do PISF - Centro de Controle e Operação (AD / GOI / CCO)"]
[]
[{"$f":"ORCAMENTO_RESUMO!A5","v":"TERMO DE REFERÊNCIA PARA CONTRATAÇÃO DOS RECURSOS NECESSÁRIOS À OPERAÇÃO E MANUTENÇÃO DAS INFRAESTRUTURAS DO EIXO LESTE DO PISF - PROJETO DE INTEGRAÇÃO DO SÃO FRANCISCO COM AS BACIAS HIDROGRÁFICAS DO NORDESTE SETENTRIONAL"}]
[]
[]
["EQUIPE - MÃO DE OBRA (SEGURANÇA DE BARRAGENS)"]
[]
["ITEM","CÓDIGO","DESCRIÇÃO","UNIDADE","QUANTIDADE","VALOR (R$)"]
[{"$nulls":5},"UNITARIO","TOTAL"]
["1.",null,"EQUIPE - MÃO DE OBRA (SEGURANÇA DE BARRAGENS)",{"$nulls":6},12,{"$f":"'ORCAMENTO_CONSOLIDADO (2)'!$K$1","v":6}]
["1.1","P1","Engenheiro Pleno  - Esp. Em Seg. de Barragem","homem x mês",6,"","",null,12,{"$f":"I13/$J$12","v":1}]
["1.2","P1","Engenheiro. Civil  (Geotecnico)","homem x mês",6,"","",null,12,{"$f":"I14/$J$12","v":1}]
["1.3","P2","Engenheiro Junior - Civil","homem x mês",6,"","",null,12,1]
["1.4","A1","Assistente Administrativo (Assistente social)","homem x mês",12,"","",null,24,2]
["1.5","AS","Assistente Administrativo (administrativo)","homem x mês",12,"","",null,24,2]
["1.6","A1","Auxiliar Administrativo","homem x mês",6,"","",null,12,1]
["1.7","TS","Topógrafo ","homem x mês",6,"","",null,12,1]
["1.8","T3","Auxiliar de Topografia","homem x mês",12,"","",null,24,2]
["1.9","T2","Técnico Pleno","homem x mês",6,"","",null,12,1]
["TOTAL - EQUIPE - MÃO DE OBRA (SEGURANÇA DE BARRAGENS) - (R$):"]
[]
[]
["RESUMO - EQUIPE - MÃO DE OBRA (SEGURANÇA DE BARRAGENS)"]
["ITEM",null,"DESCRIÇÃO",null,null,"VALOR TOTAL (R$)"]
[1,null,"EQUIPE - MÃO DE OBRA (SEGURANÇA DE BARRAGENS)"]
["TOTAL GERAL - EQUIPE - MÃO DE OBRA (SEGURANÇA DE BARRAGENS) -  (R$):"]
[]
[]
["NOME DO INFORMANTE:",{"$nulls":4},"QUALIFICAÇÃO:"]
[]
["ASSINATURA:",{"$nulls":4},"DATA:"]
[]
["OBSERVAÇÕES:"]
["1. Considerado a carga horária de 176 horas/mês"]
["2. Os cálculos de cada parcela que compõe o salário completo foram calculadas isoladamente. (Salário Base + Adicional de Periculosidade (quando houver) + Adicional Noturno (quando houver) + Adicional de Horas Extras (quando houver) +  Encargos Sociais)"]
[]
["3. Adicional de Periculosidade 30%: foi previsto para todos os profissionais eletricitários (Operação e Manutenção) que trabalham em contato com rede elétrica (nas estações de bombeamento, sub-estações, etc.) "]
[]
["4. Hora Noturna: Hora Diurna x 20%"]
["5. Adicional Noturno: *Considerado 120 horas/profissional/mês (Total de 8h noturnas: Período de 22h as 5h = 8h noturnas + 1h até as 6h => Súmula 60 do TST)    *(Incide sobre Salário Base + Periculosidade => Súmula 191 do TST)"]
[]
["6. Período noturno – 22 às 5 horas, o valor da hora tem 52 minutos e 30 segundos; logo, nesse período, há 8 horas"]
["7. Foi considerado intervalo intrajornada para todos os profissionais que trabalham em escala 12h x 36h "]

{"sheet":"MEM_CALCULO_SEG DE BARRAGENS","index":16,"n_rows":27,"n_cols":11,"rows_kept":27,"cut":false,"hidden":false,"merged":[[23,2,23,5],[26,0,26,3],[4,0,5,7],[7,0,7,7],[0,2,0,7],[1,2,1,7],[2,2,2,7]]}
[null,null,"Ministério do Desenvolvimento Regional  - MDR"]
[null,null,"Companhia de Desenvolvimento dos Vales do São Francisco e do Parnaíba"]
[null,null,"Gerência de Operação do PISF - Centro de Controle e Operação (AD / GOI / CCO)"]
[]
[{"$f":"ORCAMENTO_RESUMO!A5","v":"TERMO DE REFERÊNCIA PARA CONTRATAÇÃO DOS RECURSOS NECESSÁRIOS À OPERAÇÃO E MANUTENÇÃO DAS INFRAESTRUTURAS DO EIXO LESTE DO PISF - PROJETO DE INTEGRAÇÃO DO SÃO FRANCISCO COM AS BACIAS HIDROGRÁFICAS DO NORDESTE SETENTRIONAL"}]
[]
[]
["MEMÓRIA DE CÁLCULO - EQUIPE - MÃO DE OBRA (SEGURANÇA DE BARRAGENS)"]
[]
["ITEM",null,"DESCRIÇÃO","CLASSE","LOTAÇÃO","MOBILIZAÇÃO","QUANTIDADE","OBSERVAÇÕES"]
[]
[]
["1.0",null,"MÃO DE OBRA - SEGURAÇA DE BARRAGEM - LESTE "]
["1.1",null,"Engenheiro Sênior  - Esp. Em Seg. de Barragem","P1","Coordenação (à definir)","Pode utilizar o escritório",{"$f":"J14-K14","v":1},"Equipe: 1/EIXO",null,1]
["1.2",null,"Engenheiro. Civil  (Geotecnico)","P1","Coordenação (à definir)","Pode utilizar o escritório",{"$f":"J15-K15","v":1},"Equipe: 1/EIXO",null,1]
["1.3",null,"Engenheiro Junior - Civil","P2","Coordenação (à definir)","Pode utilizar o escritório",1,"Equipe: 1/EIXO",null,1]
["1.4",null,"Assistente Administrativo (Assistente social)","AS","Coordenação (à definir)","Pode utilizar o escritório",2,"Equipe: 1/TRECHO",null,2]
["1.5",null,"Assistente Administrativo (administrativo)","A1","Coordenação (à definir)","Pode utilizar o escritório",2,"Equipe: 1/TRECHO",null,2]
["1.6",null,"Auxiliar Administrativo","A1","Coordenação (à definir)","Pode utilizar o escritório",1,"Inserido no item 3.0",null,1]
["1.7",null,"Topógrafo","TS","Coordenação (à definir)","Pode utilizar o escritório",1,"Equipe: 1/TRECHO",null,2,1]
["1.8",null,"Auxiliar de Topografia","T3","Coordenação (à definir)","Não utilliza o Escritório",2,"Equipe: 2/TRECHO",null,4,2]
["1.9",null,"Técnico Pleno","T2","Coordenação (à definir)","Pode utilizar o escritório",1,"Equipe: 1/EIXO",null,1]
[]
["2.",null,"MÃO DE OBRA - SEGURAÇA DE BARRAGEM - LESTE "]
["2.1","B11","Veículo Tipo Pick Up Cabine Dupla 4 x 4 (163 CV)",12,{"$f":"J25-K25","v":1},{"$f":"E25*D25","v":12},null,null,null,2,1]
["2.2","B4","TIPO SEDAN 1.6 FLEX (115CV)",12,{"$f":"J26-K26","v":1},{"$f":"E26*D26","v":12},null,null,null,2,1]
["TOTAL DE VEÍCULOS - MÃO DE OBRA - SEGURAÇA DE BARRAGEM - NORTE :",null,null,null,{"$f":"SUM(E25:E26)","v":2},{"$f":"SUM(F25:F26)","v":24}]

{"sheet":"CPU_SALARIOS","index":17,"n_rows":49,"n_cols":10,"rows_kept":49,"cut":false,"hidden":false,"merged":[[10,5,10,7],[11,6,11,7],[0,3,0,7],[1,3,1,7],[2,3,2,7],[4,0,5,7],[7,0,7,7],[46,0,46,7],[45,0,45,7],[49,0,49,7],[47,0,47,7],[10,0,12,0],[10,3,12,3],[10,4,12,4],[41,0,41,4],[10,2,12,2],[42,0,42,4],[43,0,43,4],[44,0,44,4],[41,6,41,7],[42,6,42,7],[43,6,43,7],[44,6,44,7]]}
[null,null,null,"Ministério do Desenvolvimento Regional  - MDR"]
[null,null,null,"Companhia de Desenvolvimento dos Vales do São Francisco e do Parnaíba"]
[null,null,null,"Gerência de Operação do PISF - Centro de Controle e Operação (AD / GOI / CCO)"]
[]
[{"$f":"Mem_Calculo_EQUIPE!A5","v":"TERMO DE REFERÊNCIA PARA CONTRATAÇÃO DOS RECURSOS NECESSÁRIOS À OPERAÇÃO E MANUTENÇÃO DAS INFRAESTRUTURAS DO EIXO LESTE DO PISF - PROJETO DE INTEGRAÇÃO DO SÃO FRANCISCO COM AS BACIAS HIDROGRÁFICAS DO NORDESTE SETENTRIONAL"}]
[]
[]
["MEMORIAL DE CÁLCULO - SALÁRIOS"]
[]
[]
["ITEM",null,null,"CLASSE","PROFISSIONAL","SALÁRIO"]
[{"$nulls":5},"HORISTA","MENSALISTA"]
[{"$nulls":5},"COM ENCARGO","VALOR BASE","COM ENCARGO"]
[1,"Sicro","P9955","P0.1","Engenheiro - Profissional Sênior  c/ Encargos Complementares (N. Superior - Formação: 10 anos < T; mais de 5 anos de experiencia na função de Cooredenador)",""]
[2,"Sicro","P9955","P0","Engenheiro - Profissional Sênior  c/ Encargos Complementares (N. Superior - Formação: 10 anos < T )",""]
[3,"Sicro","P9819","P1","Engenheiro - Profissional Pleno c/ Encargos Complementares (N. Superior - Formação: 5 anos < T )",""]
[4,"Sicro","P9946","P2","Engenheiro - Profissional Junior c/ Encargos Complementares (N. Superior - Formação: 2 anos < T )",""]
[5,"Sicro","P9949","TS","Topógrafo (N. Médio/Especializado - Formação: 5 anos < T ) ",""]
[6,"Sicro","P9840","T0","Técnico - Profissional Sênior (N. Médio/Especializado - Formação: 10 anos < T )",""]
[7,"Sicro","P9867","T1","Técnico TI (N. Médio/Especializado - Formação: 2 anos < T)",""]
[8,"Sicro","P9867","T2","Auxiliar Tecnico / Assistente de Engenharia com Encargos Complementares (N. Médio/Especializado - Formação: 2 anos < T )",""]
[9,"Sicro","P9950","T3","Auxiliar de Topografia/Técnico auxiliar (N. Médio)",""]
[10,"Sicro","P9883","AS","Assistene Social (usado o custo de referência do setor administrativo)(N. Superior - Formação: 2 anos < T )",""]
[11,"Sicro","P9826","CA","Coordenador Administrativo - Chefe do setor administrativo (Chefe de Escritório) (N. Superior - Formação: 2 anos < T )",""]
[12,"Sicro","P9806","A1","Auxiliar administrativo com Encargos Complementares",""]
[13,"Sinapi",101377,"A2","Mobilizador - Ajudante de Operação em Geral com Encargos Complementares (N. Médio)","",""]
[14,"Sinapi",101422,"A3","Motorista de Carro com Encargos Complementares  (N. Elementar)","",""]
[15,"Sinapi",100316,"A4","AUXILIAR DE ALMOXARIFE COM ENCARGOS COMPLEMENTARES","",""]
[16,"Sinapi",101399,"A5","ELETRICISTA COM ENCARGOS COMPLEMENTARES","",""]
[17,"Sinapi",101445,"A6","PEDREIRO COM ENCARGOS COMPLEMENTARES","",""]
[18,"Sinapi",101381,"A7","ARMADOR COM ENCARGOS COMPLEMENTARES","",""]
[19,"Sinapi",101397,"A8","CARPINTEIRO DE FORMAS COM ENCARGOS COMPLEMENTARES","",""]
[20,"Sinapi",101388,"A9","Auxiliar de Serviços Gerais com Encargos Complementares (Limpeza / Copa) (N. Elementar)","",""]
[21,"Sinapi",101460,"A10","VIGIA DIURNO COM ENCARGOS COMPLEMENTARES","",""]
[22,"Sinapi",101452,"A11","SERVENTE DE OBRAS COM ENCARGOS COMPLEMENTARES","",""]
[23,"Sicro","P9867*","T2*(SA)","Auxiliar Tecnico / Assistente de Engenharia com Encargos Complementares (N. Médio/Especializado - Formação: 5 anos < T )","","",""]
[24,"Sicro","P9950*","T3*(SA)","Técnico - Auxiliar (N. Elementar)","","",""]
[25,"Sicro","P9819*","P1*(SA)","Engenheiro - Profissional Pleno c/ Encargos Complementares (N. Superior - Formação: 5 anos < T )","","","",null,{"$f":"SUM(H14:H38)","v":0}]
[]
[]
[]
["NOME DO INFORMANTE:",{"$nulls":5},"QUALIFICAÇÃO:"]
[]
["ASSINATURA:",{"$nulls":5},"DATA:"]
[]
["OBSERVAÇAO:"]
["1. Fonte de Preços: Sinapi 04-2022 ; Sicro 01-2022"]
["*(SA)Profissionais com regime de sobreaviso"]
["*consideração de ",null,176,"horas por mês"]

{"sheet":"Encargos Sociais e Benefícios","index":18,"n_rows":77,"n_cols":3,"rows_kept":77,"cut":false,"hidden":false,"merged":[[78,0,78,2],[76,0,77,2],[73,0,73,1],[74,0,74,2],[75,0,75,2],[70,0,70,1],[71,0,71,1],[72,0,72,1],[64,0,64,1],[37,0,37,1],[43,0,43,1],[44,0,44,1],[45,0,45,1],[57,0,57,2],[48,0,48,1],[49,0,49,1],[65,0,66,2],[0,1,0,2],[1,1,1,2],[2,1,2,2],[11,0,11,2],[69,0,69,2],[50,0,50,1],[55,0,55,1],[36,0,36,1],[12,0,12,1],[22,0,22,1],[23,0,23,1],[24,0,24,1],[35,0,35,1],[68,0,68,2],[4,0,5,2],[7,0,7,2]]}
[null,"Ministério do Desenvolvimento Regional  - MDR"]
[null,"Companhia de Desenvolvimento dos Vales do São Francisco e do Parnaíba"]
[null,"Gerência de Operação do PISF - Centro de Controle e Operação (AD / GOI / CCO)"]
[]
[{"$f":"CPU_SALARIOS!A5","v":"TERMO DE REFERÊNCIA PARA CONTRATAÇÃO DOS RECURSOS NECESSÁRIOS À OPERAÇÃO E MANUTENÇÃO DAS INFRAESTRUTURAS DO EIXO LESTE DO PISF - PROJETO DE INTEGRAÇÃO DO SÃO FRANCISCO COM AS BACIAS HIDROGRÁFICAS DO NORDESTE SETENTRIONAL"}]
[]
[]
[" ENCARGOS SOCIAIS E TRABALHISTAS E BENEFÍCIOS"]
[]
[]
["ITEM","DESCRIÇÃO","Mensalista Diurno"]
["1.0 Encargos sociais - SISTEMA NACIONAL DE PESQUISA DE CUSTOS E ÍNDICES DA CONSTRUÇÃO CIVIL - Pernambuco - 2022"]
["GRUPO \"A\"",null,"%"]
["A1","INSS (Art. 22 inciso I da Lei 8.212/91) ",0.2]
["A2","SESC/SESI (Art. 3° da Lei 8036/90)",1.4999999999999999E-2]
["A3","SENAC/SENAI (Decreto 2.318/86)",0.01]
["A4","INCRA  (Lei 7787 de 30/06/890e DL 1146/70)",2E-3]
["A5","SEBRAE (Art. 8° Lei 8029/90 e 8154 de 28/12/90)",6.0000000000000001E-3]
["A6","Salário Educação (Art. 3° inciso I Decreto 87.043/)",2.5000000000000001E-2]
["A7","Seguro contra Acidentes de Trabalho  (Decreto 3.048/1999, Anexo V e Decreto 6.957/2009)  ",0.03]
["A8","FGTS (Art. 15 da Lei 8030/90 art. 7° inciso III CF/88)",0.08]
["A8","SECONCI","-"]
[{"$f":"\"TOTAL - \"&A13&\" - (%):\"","v":"TOTAL - GRUPO \"A\" - (%):"},null,{"$f":"SUM(C14:C22)","v":0.36800000000000005}]
[]
["GRUPO \"B\"",null,"%"]
["B1","Repouso semanal remunerado","-"]
["B2","Feriados","-"]
["B3","Auxílio Enfermidade",6.6E-3]
["B4","13º Salário",8.3299999999999999E-2]
["B5","Licença Paternidade Faltas justificadas",5.9999999999999995E-4]
["B6","Faltas Justificadas",5.5999999999999999E-3]
["B7","Dias de Chuva","-"]
["B8","Auxílio Acidente de Trabalho",8.0000000000000004E-4]
["B9","Férias Gozadas",6.7799999999999999E-2]
["B10","Salário Maternidade",2.0000000000000001E-4]
[{"$f":"\"TOTAL - \"&A25&\" - (%):\"","v":"TOTAL - GRUPO \"B\" - (%):"},null,{"$f":"SUM(C26:C35)","v":0.16489999999999999}]
[]
["GRUPO \"C\"",null,"%"]
["C1","Aviso Prévio Indenizado",3.6299999999999999E-2]
["C2","Aviso Prévio Trabalhado",8.9999999999999998E-4]
["C3","Férias Indenizadas",3.6200000000000003E-2]
["C4","Depósito Rescisão sem Justa Causa",2.5899999999999999E-2]
["C5","Indenização Adicional",3.0999999999999999E-3]
[{"$f":"\"TOTAL - \"&A38&\" - (%):\"","v":"TOTAL - GRUPO \"C\" - (%):"},null,{"$f":"SUM(C39:C43)","v":0.1024}]
[]
["GRUPO \"D\"",null,"%"]
["D1","Reincidência de Grupo A sobre Grupo B",6.06832E-2]
["D2","Reincidência de Grupo A sobre C2 e Reincidência de A8 sobre C1",3.2352000000000001E-3]
[{"$f":"\"TOTAL - \"&A46&\" - (%):\"","v":"TOTAL - GRUPO \"D\" - (%):"},null,{"$f":"SUM(C47:C48)","v":6.39184E-2}]
[]
["GRUPO \"E\"",null,"%"]
["E1","Auxílio Alimentação",0.04]
["E2","Equipamento de Proteção Individual - EPI",1.2999999999999999E-2]
["E3","Consultas e exames Médicos",5.0000000000000001E-3]
["E4","Seguro de Vida",0]
[{"$f":"\"TOTAL - \"&A51&\" - (%):\"","v":"TOTAL - GRUPO \"E\" - (%):"},null,{"$f":"SUM(C52:C55)","v":5.7999999999999996E-2}]
[]
["RESUMO - 1.0 Encargos sociais - SISTEMA NACIONAL DE PESQUISA DE CUSTOS E ÍNDICES DA CONSTRUÇÃO CIVIL - Pernambuco - 2022"]
["ITEM","DESCRIÇÃO","%"]
[1,{"$f":"A13","v":"GRUPO \"A\""},{"$f":"C23","v":0.36800000000000005}]
[2,{"$f":"A25","v":"GRUPO \"B\""},{"$f":"C36","v":0.16489999999999999}]
[3,{"$f":"A38","v":"GRUPO \"C\""},{"$f":"C44","v":0.1024}]
[4,{"$f":"A46","v":"GRUPO \"D\""},{"$f":"C49","v":6.39184E-2}]
[5,{"$f":"A51","v":"GRUPO \"E\""},{"$f":"C56","v":5.7999999999999996E-2}]
[{"$f":"\"TOTAL - \"&A58&\" - (%):\"","v":"TOTAL - RESUMO - 1.0 Encargos sociais - SISTEMA NACIONAL DE PESQUISA DE CUSTOS E ÍNDICES DA CONSTRUÇÃO CIVIL - Pernambuco - 2022 - (%):"},null,{"$f":"SUM(C60:C64)","v":0.75721840000000018}]
["OBS: Utilizando os valores dos encargos complementares do SINAPI-PE 12/21 para os itens alimentação, EPI, seguro e exames, os menores indices encontrados respectivamentes são 8,80%, 2,32%, 3,12% e 0%. Então foi aplicado para todos os profissionais de referência SINAPI os indices do contrato vigente de O&M (nº 0.086.00/2019) que são 4,00%, 1,3% e 0,5%."]
[]
[]
["2.0 Encargos sociais - SISTEMA DE CUSTOS REFERENCIAIS DE OBRAS - SICRO - Pernambuco - 2022"]
["Os encargos sociais variam para cada categoria profissional"]
["NOME DO INFORMANTE:",null,"QUALIFICAÇÃO:"]
[]
["ASSINATURA:",null,"DATA:"]
[]
["OBSERVAÇÃO:"]
["1. Fonte: Sistema Nacional de Pesquisa de Custos e Índices da Construção (Tablea SINAPI - Composição de Encargos Sociais); SISTEMA DE CUSTOS REFERENCIAIS DE OBRAS - SICRO (Tabela SICRO - Relatório Sintético de Encargos Sociais)."]
["2. Os percentuais dos encargos previdenciários e FGTS, a serem preenchidos na coluna %, são aqueles estabelecidos pela legislação vigente, incidentes sobre a remuneração"]

{"sheet":"CPU_Viagens","index":19,"n_rows":93,"n_cols":7,"rows_kept":93,"cut":false,"hidden":false,"merged":[[92,0,92,6],[81,1,81,4],[81,5,81,6],[89,0,89,6],[90,0,90,6],[85,0,85,4],[85,5,85,6],[86,0,86,4],[86,5,86,6],[87,0,87,4],[87,5,87,6],[88,0,88,6],[80,5,80,6],[82,0,82,4],[82,5,82,6],[84,0,84,4],[84,5,84,6],[80,1,80,4],[75,0,75,5],[78,0,78,6],[79,1,79,4],[79,5,79,6],[12,1,12,6],[10,4,10,6],[48,0,48,5],[50,1,50,6],[10,3,11,3],[10,0,11,0],[10,1,11,1],[10,2,11,2],[0,1,0,6],[1,1,1,6],[2,1,2,6],[4,0,5,6],[7,0,7,6]]}
[null,"Ministério do Desenvolvimento Regional  - MDR"]
[null,"Companhia de Desenvolvimento dos Vales do São Francisco e do Parnaíba"]
[null,"Gerência de Operação do PISF - Centro de Controle e Operação (AD / GOI / CCO)"]
[]
[{"$f":"[2]Viagens_Diárias!A5","v":"TERMO DE REFERÊNCIA PARA CONTRATAÇÃO DOS RECURSOS NECESSÁRIOS À OPERAÇÃO E MANUTENÇÃO DAS INFRAESTRUTURAS DO EIXO LESTE DO PISF - PROJETO DE INTEGRAÇÃO DO SÃO FRANCISCO COM AS BACIAS HIDROGRÁFICAS DO NORDESTE SETENTRIONAL"}]
[]
[]
["MEMORIAL DE CÁLCULO - VIAGENS"]
[]
[]
["ITEM","ORIGEM","DESTINO","COMPANHIA","VALOR (R$)"]
[{"$nulls":4},"TAXA","TRECHO","TOTAL"]
["1.","PASSAGENS AÉREAS"]
["1.1","Brasília (BSB)","Curitiba (CWB)","LATAM",null,null,""]
["1.2","Brasília (BSB)","Rio de Janeiro (GIG)","LATAM",null,null,""]
["1.3","Brasília (BSB)","São Paulo (GRU)","LATAM",null,null,""]
["1.4","Brasília (BSB)","Juazeiro do Norte (JDO)","LATAM",null,null,""]
["1.5","Brasília (BSB)","Petrolina (PNZ)","LATAM",null,null,""]
["1.6","Brasília (BSB)","Porto Alegre (POA)","LATAM",null,null,""]
["1.7","Brasília (BSB)","Recife (REC)","LATAM",null,null,""]
["1.8","Brasília (BSB)","Salvador (SSA)","GOL",null,null,""]
["1.9","Curitiba (CWB)","Rio de Janeiro (GIG)","LATAM",null,null,""]
["1.10","Curitiba (CWB)","São Paulo (GRU)","LATAM",null,null,""]
["1.11","Curitiba (CWB)","Juazeiro do Norte (JDO)","LATAM",null,null,""]
["1.12","Curitiba (CWB)","Petrolina (PNZ)","LATAM",null,null,""]
["1.13","Curitiba (CWB)","Porto Alegre (POA)","AZUL",null,null,""]
["1.14","Curitiba (CWB)","Recife (REC)","LATAM",null,null,""]
["1.15","Curitiba (CWB)","Salvador (SSA)","LATAM",null,null,""]
["1.16","Rio de Janeiro (GIG)","São Paulo (GRU)","LATAM",null,null,""]
["1.17","Rio de Janeiro (GIG)","Juazeiro do Norte (JDO)","LATAM",null,null,""]
["1.18","Rio de Janeiro (GIG)","Petrolina (PNZ)","LATAM",null,null,""]
["1.19","Rio de Janeiro (GIG)","Porto Alegre (POA)","LATAM",null,null,""]
["1.20","Rio de Janeiro (GIG)","Recife (REC)","LATAM",null,null,""]
["1.21","Rio de Janeiro (GIG)","Salvador (SSA)","GOL",null,null,""]
["1.22","São Paulo (GRU)","Juazeiro do Norte (JDO)","LATAM",null,null,""]
["1.23","São Paulo (GRU)","Petrolina (PNZ)","GOL",null,null,""]
["1.24","São Paulo (GRU)","Porto Alegre (POA)","LATAM",null,null,""]
["1.25","São Paulo (GRU)","Recife (REC)","LATAM",null,null,""]
["1.26","São Paulo (GRU)","Salvador (SSA)","LATAM",null,null,""]
["1.27","Juazeiro do Norte (JDO)","Porto Alegre (POA)","AZUL",null,null,""]
["1.28","Juazeiro do Norte (JDO)","Recife (REC)","AZUL",null,null,""]
["1.29","Juazeiro do Norte (JDO)","Salvador (SSA)","AZUL",null,null,""]
["1.30","Petrolina (PNZ)","Porto Alegre (POA)","GOL",null,null,""]
["1.31","Petrolina (PNZ)","Recife (REC)","AZUL",null,null,""]
["1.32","Petrolina (PNZ)","Salvador (SSA)","GOL",null,null,""]
["1.33","Porto Alegre (POA)","Recife (REC)","LATAM",null,null,""]
["1.34","Porto Alegre (POA)","Salvador (SSA)","GOL",null,null,""]
["1.35","Recife (REC)","Salvador (SSA)","AZUL",null,null,""]
["VALOR MÉDIO - PASSAGENS AÉREAS - (R$):",{"$nulls":5},""]
[]
["2.","PASSAGENS TERRESTRES"]
["2.1","Brasília (BSB)","Curitiba (CWB)","Real Expresso",null,null,""]
["2.2","Brasília (BSB)","Rio de Janeiro (GIG)","GIPSYY",null,null,""]
["2.3","Brasília (BSB)","São Paulo (GRU)","Real Expresso",null,null,""]
["2.4","Brasília (BSB)","Juazeiro do Norte (JDO)","Guanabara",null,null,""]
["2.5","Brasília (BSB)","Petrolina (PNZ)","Guanabara",null,null,""]
["2.6","Brasília (BSB)","Porto Alegre (POA)","Real Expresso",null,null,""]
["2.7","Brasília (BSB)","Recife (REC)","Expresso São Luiz",null,null,""]
["2.8","Brasília (BSB)","Salvador (SSA)","Rápido Federal",null,null,""]
["2.9","Curitiba (CWB)","Rio de Janeiro (GIG)","Penha",null,null,""]
["2.10","Curitiba (CWB)","São Paulo (GRU)","Penha",null,null,""]
["2.11","Curitiba (CWB)","Porto Alegre (POA)","Penha",null,null,""]
["2.12","Rio de Janeiro (GIG)","São Paulo (GRU)","Aguia Branca",null,null,""]
["2.13","Rio de Janeiro (GIG)","Porto Alegre (POA)","Penha",null,null,""]
["2.14","Rio de Janeiro (GIG)","Recife (REC)","Gontijo",null,null,""]
["2.15","Rio de Janeiro (GIG)","Salvador (SSA)","Aguia Branca",null,null,""]
["2.16","São Paulo (GRU)","Porto Alegre (POA)","Penha",null,null,""]
["2.17","São Paulo (GRU)","Recife (REC)","Itapemirim",null,null,""]
["2.18","Juazeiro do Norte (JDO)","Recife (REC)","Progresso",null,null,""]
["2.19","Petrolina (PNZ)","Recife (REC)","Progresso",null,null,""]
["2.20","Petrolina (PNZ)","Salvador (SSA)","Aguia Branca",null,null,""]
["2.21","Recife (REC)","Salvador (SSA)","Guanabara",null,null,""]
["2.22","Brasília (BSB)","Salgueiro (SGI)","Guanabara",null,null,""]
["2.23","Petrolina (PNZ)","Salgueiro (SGI)","Progresso",null,null,""]
["2.24","Recife (REC)","Salgueiro (SGI)","Progresso",null,null,""]
["VALOR MÉDIO - PASSAGENS TERRESTRES - (R$):",{"$nulls":5},""]
[]
[]
["RESUMO - MEMORIAL DE CÁLCULO - VIAGENS"]
["ITEM","DESCRIÇÃO",null,null,null,"VALOR TOTAL (R$)"]
[1,"PASSAGENS AÉREAS",null,null,null,""]
[2,"PASSAGENS TERRESTRES",null,null,null,""]
["MÉDIA GERAL - MEMORIAL DE CÁLCULO - VIAGENS - (R$):",{"$nulls":4},""]
[]
["NOME DO INFORMANTE:",{"$nulls":4},"QUALIFICAÇÃO:"]
[]
["ASSINATURA:",{"$nulls":4},"DATA:"]
[]
["OBSERVAÇÃO:"]
["1. Fonte de Preço: www.decolar.com. Considerando menores preços e companhias aéreas para registro do preço."]
["2. Data de pesquisa: 12/01/2022 . "]
["3. Fonte de Preço: www.clickbus.com.br. Considerando menores preços e companhias aéreas para registro do preço."]
["4. Diárias - Fonte www.Booking.com - Considerando os menores preços"]

{"sheet":"Frentes_Moveis","index":20,"n_rows":48,"n_cols":12,"rows_kept":48,"cut":false,"hidden":false,"merged":[[24,5,24,6],[25,5,25,6],[26,5,26,6],[19,2,19,4],[4,0,5,6],[18,0,18,6],[19,5,19,6],[23,5,23,6],[20,2,20,4],[21,0,21,4],[23,0,23,4],[21,5,21,6],[20,5,20,6],[24,0,24,4],[25,0,25,4],[26,0,26,4],[0,2,0,6],[1,2,1,6],[2,2,2,6],[12,2,12,6],[16,0,16,5],[7,0,7,6],[10,0,11,0],[10,2,11,2],[10,3,11,3],[10,4,11,4],[10,5,10,6],[10,1,11,1],[48,0,48,6],[44,0,44,2],[29,0,32,5],[34,0,34,5],[35,2,38,5],[40,0,40,2],[40,3,40,5]]}
[null,null,"Ministério do Desenvolvimento Regional  - MDR"]
[null,null,"Companhia de Desenvolvimento dos Vales do São Francisco e do Parnaíba"]
[null,null,"Gerência de Operação do PISF - Centro de Controle e Operação (AD / GOI / CCO)"]
[]
[{"$f":"CPU_Viagens!A5","v":"TERMO DE REFERÊNCIA PARA CONTRATAÇÃO DOS RECURSOS NECESSÁRIOS À OPERAÇÃO E MANUTENÇÃO DAS INFRAESTRUTURAS DO EIXO LESTE DO PISF - PROJETO DE INTEGRAÇÃO DO SÃO FRANCISCO COM AS BACIAS HIDROGRÁFICAS DO NORDESTE SETENTRIONAL"}]
[]
[]
["FRENTES MÓVEIS DE LIMPEZA E CONSERVAÇÃO"]
[]
[]
["ITEM","ITEM","DESCRIÇÃO","UNIDADE","QUANTIDADE","VALOR (R$)"]
[{"$nulls":5},"UNITARIO","TOTAL"]
["1.",null,"FRENTES MÓVEIS DE LIMPEZA E CONSERVAÇÃO",{"$nulls":7},12,{"$f":"'ORCAMENTO_CONSOLIDADO (2)'!$K$1","v":6}]
["1.1","Banco de Preços (PREGÃO ELETRÔNICO - MUNICÍPIO DE FÁTIMA/BA, 05/2022)","Tenda Piramidal 5m x 5m (para refeitório)","un x mês",48,{"$nulls":4},96,{"$f":"J14/$K$13","v":8},{"$f":"K14*$L$13","v":48}]
["1.2","F099722405/EMBASA","Tenda Piramidal 3m x 3m ","un x mês",48,{"$nulls":4},96,{"$f":"J15/$K$13","v":8},{"$f":"K15*$L$13","v":48}]
["1.3","10390 - ORSE/SE","Banheiro Químico, com 03 limpezas semanais","un x mês",120,{"$nulls":4},240,20,120]
["TOTAL - FRENTES MÓVEIS DE LIMPEZA E CONSERVAÇÃO - (R$):"]
[]
["RESUMO - FRENTES MÓVEIS DE LIMPEZA E CONSERVAÇÃO"]
["ITEM",null,"DESCRIÇÃO",null,null,"VALOR TOTAL (R$)"]
["01",null,"FRENTES MÓVEIS DE LIMPEZA E CONSERVAÇÃO"]
["TOTAL GERAL - FRENTES MÓVEIS DE LIMPEZA E CONSERVAÇÃO - (R$):"]
[]
["NOME DO INFORMANTE:",{"$nulls":4},"QUALIFICAÇÃO:"]
[]
["ASSINATURA:",{"$nulls":4},"DATA:"]
[]
["Observações"]
[]
[" art. 305 do RIR/1999 esclarece que:\n\n\"Art. 305. Poderá ser computada, como custo ou encargo, em cada período de apuração, a importância correspondente à diminuição do valor dos bens do ativo resultante do desgaste pelo uso, ação da natureza e obsolescência normal (Lei nº 4.506, de 1964, art. 57).\""]
[]
[]
[]
[]
[" Instrução Normativa da Secretaria da Receita Federal (SRF)"]
["Da","Depreciação","Da = (VN - VR) / N"]
["VN","Valor Novo"]
["VR","Valor Residual"]
["N","Vída útil (anos)"]
[]
["DADOS - Frentes móveis",null,null,"CONSIDERAÇÕES"]
["Depreciação anual (%)",null,0.4]
["Vida últil (anos)",null,2.5]
[]
["DESCRIÇÃO",null,null,"Valor de aquisição (R$)","Valor com depreciação (R$)"]
["und","COT_TP1","Tenda Piramidal 5m x 5m (para refeitório)"]
["und","COT_TP2","Tenda Piramidal 3m x 3m "]
["1. Valor unitário final = (Depreciação anual) / (Tempo de contrato)"]

{"sheet":"Viagens_Diárias","index":21,"n_rows":45,"n_cols":13,"rows_kept":45,"cut":false,"hidden":false,"merged":[[10,1,11,1],[12,2,12,6],[24,0,24,5],[31,0,31,4],[31,5,31,6],[10,0,11,0],[10,2,11,2],[10,3,11,3],[10,4,11,4],[10,5,10,6],[14,2,14,6],[17,0,17,5],[19,2,19,6],[22,0,22,5],[39,0,39,6],[44,0,44,6],[45,0,45,6],[40,0,40,6],[36,0,36,4],[36,5,36,6],[37,0,37,4],[37,5,37,6],[38,0,38,6],[41,0,42,6],[43,0,43,6],[34,0,34,4],[34,5,34,6],[35,0,35,4],[35,5,35,6],[27,0,27,6],[28,2,28,4],[28,5,28,6],[30,2,30,4],[30,5,30,6],[29,2,29,4],[29,5,29,6],[0,2,0,6],[1,2,1,6],[2,2,2,6],[4,0,5,6],[7,0,7,6]]}
[null,null,"Ministério do Desenvolvimento Regional  - MDR"]
[null,null,"Companhia de Desenvolvimento dos Vales do São Francisco e do Parnaíba"]
[null,null,"Gerência de Operação do PISF - Centro de Controle e Operação (AD / GOI / CCO)"]
[]
[{"$f":"'Encargos Sociais e Benefícios'!A5","v":"TERMO DE REFERÊNCIA PARA CONTRATAÇÃO DOS RECURSOS NECESSÁRIOS À OPERAÇÃO E MANUTENÇÃO DAS INFRAESTRUTURAS DO EIXO LESTE DO PISF - PROJETO DE INTEGRAÇÃO DO SÃO FRANCISCO COM AS BACIAS HIDROGRÁFICAS DO NORDESTE SETENTRIONAL"}]
[]
[]
["VIAGENS / DIÁRIAS"]
[]
[]
["ITEM","CÓDIGO","DESCRIÇÃO","UNIDADE","QUANTIDADE","VALOR (R$)"]
[{"$nulls":5},"UNITARIO","TOTAL"]
[null,null,"VIAGENS / DIÁRIAS"]
[]
["1.",null,"DESPESAS COM VIAGENS COMERCIAIS",{"$nulls":9},{"$f":"'ORCAMENTO_CONSOLIDADO (2)'!$K$1","v":6}]
["1.1",null,"Viagem por via aerea","un",6,"","",null,null,null,12,{"$f":"K16/12","v":1},{"$f":"L16*$M$15","v":6}]
["1.2",null,"Viagem por via terrestre (comercial)","un",18,"","",null,null,null,36,{"$f":"K17/12","v":3},{"$f":"L17*$M$15","v":18}]
["TOTAL - DESPESAS COM VIAGENS COMERCIAIS - (R$):",{"$nulls":5},""]
[]
["2.",null,"DESPESAS COM DIÁRIAS"]
["2.1",null,"Diárias nacionais","un",6,null,"",null,null,null,12,{"$f":"K21/12","v":1},6]
["2.2",null,"Diárias regionais","un",72,null,"",null,null,null,144,12,72]
["TOTAL - DESPESAS COM DIÁRIAS - (R$):",{"$nulls":5},""]
[]
["TOTAL - VIAGENS / DIÁRIAS - (R$):"]
[]
[]
["RESUMO - VIAGENS / DIÁRIAS"]
["ITEM",null,"DESCRIÇÃO",null,null,"VALOR TOTAL (R$)"]
[1,null,"DESPESAS COM VIAGENS COMERCIAIS",null,null,""]
[2,null,"DESPESAS COM DIÁRIAS",null,null,""]
["TOTAL GERAL - VIAGENS / DIÁRIAS - (R$):",{"$nulls":6},"ok"]
[]
[]
["NOME DO INFORMANTE:",{"$nulls":4},"QUALIFICAÇÃO:"]
[]
["ASSINATURA:",{"$nulls":4},"DATA:"]
[]
["OBSERVAÇÃO:"]
["1. Os produtos serão pagos por demanda (Conforme efetiva utilização, mediante autorização prévia da fiscalização)"]
["2. O valor estimado para as passagens aéreas foi calculado conforme \"MEMORIAL DE CÁLCULO - VIAGENS\""]
["3. O valor adotado para a diária é o valor praticado pela Codevasf, conforme \"Tabela de Diárias da Codevasf\", considerando: diária completa; demais localidades; e empregados de nível superior, médio e operacional."]
[]
["4. Os quantitativos foram estimados de acordo com a quantidae de pessoal lotada no campo, e baseadas na quantidade de viagens que a equipe da Codevasf utiliza."]
["5. Os valores previstos são o máximo que serão pagos pela Codevasf durante todo o período do contrato."]

{"sheet":"Materiais_Consumo","index":22,"n_rows":205,"n_cols":25,"rows_kept":205,"cut":false,"hidden":false,"merged":[[197,0,197,4],[197,5,197,6],[191,0,191,6],[192,2,192,4],[196,2,196,4],[196,5,196,6],[195,2,195,4],[195,5,195,6],[194,2,194,4],[194,5,194,6],[192,5,192,6],[193,2,193,4],[193,5,193,6],[206,0,206,6],[200,5,200,6],[201,5,201,6],[202,0,203,4],[202,5,202,6],[203,5,203,6],[205,0,205,6],[201,0,201,4],[204,0,204,6],[69,2,69,6],[9,4,10,4],[9,5,9,6],[9,0,10,0],[11,2,11,6],[181,0,181,5],[183,2,183,6],[186,0,186,5],[189,0,189,5],[0,2,0,6],[1,2,1,6],[2,2,2,6],[4,0,5,6],[7,0,7,6],[122,0,122,5],[124,2,124,6],[9,1,10,1],[9,2,10,2],[9,3,10,3],[13,2,13,6],[67,0,67,5]]}
[null,null,"Ministério do Desenvolvimento Regional  - MDR"]
[null,null,"Companhia de Desenvolvimento dos Vales do São Francisco e do Parnaíba"]
[null,null,"Gerência de Operação do PISF - Centro de Controle e Operação (AD / GOI / CCO)"]
[]
[{"$f":"Frentes_Moveis!A5","v":"TERMO DE REFERÊNCIA PARA CONTRATAÇÃO DOS RECURSOS NECESSÁRIOS À OPERAÇÃO E MANUTENÇÃO DAS INFRAESTRUTURAS DO EIXO LESTE DO PISF - PROJETO DE INTEGRAÇÃO DO SÃO FRANCISCO COM AS BACIAS HIDROGRÁFICAS DO NORDESTE SETENTRIONAL"}]
[]
[]
["MATERIAL DE CONSUMO - ALMOXARIFADOS"]
[]
["ITEM","CÓDIGO","DESCRIÇÃO","UNIDADE","QUANTIDADE","VALOR (R$)"]
[{"$nulls":5},"UNITARIO","TOTAL"]
[null,null,{"$f":"A8","v":"MATERIAL DE CONSUMO - ALMOXARIFADOS"}]
[]
["1.",null,"MATERIAL DE CONSUMO - MECÂNICA"]
["1.1","04791 - SINAPI","Adesivo Acrílico / Cola de contato","un",480,null,"","at"]
["1.2","05318 - SINAPI","Água Raz - galão  5 l","un",112,null,"","at"]
["1.3","\t000312/SBC","Alcool Comum 90º GL","l",1200,null,""]
["1.4",null,"Antiferrugem aerosol WD-40 - tubo de 300 ml","un",289,null,""]
["1.5","Banco de preços (NºPregão:142022 / UASG:926687 - Serviço Autonomo de Agua e Esgoto de Volta Redonda SAAE VR RJ, Pregão Eletrônico, 04/2022)","Antiespumante – antiespumante a base de silicone","l",223,null,""]
["1.6","43132 - SINAPI","Arame recozido n.º 18","kg",2400,null,"","at"]
["1.7","00122 - SINAPI","Cola de PVC com 850 g","un",144,null,"","at"]
["1.8","Banco de preços (DEPART.DE OBRAS E SERV.PUBLICOS\nPrefeitura Municipal de Ubiretama/RS, Dispensa por Limite - 01/2022)","Cola Ultra Gray 70g","un",144,null,""]
["1.9","Banco de preços (PREFEITURA MUNICIPAL DE QUEIROZ, PREGÃO PRESENCIAL - 80/2021)","Cola para junta de motores com 73g","un",1200,null,""]
["1.10","Banco de preços (FUNDO MUNICIPAL DE ASSISTÊNCIA SOCIAL\nPrefeitura Municipal de Hulha Negra/RS, Dispensa por Limite - 05/2022)","Convertedor de ferrugem 500 ml","un",445,null,""]
["1.11","038200 - SINAPI","Corda de bombeiro 12mm em nylon trançado (rolo de 100,00m)","m",3200,null,"","at"]
["1.12","004221 - SINAPI","Diesel comum (l)","l",480,null,"","at"]
["1.13","044533 - SINAPI","Disco corte abrasivo 7\" x 1/8\" x 7/8\"","un",434,null,""]
["1.14","044531 - SINAPI","Disco de corte diamantado - 7\", para esmerilhadeira, segmentado, para concreto","un",108,null,""]
["1.15","044495 - SINAPI","Disco de corte para estrutura metálica 300 x 3,2 x 19,05 mm","un",434,null,""]
["1.16","044533 - SINAPI","Disco de desbaste para estrutura metálica de 9\" x 1/4\" x 7/8\" ( 225 x 6,25 x 21,87 mm)","un",434,null,""]
["1.17","010997 - SINAPI","Eletrodos Revestido AWS-E7018, DN 4 mm","kg",320,null,"","at"]
["1.18",null,"SOLDA-ELETRODO OK 4600 AWS 6013 6,0mm 1/4\"","kg",320,null,""]
["1.19","000012 - SINAPI","Escova de aço para remoção da graxa envelhecida dos cabos de aço","un",160,null,"","at"]
["1.20","000013 - SINAPI","Estopa - embalagem 20 kg","kg",294,null,"","at"]
["1.21","000404 - SINAPI","Fita auto fusão 19 mm x 10 m","un",194,null,"","at"]
["1.22","012815 - SINAPI","Fita crepe adesiva 25mm x 50mm ","un",194,null,"","at"]
["1.23","020111 - SINAPI","Fita isolante 19 mm x 20 m","un",194,null,"","at"]
["1.24",null,"Graxa a base de lítio NGLI 2","kg",478,null,""]
["1.25",null,"Graxa a base de lítio NGLI 3","kg",478,null,""]
["1.26",null,"Graxa com dissulfeto de molibidênio (MoS2) - Lata 500 g","un",478,null,""]
["1.27",null,"Graxa GMA - 2","kg",478,null,"","ok"]
["1.28",null,"Graxa de Alta Resistência a Carga, Pressão LGEP 2/1. Aplicação: Engrenagens de roda e engrenagens expostas","kg",478,null,""]
["1.29",null,"Hidróxido de Cálcio P.A. 500 g","kg",600,null,""]
["1.30",null,"Hipoclorito de Sódio 12% 5000 ml","kg",1200,null,""]
["1.31","8216 - ORSE","Lâmina de serra para metal  Starret ou similar","un",667,null,"","at"]
["1.32",null,"Lençol de borracha manta 3/16” 4,8mm","m²",400,null,""]
["1.33",null,"Líquido penetrante visível lavável à água (Ensaios de Líquido Penetrante)","un",98,null,""]
["1.34","003767 - SINAPI","Lixa nº120","un",2400,null,"","at"]
["1.35",null,"Lona de borracha com alma 1,0 – 4,8 mm esp.","m",45,null,""]
["1.36","003777 - SINAPI/PE","Lona plástica - 4 x 100 m - 12 kg","m²",3200,null,"","at"]
["1.37","037459 - SINAPI","Mangueira Cristal, Lisa PVC transparente, 3/4\" x 2 mm","m",1600,null,"","at"]
["1.38",null,"Mangueira FLG-62/1 0 - 150 PSI 1/4\" NPT","m",800,null,""]
["1.39","7696 - ORSE","Massa calafetar cinza-Durepox ou similiar","kg",334,null,"","at"]
["1.40",null,"Óleo - Translação pórtico e ponte e direção do carro - 20 l -  Óleo EP 220","l",334,null,""]
["1.41",null,"Óleo Hidràulico para os componentes não protegido dos Servomotor Hidráulico - Óleo EP 320","l",334,null,""]
["1.42",null,"Óleo Lubrificante Redutor - Óleo SAE 90","l",334,null,""]
["1.43",null,"Óleo lubrificante, para engrenagem., EP-5, viscosidade (CSt) ( - 40ºC) = 22 - tambor 20 l","l",334,null,""]
["1.44",null,"PAC – Policloreto de alumínio (5 l)","l",967,null,""]
["1.45",null,"Papelão grafitado 1,50 m x 1,60 m Esp 2.4","un",30,null,"","ok"]
["1.46",null,"Pasta de Limpeza Uso Geral Limptek 500 gramas","kg",400,null,""]
["1.47",null,"Querosene para limpeza ","l",240,null,""]
["1.48",null,"Revelador não aquoso D70 (Ensaios de Líquido Penetrante)","un",98,null,""]
["1.49",null,"Sílica Gel Branca - Pacote De 1kg - Grânulos De 4-8 Mm","kg",98,null,""]
["1.50","039961 - SINAPI","Silicone (acético branca) - Tubo de 280g","un",480,null,"","at"]
["1.51",null,"Trava Parafusos de Alta Resistência 120 com 10g","un",192,null,""]
["1.52","Banco de preços (FUNDO MUNICIPAL DE CULTURA\nSECRETARIA DE CULTURA E TURISMO\nPrefeitura Municipal de Leme/SP, Dispensa por Limite - 04/2022)","Vaselina sólida anti-inflamável 500g","kg",120,null,""]
[]
["TOTAL - MATERIAL DE CONSUMO - MECÂNICA - (R$):",{"$nulls":5},0]
[]
["2.",null,"MATERIAL DE CONSUMO - ELÉTRICA"]
["2.1","00181 - ORSE","Anilha Identificação - 0,5 a 6mm² (pacote com 100 unidades)","un",10,null,"","at"]
["2.2","00181 - ORSE","Anilha Identificação - 10 a 16mm² (pacote com 100 unidades)","un",10,null,"","at"]
["2.3","03875 - ORSE","Anilha Identificação - 25 a 70mm² (pacote com 100 unidades)","un",10,null,"","at"]
["2.4","03875 - ORSE","Anilha Identificação - 95 a 120mm² (pacote com 100 unidades)","un",10,null,"","at"]
["2.5","03531 - ORSE","Ar comprimido seco  Aerossol 300ml","un",100,null,"","at"]
["2.6","00993 - SINAPI","Cabo cobre flexível classe 4 ou 5 isolação PVC/A M 1,68 e cobertura PVC-ST1 antichama BWF-B 0,6/1 kV 1,5mm²","m",500,null,"","at"]
["2.7","01022 - SINAPI","Cabo cobre flexível classe 4 ou 5 isolação PVC/A M 1,68 e cobertura PVC-ST1 antichama BWF-B 0,6/1 kV 2,5mm²","m",1000,null,"","at"]
["2.8","01003 - SINAPI","Cabo cobre flexível classe 4 ou 5 isolação PVC/A M 1,68 e cobertura PVC-ST1 antichama BWF-B 0,6/1 kV 4mm²","m",1000,null,"","at"]
["2.9","00994 - SINAPI","Cabo cobre flexível classe 4 ou 5 isolação PVC/A M 1,68 e cobertura PVC-ST1 antichama BWF-B 0,6/1 kV 6mm²","m",1000,null,"","at"]
["2.10","01020 - SINAPI","Cabo cobre flexível classe 4 ou 5 isolação PVC/A M 1,68 e cobertura PVC-ST1 antichama BWF-B 0,6/1 kV 10mm²","m",500,null,"","at"]
["2.11","00995 - SINAPI","Cabo cobre flexível classe 4 ou 5 isolação PVC/A M 1,68 e cobertura PVC-ST1 antichama BWF-B 0,6/1 kV 16mm²","m",500,null,"","at"]
["2.12","00996 - SINAPI","Cabo cobre flexível classe 4 ou 5 isolação PVC/A M 1,68 e cobertura PVC-ST1 antichama BWF-B 0,6/1 kV 25mm²","m",500,null,"","at"]
["2.13","01019 - SINAPI","Cabo cobre flexível classe 4 ou 5 isolação PVC/A M 1,68 e cobertura PVC-ST1 antichama BWF-B 0,6/1 kV 35mm²","m",500,null,"","at"]
["2.14","01018 - SINAPI","Cabo cobre flexível classe 4 ou 5 isolação PVC/A M 1,68 e cobertura PVC-ST1 antichama BWF-B 0,6/1 kV 50mm²","m",500,null,"","at"]
["2.15","00977 - SINAPI","Cabo cobre flexível classe 4 ou 5 isolação PVC/A M 1,68 e cobertura PVC-ST1 antichama BWF-B 0,6/1 kV 70mm²","m",500,null,"","at"]
["2.16","00998 - SINAPI","Cabo cobre flexível classe 4 ou 5 isolação PVC/A M 1,68 e cobertura PVC-ST1 antichama BWF-B 0,6/1 kV 95mm²","m",200,null,"","at"]
["2.17","01017 - SINAPI","Cabo cobre flexível classe 4 ou 5 isolação PVC/A M 1,68 e cobertura PVC-ST1 antichama BWF-B 0,6/1 kV 120mm²","m",200,null,"","at"]
["2.18","00863 - SINAPI","Cabo de cobre nu, eletrolítico, têmpera meio duro, #35mm² (m)","m",200,null,"","at"]
["2.19","00867 - SINAPI","Cabo de cobre nu, eletrolítico, têmpera meio duro, #50mm² (m)","m",200,null,"","at"]
["2.20","00864 - SINAPI","Cabo de cobre nu, eletrolítico, têmpera meio duro, #70mm² (m)","m",200,null,"","at"]
["2.21","09720 - ORSE","Conector para haste aterramento #35mm² GTDU","un",25,null,"","at"]
["2.22","09720 - ORSE","Conector para haste aterramento #50mm² GTDU","un",20,null,"","at"]
["2.23","09720 - ORSE","Conector para haste aterramento #70mm² GTDU","un",20,null,"","at"]
["2.24","11602 - ORSE","Filtro de ventiladores de painéis","un",180,null,"","at"]
["2.25",null,"Filtro dos motores do eixo leste EBV6 (fabricante Aeroglass (670x280x25mm)","un",48,null,"","ok"]
["2.26",null,"Filtro dos motores do eixo leste EBV5 (fabricante Aeroglass (750x225x25mm)","un",48,null,"","ok"]
["2.27",null,"Filtro dos motores do eixo leste EBV1, 2, 3 e 4 (fabricante Aeroglass-modelo FMT_C2015 inox - 345x925x25mm)","un",64,null,"","ok"]
["2.28","02643 - ORSE","Fita isolante de borracha autofusão impermeável à prova dágua , até 69 kV (alta tensão)- 19mm x 10m","un",200,null,"","at"]
["2.29","020111 - SINAPI","Fita isolante adesiva antichama 19mm x 20m","un",280,null,"","at"]
["2.30","01118 - ORSE","Interruptor simples com 01 tecla","un",4,null,"","at"]
["2.31","01119 - ORSE","Interruptor simples com 02 teclas","un",4,null,"","at"]
["2.32","38070 - SINAPI","Interruptor tipo three-way (paralelos) com 02 teclas","un",4,null,"","at"]
["2.33",null,"Limpador de contatos elétricos 300ml","un",84,null,""]
["2.34",null,"Pano para limpeza (Rolo Tipo Perfex 20 cm x 300 metros)","un",50,null,""]
["2.35","11443 - ORSE","Pincel - kit 03 pincéis 1/2\" 1\" 1.1/2\"","un",76,null,"","at"]
["2.36","Banco de preços (NºPregão:202022 / UASG:926430 - GOVERNO DO ESTADO DO AMAZONAS\nDEFENSORIA PUBLICA DO ESTADO DO AMAZONAS, Pregão Eletrônico - 05/2022)","Sabão líquido neutro (5 l)","un",54,null,""]
["2.37","02922 - ORSE","Solvente/Desengraxante de alta rigidez dielétrica  1l","un",36,null,"","at"]
["2.38","12377 - ORSE*","Terminal isolado tipo agulha para condutores de 0,5 a 1,5mm² (pct c/ 100)","un",100,null,"","at"]
["2.39","12377 - ORSE*","Terminal isolado tipo agulha para condutores de 1,5 a 2,5 mm² (pct c/ 100)","un",100,null,"","at"]
["2.40","07948 - ORSE*","Terminal isolado tipo agulha para condutores de 4 a 6 mm² (pct c/ 100)","un",100,null,""]
["2.41","04669 - ORSE","Terminal de compressão – 10mm²","un",200,null,"","at"]
["2.42","04670 - ORSE","Terminal de compressão – 16mm²","un",200,null,"","at"]
["2.43","02676 - ORSE","Terminal de compressão – 25mm²","un",100,null,"","at"]
["2.44","02677 - ORSE","Terminal de compressão – 35mm²","un",100,null,"","at"]
["2.45","03559 - ORSE","Terminal de compressão – 50mm²","un",100,null,"","at"]
["2.46","06911 - ORSE","Terminal de compressão – 70mm²","un",100,null,"","at"]
["2.47","03153 - ORSE","Terminal de compressão – 95mm²","un",50,null,"","at"]
["2.48","04673 - ORSE","Terminal de compressão – 120mm²","un",50,null,"","at"]
["2.49","01587 - SINAPI","Terminal de pressão – 35mm²","un",50,null,"","at"]
["2.50","01588 - SINAPI","Terminal de pressão – 50mm²","un",40,null,"","at"]
["2.51","01589 - SINAPI","Terminal de pressão – 70mm²","un",40,null,"","at"]
[]
["TOTAL - MATERIAL DE CONSUMO - ELÉTRICA - (R$):",{"$nulls":5},0]
[]
["3.",null,"MATERIAL DE CONSUMO - CIVIL"]
["3.1","00034 - SINAPI","Aço D=10 mm CA 50","kg",1556,null,"","at"]
["3.2","00043055 - SINAPI","Aço D=12 mm CA 50","kg",1556,null,"","at"]
["3.3","00043059  - SINAPI","Aço D=5.0 mm CA 60","kg",1556,null,"","at"]
["3.4","00032 - SINAPI","Aço D=6.3 mm CA 50","kg",1556,null,"","at"]
["3.5","00033 - SINAPI","Aço D=8.0 mm CA 50","kg",1556,null,"","at"]
["3.6","00340 - SINAPI","Arame farpado nº. 16 galvanizado Simples","m",2223,null,"","at"]
["3.7","43131 - SINAPI","Arame galvanizado 8BWG, d=4,19mm","kg",240,null,"","at"]
["3.8","43132 - SINAPI","Arame recozido n.º 18","kg",134,null,"","at"]
["3.9","00367 - SINAPI","Areia grossa comercial, posto em obra","m³",491.7405040000001,null,"","at"]
["3.10","00000134 - SINAPI","Argamassa para grauteamento ","kg",1112,null,"","at"]
["3.11","004729 - SINAPI","Pedra britada comercial (n.º 0 a 5)","m³",574.26389800000004,null,"","at"]
["3.12","04513 - SINAPI","Caibro de 5x5cm ","m",1334,null,"","at"]
["3.13","001106 - SINAPI","Cal hidratada","kg",92897,null,"","at"]
["3.14","001379 - SINAPI","Cimento CPII-32","kg",226100,null,"","at"]
["3.15","001358 - SINAPI","Compensado resinado 17mm","m²",96,null,"","at"]
["3.16","002692 - SINAPI","Desmoldante","l",86,null,"","at"]
["3.17","020111 - SINAPI","Fita isolante adesiva antichama 19mm x 20m","un",16,null,"","at"]
["3.18"," M2018 - SICRO3/PE","Gastalho 10x2,5cm","m",1334,null,""]
["3.19","005076 - SINAPI","Grampo para cerca galvanizado 1 x 9","kg",96,null,"","at"]
["3.20","003681 - SINAPI","Junta de dilatação (O-22 ou similar)","m",268,null,"","at"]
["3.21","014077 - SINAPI","Junta de dilatação - Perfil elastomerico pre-formado em epmd, para junta de dilatacao de pisos com pouca solicitacao, 15 mm de largura, movimentacao de 11 a 19 mm","m",268,null,"","at"]
["3.22","38780 - SINAPI/PE","Lâmpada fluorescente compacta, branca 20 W, base E27 (127/220 V)","un",134,null,"","at"]
["3.23","038780 - SINAPI","Lâmpada fluorecente de 20W","un",134,null,"","at"]
["3.24","003751 - SINAPI","Lâmpada vapor mercúrio 400 W (base E40)","un",16,null,"","at"]
["3.25","003767 - SINAPI","Lixa nº120","un",40,null,"","at"]
["3.26","003777 - SINAPI","Lona plástica - 4 x 100m - 12kg","m²",2400,null,"","at"]
["3.27","025865 - SINAPI","Manta termoplástica PEAD, geomembrana lisa, e=2 mm","m²",12062.8,null,"","at"]
["3.28","004047 - SINAPI","Massa corrida - latão 18 l","un",23,null,"","at"]
["3.29","2866 - ORSE","Mastique elástico base silicone","l",1967.5750691999999,null,"",{"$nulls":17},{"$f":"F154*(1+'ORCAMENTO_CONSOLIDADO (2)'!P797)","v":0}]
["3.30","00036799  - SINAPI","Mourão de concreto reto para cercas","un",112,null,"","at"]
["3.31",null,"Perfil para fixação das geomembrana Barra de 6m ","m",134,null,""]
["3.32","11442 - ORSE","Pincel 1\"","un",89,null,"","at"]
["3.33","005075 - SINAPI","Prego 18x30","kg",214,null,"","at"]
["3.34","038390 - SINAPI","Rolo de lã de carneiro - 20cm ","un",89,null,"","at"]
["3.35","038393 - SINAPI","Rolo de espuma poliéster 23 cm com cabo","un",89,null,"","at"]
["3.36","012296 - SINAPI","Soquete de porcelana base E27, para uso ao tempo, para lâmpadas","un",16,null,"","at"]
["3.37","00006194 - SINAPI","Tábua de madeira não aparelhada *2,5 X 15 CM (1 X 6 \") pinus, mista ou equivalente da região","m",223,null,"","at"]
["3.38","005318 - SINAPI*","Thinner/águarras - 5 l","un",9,null,"","at"]
["3.39","07258 - SINAPI","Tijolo comum (5,5x10x20) cm","un",10667,null,"","at"]
["3.40","00154 - SINAPI","Tinta Alcatrão de Hulha -  galão de 3,6 litros","l",9,null,"","at"]
["3.41","02232/ORSE","Tinta Latex  PVA","l",221,null,"","at"]
["3.42","38386 - SINAPI","Trincha de 2 \"","un",89,null,"","at"]
["3.43","38400 - SINAPI","Vassourão 40cm com cabo","un",110,null,"","at"]
["3.44","12001 - SINAPI","CAIXA OCTOGONAL DE FUNDO MOVEL, EM PVC, DE 4\" X 4\", PARA ELETRODUTO FLEXIVEL CORRUGADO","un",12,null,"","at"]
["3.45","1872 - SINAPI","CAIXA DE PASSAGEM, EM PVC, DE 4\" X 2\", PARA ELETRODUTO FLEXIVEL CORRUGADO","un",96,null,"","at"]
["3.46","2688 - SINAPI","ELETRODUTO PVC FLEXIVEL CORRUGADO, COR AMARELA, DE 25 MM","m",500,null,"","at"]
["3.47","7528 - SINAPI","TOMADA 2P+T 10A, 250V, CONJUNTO MONTADO PARA EMBUTIR 4\" X 2\" (PLACA + SUPORTE + MODULO)","un",96,null,"","at"]
["3.48","38062 - SINAPI","INTERRUPTOR SIMPLES 10A, 250V, CONJUNTO MONTADO PARA EMBUTIR 4\" X 2\" (PLACA + SUPORTE + MODULO)","un",12,null,"","at"]
["3.49","0000345 - SINAPI","ARAME GALVANIZADO 18 BWG, D = 1,24MM (0,009 KG/M)","Kg",6.2400000000000011,null,"","at"]
["3.50","00003315 - SINAPI","GESSO EM PO PARA REVESTIMENTOS/MOLDURAS/SANCAS E USO GERAL","kg",248.70144000000002,null,"","at"]
["3.51","00004812 - SINAPI","PLACA DE GESSO PARA FORRO, *60 X 60* CM, ESPESSURA DE 12 MM (SEM COLOCACAO)","m²",249.60000000000002,null,"","at"]
["3.52","00020250 - SINAPI","SISAL EM FIBRA","Kg",1.9468800000000002,null,"","at"]
["3.53","00040547 - SINAPI","PARAFUSO ZINCADO, AUTOBROCANTE, FLANGEADO, 4,2 MM X 19 MM","Cento",7.6876800000000012,null,"","at"]
["3.54","39484 - SINAPI","KIT PORTA PRONTA DE MADEIRA, FOLHA LEVE (NBR 15930) DE 800 X 2100 MM, DE 35 MM A 40 MM DE ESPESSURA, COM MARCO EM ACO, NUCLEO COLMEIA, CAPA LISA EM HDF, ACABAMENTO MELAMINICO BRANCO (INCLUI MARCO, ALIZARES, DOBRADICAS E FECHADURA)","un",12,null,"","at"]
["3.55","031443 - IOPES","JANELA DE CORRER EM ALUMINIO, 100 X 150 CM (A X L), 4 FLS, SEM BANDEIRA, ACABAMENTO ACET OU BRILHANTE, COM VIDRO, COM GUARNICAO PARA 1 FACE","m²",7.1999999999999993,null,""]
[]
["TOTAL - MATERIAL DE CONSUMO - CIVIL - (R$):",{"$nulls":5},0]
[]
["4.",null,"MANUTENÇÃO DE CANTEIRO - ESCRITÓRIO",{"$nulls":6},12,{"$f":"'ORCAMENTO_CONSOLIDADO (2)'!$K$1","v":6}]
["4.1",null,"Taxa de manutenção de canteiros, incluindo despesas com material de expediente, material de limpeza, água, energia, comunicação, entre outras","un x mês",6,"","",null,12,{"$f":"I185/J184","v":1},{"$f":"J185*K184","v":6}]
[]
["TOTAL - MANUTENÇÃO DE CANTEIRO - ESCRITÓRIO - (R$):",{"$nulls":5},0]
[]
[]
["TOTAL - MATERIAL DE CONSUMO - ALMOXARIFADOS - (R$):",{"$nulls":5},0]
[]
["RESUMO - MATERIAL DE CONSUMO - ALMOXARIFADOS"]
["ITEM",null,"DESCRIÇÃO",null,null,"VALOR TOTAL (R$)"]
[1,null,"MATERIAL DE CONSUMO - MECÂNICA",null,null,0]
[2,null,"MATERIAL DE CONSUMO - ELÉTRICA",null,null,0]
[3,null,"MATERIAL DE CONSUMO - CIVIL",null,null,0]
[4,null,"MANUTENÇÃO DE CANTEIRO - ESCRITÓRIO",null,null,0]
["TOTAL GERAL - RESUMO - MATERIAL DE CONSUMO - ALMOXARIFADOS -  (R$):",{"$nulls":4},0,null,{"$f":"Mat_Cons/4479175.63","v":0}]
[]
[]
["NOME DO INFORMANTE:",{"$nulls":4},"QUALIFICAÇÃO:"]
[]
["ASSINATURA:",{"$nulls":4},"DATA:"]
[]
["OBSERVAÇÃO:"]

{"sheet":"Veiculos","index":23,"n_rows":34,"n_cols":9,"rows_kept":34,"cut":false,"hidden":false,"merged":[[0,2,0,6],[1,2,1,6],[2,2,2,6],[4,0,5,6],[7,0,7,6],[34,0,34,6],[17,0,17,5],[20,0,20,6],[21,2,21,4],[21,5,21,6],[22,2,22,4],[30,0,30,6],[31,0,31,6],[22,5,22,6],[23,0,23,4],[23,5,23,6],[28,0,28,4],[29,0,29,4],[26,5,26,6],[27,5,27,6],[28,5,28,6],[11,2,11,6],[26,0,26,4],[27,0,27,4],[33,0,33,6],[9,1,10,1],[32,0,32,6],[9,0,10,0],[9,2,10,2],[9,3,10,3],[9,4,10,4],[9,5,9,6],[29,5,29,6]]}
[null,null,"Ministério do Desenvolvimento Regional  - MDR"]
[null,null,"Companhia de Desenvolvimento dos Vales do São Francisco e do Parnaíba"]
[null,null,"Gerência de Operação do PISF - Centro de Controle e Operação (AD / GOI / CCO)"]
[]
[{"$f":"Materiais_Consumo!A5","v":"TERMO DE REFERÊNCIA PARA CONTRATAÇÃO DOS RECURSOS NECESSÁRIOS À OPERAÇÃO E MANUTENÇÃO DAS INFRAESTRUTURAS DO EIXO LESTE DO PISF - PROJETO DE INTEGRAÇÃO DO SÃO FRANCISCO COM AS BACIAS HIDROGRÁFICAS DO NORDESTE SETENTRIONAL"}]
[]
[]
["VEÍCULOS AUTOMOTORES"]
[]
["ITEM","CÓDIGO","DESCRIÇÃO","UNIDADE","QUANTIDADE","VALOR (R$)"]
[{"$nulls":5},"UNITARIO","TOTAL"]
["1.",null,"VEÍCULOS AUTOMOTORES"]
["1.1","B3","TIPO HATCH 1.6 FLEX (110 CV)","un x mês",90,"",null,{"$f":"E13/6","v":15},"at"]
["1.2","B4","TIPO SEDAN 1.6 FLEX (115CV)","un x mês",6,"",null,{"$f":"E14/6","v":1},"at"]
["1.3","B11","Veículo Tipo Pick Up Cabine Dupla 4 x 4 (163 CV)","un x mês",114,"",null,19,"at"]
["1.4","B8","Veículo - Tipo Ônibus - 45 assentos (218 CV) - COM MOTORISTA","un x mês",18,"",null,3,"at"]
["1.5","B1","NXR BROS 160","un x mês",18,"",null,3,"at"]
["TOTAL - VEÍCULOS AUTOMOTORES - (R$):"]
[]
[]
["RESUMO - VEÍCULOS AUTOMOTORES"]
["ITEM",null,"DESCRIÇÃO",null,null,"VALOR TOTAL (R$)"]
[1,null,"VEÍCULOS AUTOMOTORES"]
["TOTAL GERAL - RESUMO - VEÍCULOS AUTOMOTORES - (R$):"]
[]
[]
["NOME DO INFORMANTE:",{"$nulls":4},"QUALIFICAÇÃO:"]
[]
["ASSINATURA:",{"$nulls":4},"DATA:"]
[]
["OBSERVAÇÃO:"]
[]
[{"$f":"Mem_Calculo_VEICULOS!A113","v":"1. Despesas incluem manutenção, combustível, óleos, lubrificantes, pneus, etc."}]
[{"$f":"Mem_Calculo_VEICULOS!A114","v":"2. Quilometragem adotada: 3.000 km/mês"}]

{"sheet":"Mem_Calculo_VEICULOS","index":24,"n_rows":114,"n_cols":27,"rows_kept":114,"cut":false,"hidden":false,"merged":[[33,2,33,5],[43,2,43,5],[48,2,48,5],[53,2,53,5],[58,2,58,5],[56,0,56,3],[76,2,76,5],[38,2,38,5],[7,0,7,5],[4,0,5,5],[0,2,0,5],[1,2,1,5],[2,2,2,5],[61,0,61,3],[67,0,67,3],[74,0,74,3],[28,0,28,5],[12,2,12,5],[15,2,15,5],[19,2,19,5],[31,1,32,1],[23,2,23,5],[107,4,107,5],[108,0,108,3],[10,1,11,1],[108,4,108,5],[31,0,32,0],[10,0,11,0],[10,2,11,2],[10,3,10,4],[10,5,11,5],[31,4,31,5],[31,3,32,3],[31,2,32,2],[84,0,84,3],[90,0,90,3],[63,2,63,5],[69,2,69,5],[79,0,79,3],[81,2,81,5],[113,0,113,5],[114,0,114,5],[36,0,36,3],[41,0,41,3],[46,0,46,3],[51,0,51,3],[109,0,109,3],[109,4,109,5],[110,0,110,5],[111,0,111,5],[112,0,112,5],[106,0,106,3],[106,4,106,5],[107,0,107,3],[100,2,100,5],[103,0,103,3],[92,2,92,5],[87,2,87,5],[98,0,98,3]]}
[null,null,"Ministério do Desenvolvimento Regional  - MDR"]
[null,null,"Companhia de Desenvolvimento dos Vales do São Francisco e do Parnaíba"]
[null,null,"Gerência de Operação do PISF - Centro de Controle e Operação (AD / GOI / CCO)"]
[]
[{"$f":"Veiculos!A5","v":"TERMO DE REFERÊNCIA PARA CONTRATAÇÃO DOS RECURSOS NECESSÁRIOS À OPERAÇÃO E MANUTENÇÃO DAS INFRAESTRUTURAS DO EIXO LESTE DO PISF - PROJETO DE INTEGRAÇÃO DO SÃO FRANCISCO COM AS BACIAS HIDROGRÁFICAS DO NORDESTE SETENTRIONAL"}]
[]
[]
["TABELA DE VEÍCULOS "]
[]
[]
["ITEM","CÓDIGO","DESCRIÇÃO","CUSTO MENSAL (R$)",null,"OBSERVAÇÕES"]
[null,null,null,"S/ MOTORISTA","C/ MOTORISTA"]
["1.",null,"VEÍCULOS LEVES"]
["1.1","B1","NXR BROS 160","",null,null,"at"]
[]
["2.",null,"VEÍCULOS LEVES"]
["2.1","B3","TIPO HATCH 1.6 FLEX (110 CV)","",null,null,"at"]
["2.2","B4","TIPO SEDAN 1.6 FLEX (115CV)","",null,null,"at"]
[]
["3.",null,"VEÍCULOS LEVES"]
["3.2","B6","TIPO UTILITÁRIO (VAN 16 LUG) (129 CV)",null,"",null,"at"]
["3.4","B8","TIPO ÔNIBUS (45 LUG) (218 CV)",null,"",null,"at"]
[]
["4.",null,"VEÍCULOS LEVES"]
["4.3","B11","Veículo Tipo Pick Up Cabine Dupla 4 x 4 (163 CV)","",null,null,"at"]
[]
[]
[]
["MEMORIAL DE CÁLCULO - VEÍCULOS (Quantidade / Local)"]
[]
[]
["ITEM","CLASSE","DESCRIÇÃO","PRAZO\n(mês)","QUANTIDADE"]
[{"$nulls":4},"UNITÁRIA\n(mês)","TOTAL\n(un x mês)"]
["1.",null,"COORDENAÇÃO GERAL",{"$nulls":22},12,{"$f":"'ORCAMENTO_CONSOLIDADO (2)'!$K$1","v":6}]
["1.1",null,"Veículo Tipo Pick Up Cabine Dupla 4 x 4 (163 CV)",6,1,6,{"$nulls":18},12,{"$f":"Y35/$Z$34","v":1},{"$f":"Z35*$AA$34","v":6}]
[]
["TOTAL DE VEÍCULOS - COORDENAÇÃO GERAL:",null,null,null,1,6]
[]
["2.",null,"COORDENAÇÃO DA OPERAÇÃO"]
["2.1",null,"Veículo Tipo Pick Up Cabine Dupla 4 x 4 (163 CV)",6,1,6,{"$nulls":18},12,{"$f":"Y40/$Z$34","v":1},{"$f":"Z40*$AA$34","v":6}]
[]
["TOTAL DE VEÍCULOS - COORDENAÇÃO DA OPERAÇÃO:",null,null,null,1,6]
[]
["3.",null,"COORDENAÇÃO DA MANUTENÇÃO"]
["3.1",null,"Veículo Tipo Pick Up Cabine Dupla 4 x 4 (163 CV)",6,1,6,{"$nulls":18},12,1,6]
[]
["TOTAL DE VEÍCULOS - COORDENAÇÃO DA MANUTENÇÃO:",null,null,null,1,6]
[]
["4.",null,"COORDENAÇÃO ADMINISTRAÇÃO E LOGÍSTICA"]
["4.1",null,"TIPO HATCH 1.6 FLEX (110 CV)",6,1,6,null,4,2,{"$nulls":15},12,1,6]
[]
["TOTAL DE VEÍCULOS - COORDENAÇÃO ADMINISTRAÇÃO E LOGÍSTICA:",null,null,null,1,6]
[]
["5.",null,"SEGURANÇA E MEDICINA DO TRABALHO"]
["5.1",null,"TIPO HATCH 1.6 FLEX (110 CV)",6,1,6,null,3,2,{"$nulls":15},12,1,6]
[]
["TOTAL DE VEÍCULOS - SEGURANÇA E MEDICINA DO TRABALHO:",null,null,null,1,6]
[]
["6.",null,"PLANEJAMENTO E CONTROLE DA OPERAÇÃO"]
["6.1",null,"Veículo Tipo Pick Up Cabine Dupla 4 x 4 (163 CV)",6,1,6,null,2,1,{"$nulls":15},12,1,6]
[]
["TOTAL DE VEÍCULOS - PLANEJAMENTO E CONTROLE DA OPERAÇÃO:",null,null,null,1,6]
[]
["7.",null,"PLANEJAMENTO E CONTROLE DA MANUTENÇÃO"]
["7.1",null,"Veículo Tipo Pick Up Cabine Dupla 4 x 4 (163 CV)",6,3,18,null,7,2,{"$nulls":15},12,1,6]
["7.2",null,"TIPO HATCH 1.6 FLEX (110 CV)",6,1,6,null,5,1,{"$nulls":15},12,1,6]
[]
["TOTAL DE VEÍCULOS - PLANEJAMENTO E CONTROLE DA MANUTENÇÃO:",null,null,null,4,24]
[]
["8.",null,"OPERAÇÃO"]
["8.1",null,"NXR BROS 160",6,3,18,null,3,{"$nulls":16},12,1,6]
["8.2",null,"Veículo Tipo Pick Up Cabine Dupla 4 x 4 (163 CV)",6,2,12,null,3,1,{"$nulls":15},12,1,6]
["8.3",null,"TIPO HATCH 1.6 FLEX (110 CV)",6,5,30,null,12,7,{"$nulls":15},12,1,6]
[]
["TOTAL DE VEÍCULOS - OPERAÇÃO:",null,null,null,10,60]
[]
["9.",null,"MANUTENÇÃO - MECÂNICA"]
["9.1",null,"TIPO HATCH 1.6 FLEX (110 CV)",6,2,12,null,3,1,{"$nulls":15},12,1,6]
[]
["TOTAL DE VEÍCULOS - MANUTENÇÃO - MECÂNICA:",null,null,null,2,12]
[]
["10.",null,"MANUTENÇÃO - EQUIPAMENTOS E SISTEMAS ELÉTRICOS"]
["10.1",null,"TIPO HATCH 1.6 FLEX (110 CV)",6,2,12,null,3,1,{"$nulls":15},12,1,6]
[]
["TOTAL DE VEÍCULOS - MANUTENÇÃO - EQUIPAMENTOS E SISTEMAS ELÉTRICOS:",null,null,null,2,12]
[]
[]
["11.",null,"MANUTENÇÃO TELECOM / SDSC"]
["11.1",null,"TIPO HATCH 1.6 FLEX (110 CV)",6,1,6,{"$nulls":18},12,1,6]
[]
["TOTAL DE VEÍCULOS - MANUTENÇÃO TELECOM:",null,null,null,1,6]
[]
["12.",null,"MANUTENÇÃO - CIVIL",{"$nulls":6},15,null,"MANUTENÇÃO - CIVIL - SUBESTAÇÃO, LINHA DE TRANSMISSÃO E LINHA DE DISTRIBUIÇÃO"]
["12.1",null,"Veículo Tipo Pick Up Cabine Dupla 4 x 4 (163 CV)",6,2,12,null,2,1,"15.1",null,"Veículo Tipo Pick Up Cabine Dupla 4 x 4 (163 CV)",12,1,12,{"$nulls":9},12,1,6]
["12.2",null,"Veículo - Tipo Ônibus - 45 assentos (218 CV) - COM MOTORISTA",6,3,18,null,4,1,"15.2",null,"Veículo Utilitário - Tipo Van - 16 assentos (129 CV) - COM MOTORISTA",12,1,12,{"$nulls":9},12,1,6]
["12.3",null,"TIPO SEDAN 1.6 FLEX (115CV)",6,1,6,null,1,{"$nulls":16},12,1,6]
["12.4",null,"TIPO HATCH 1.6 FLEX (110 CV)",6,2,12,{"$nulls":18},12,1,6]
[{"$nulls":7},3,1,"TOTAL DE VEÍCULOS - MANUTENÇÃO - CIVIL - SUBESTAÇÃO, LINHA DE TRANSMISSÃO E LINHA DE DISTRIBUIÇÃO:",null,null,null,2,24]
["TOTAL DE VEÍCULOS - MANUTENÇÃO - CIVIL:",null,null,null,8,48]
[]
[13,null,"EQUIPE DE SUPERVISÃO / FISCALIZAÇÃO"]
["13.1",null,"Veículo Tipo Pick Up Cabine Dupla 4 x 4 (163 CV)",6,8,48,{"$nulls":18},12,{"$f":"Y102/$Z$34","v":1},{"$f":"Z102*$AA$34","v":6}]
[{"$nulls":7},6,4]
["TOTAL DE VEÍCULOS - EQUIPE DE SUPERVISÃO:",null,null,null,8,48]
[]
[]
["NOME DO INFORMANTE:",null,null,null,"QUALIFICAÇÃO:"]
[]
["ASSINATURA:",null,null,null,"DATA:"]
[]
["OBSERVAÇÃO:"]
[]
["1. Despesas incluem manutenção, combustível, óleos, lubrificantes, pneus, etc."]
["2. Quilometragem adotada: 3.000 km/mês"]

{"sheet":"CPU_VEÍCULOS","index":25,"n_rows":145,"n_cols":10,"rows_kept":145,"cut":false,"hidden":false,"merged":[[116,0,116,1],[121,0,121,1],[1,0,1,6],[38,0,38,6],[71,0,71,6],[101,0,101,6]]}
[]
["COMPOSIÇÕES MENSAIS DE VEÍCULOS:"]
["CÓD.","DESCRICAO DA COMPOSICAO","UND","COEF.","P. UNIT.","CUSTO T.","% item"]
["AJUST.1","VEÍCULO CAMINHONETE DIESEL POT. MÍNIMA 180CV, CABINE DUPLA, 4x4, CHP e CHI AJUSTADAS S/MOTORISTA","H"]
["SINAPI - 92138","CAMINHONETE COM MOTOR A DIESEL, POTÊNCIA 180 CV, CABINE DUPLA, 4X4 - CHP. AF_11/2015","CHP"]
[" SINAPI - 92139","CAMINHONETE COM MOTOR A DIESEL, POTÊNCIA 180 CV, CABINE DUPLA, 4X4 - CHI. AF_11/2015","CHI"]
[null,"CUSTO MENSAL (referência média 176 horas, sendo 45% CHP e 55% CHI)","MÊS",176]
["CÓD.","DESCRICAO DA COMPOSICAO","UND","COEF.","P. UNIT.","CUSTO T.","% item"]
["AJUST.2","VEÍCULO PICAPE 1.6 FLEX MANUAL POT. MÍN. 101CV SIMILAR P/ VEÍCULOS TIPO SEDAN 4 PORTAS S/MOTORISTA","H"]
[" SINAPI - 92145","CAMINHONETE SIMPLES MOTOR 1.6 FLEX, MANUAL, POT. 101/104 CV, 2 PORTAS - CHP. AF_11/2015","CHP"]
[" SINAPI - 92146","CAMINHONETE SIMPLES MOTOR 1.6 FLEX, MANUAL, POT. 101/104 CV, 2 PORTAS - CHI. AF_11/2015","CHI"]
[null,"CUSTO MENSAL (referência média 176 horas, sendo 35% CHP e 65% CHI)","MÊS",176]
[]
["AJUST.2","VEÍCULO PICAPE 1.6 FLEX MANUAL POT. MÍN. 101CV SIMILAR P/ VEÍCULOS TIPO HATCH 4 PORTAS S/MOTORISTA","H"]
[" SINAPI - 92145","CAMINHONETE SIMPLES MOTOR 1.6 FLEX, MANUAL, POT. 101/104 CV, 2 PORTAS - CHP. AF_11/2015","CHP"]
[" SINAPI - 92146","CAMINHONETE SIMPLES MOTOR 1.6 FLEX, MANUAL, POT. 101/104 CV, 2 PORTAS - CHI. AF_11/2015","CHI"]
[null,"CUSTO MENSAL (referência média 176 horas, sendo 35% CHP e 65% CHI)","MÊS",176]
[]
[]
["SICRO - E9125","Veículo tipo van furgão com capacidade de 1,54 t - 93 kW","UND","COEF.","P. UNIT.","CUSTO T.","% item"]
[null,null,"CHP"]
[null,null,"CHI"]
[null,"PICK-UP DIESEL REPOSIÇÃO DE PNEUS R16 COM BASE NA UTILIZAÇÃO NO O&M PISF (1jg./ano)","H",0,null,0]
[null,null,"MÊS",176,0,0]
[]
["SICRO - E9134","Miniônibus com capacidade para 30 passageiros - 111 kW","UND","COEF.","P. UNIT.","CUSTO T.","% item"]
[null,null,"CHP"]
[null,null,"CHI"]
[null,null,"H","",null,""]
[null,null,"MÊS",176,0,0]
[]
["COTAÇÃO","NXR BROS 160","UND","COEF.","P. UNIT.","CUSTO T.","% item"]
["COTAÇÃO","Locação","MÊS"]
["4222 / SINAPI","Gasolina (Considerando quilometrametragem rodada do CHP-diesel supracitado - 4500 km/mês.Consumo de 30 km/L. ","L"]
[null,"NXR 160 BROS  REPOSIÇÃO DE PNEUS ARO 17 COM BASE NA UTILIZAÇÃO NO O&M PISF (1jg./ano)","MÊS"]
[null,null,"MÊS",1]
[]
[]
["DESCRIÇÃO DAS COMPOSIÇÕES:"]
[]
["CÓD.","DESCRICAO DA COMPOSICAO","UND","COEF.","P. UNIT.","CUSTO T.","% item"]
[null,"VEÍCULO CAMINHONETE DIESEL POTÊNCIA MÍNIMA 180CV, CABINE DUPLA, 4x4, CHP e CHI AJUSTADAS SEM MOTORISTA"]
[92138,"CAMINHONETE COM MOTOR A DIESEL, POTÊNCIA 180 CV, CABINE DUPLA, 4X4 - CHP. AF_11/2015","CHP",{"$nulls":5},67.858754208754206]
["88284","MOTORISTA DE VEIÍCULO LEVE COM ENCARGOS COMPLEMENTARES","H"]
["92133","CAMINHONETE COM MOTOR A DIESEL, POTÊNCIA 180 CV, CABINE DUPLA, 4X4 - DEPRECIAÇÃO. AF_11/2015","H"]
["92134","CAMINHONETE COM MOTOR A DIESEL, POTÊNCIA 180 CV, CABINE DUPLA, 4X4 - JUROS. AF_11/2015","H"]
["92135","CAMINHONETE COM MOTOR A DIESEL, POTÊNCIA 180 CV, CABINE DUPLA, 4X4 - IMPOSTOS E SEGUROS. AF_11/2015","H"]
["92136","CAMINHONETE COM MOTOR A DIESEL, POTÊNCIA 180 CV, CABINE DUPLA, 4X4 - MANUTENÇÃO. AF_11/2015","H"]
["92137","CAMINHONETE COM MOTOR A DIESEL, POTÊNCIA 180 CV, CABINE DUPLA, 4X4 - MATERIAIS NA OPERAÇÃO. AF_11/2015","H"]
["a1.pneus","PICK-UP DIESEL REPOSIÇÃO DE PNEUS R16 COM BASE NA UTILIZAÇÃO NO O&M PISF (1 jogo/ano = 4 pneus)","H"]
["a2.comb.","PICK-UP DIESEL, POT. 180 CV, CD, 4x4 - COMBUSTÍVEL ADICIONAL COM BASE NA UTILIZAÇÃO NO O&M PISF","H"]
["92139","CAMINHONETE COM MOTOR A DIESEL, POTÊNCIA 180 CV, CABINE DUPLA, 4X4 - CHI. AF_11/2015","CHI"]
["88284","MOTORISTA DE VEIÍCULO LEVE COM ENCARGOS COMPLEMENTARES","H"]
["92133","CAMINHONETE COM MOTOR A DIESEL, POTÊNCIA 180 CV, CABINE DUPLA, 4X4 - DEPRECIAÇÃO. AF_11/2015","H"]
["92134","CAMINHONETE COM MOTOR A DIESEL, POTÊNCIA 180 CV, CABINE DUPLA, 4X4 - JUROS. AF_11/2015","H"]
["92135","CAMINHONETE COM MOTOR A DIESEL, POTÊNCIA 180 CV, CABINE DUPLA, 4X4 - IMPOSTOS E SEGUROS. AF_11/2015","H"]
[null,"VEÍCULO PICAPE SIMPLES MOTOR 1.6 FLEX MANUAL POTÊNCIA MÍNIMA 101 CV SIMILAR PARA VEÍCULOS TIPO GOL 4 PORTAS FLEX SEM MOTORISTA"]
["92145","CAMINHONETE SIMPLES MOTOR 1.6 FLEX, MANUAL, POT. 101/104 CV, 2 PORTAS - CHP. AF_11/2015","CHP",{"$nulls":4},55.595627705627706]
["88284","MOTORISTA DE VEIÍCULO LEVE COM ENCARGOS COMPLEMENTARES","H"]
["92140","PICAPE SIMPLES MOTOR 1.6 FLEX, MANUAL, POTÊNCIA 101/104 CV - DEPRECIAÇÃO. AF_11/2015","H"]
["92141","PICAPE SIMPLES MOTOR 1.6 FLEX, MANUAL, POTÊNCIA 101/104 CV - JUROS. AF_11/2015","H"]
["92142","PICAPE SIMPLES MOTOR 1.6 FLEX, MANUAL, POTÊNCIA 101/104 CV - IMPOSTOS E SEGUROS. AF_11/2015","H"]
["92143","PICAPE SIMPLES MOTOR 1.6 FLEX, MANUAL, POTÊNCIA 101/104 CV - MANUTENÇÃO. AF_11/2015","H"]
["92144","PICAPE SIMPLES MOTOR 1.6 FLEX, MANUAL, POTÊNCIA 101/104 CV - MATERIAIS NA OPERAÇÃO. AF_11/2015","H"]
["a3.pneus","VEÍCULO FLEX  REPOSIÇÃO DE PNEUS R14 COM BASE NA UTILIZAÇÃO NO O&M PISF (1 jogo/ano = 4 pneus)","H"]
["a4.comb.","VEÍCULO FLEX COMBUSTÍVEL ADICIONAL COM BASE NA UTILIZAÇÃO NO O&M PISF","H"]
["92146","CAMINHONETE SIMPLES MOTOR 1.6 FLEX, MANUAL, POT. 101/104 CV, 2 PORTAS - CHI. AF_11/2015","CHI"]
["88284","MOTORISTA DE VEIÍCULO LEVE COM ENCARGOS COMPLEMENTARES","H"]
["92140","PICAPE SIMPLES MOTOR 1.6 FLEX, MANUAL, POTÊNCIA 101/104 CV - DEPRECIAÇÃO. AF_11/2015","H"]
["92141","PICAPE SIMPLES MOTOR 1.6 FLEX, MANUAL, POTÊNCIA 101/104 CV - JUROS. AF_11/2015","H"]
["92142","PICAPE SIMPLES MOTOR 1.6 FLEX, MANUAL, POTÊNCIA 101/104 CV - IMPOSTOS E SEGUROS. AF_11/2015","H"]
["SUB-COMPOSIÇÕES"]
["CÓD.","DESCRICAO DA COMPOSICAO","UND","COEF.","P. UNIT.","CUSTO T.","% item"]
["92133","CAMINHONETE MOTOR DIESEL, POTÊNCIA 180 CV, CABINE DUPLA, 4X4 - DEPRECIAÇÃO. AF_11/2015",null,"","",""]
[null,"CAMINHONETE MOTOR DIESEL, POTÊNCIA 180 CV, CABINE DUPLA, 4X4 - DEPRECIAÇÃO. AF_11/2015","H"]
["92134","CAMINHONETE MOTOR DIESEL, POTÊNCIA 180 CV, CABINE DUPLA, 4X4 - JUROS. AF_11/2015"]
[null,"CAMINHONETE MOTOR DIESEL, POTÊNCIA 180 CV, CABINE DUPLA, 4X4 - JUROS. AF_11/2015","H"]
["92135","CAMINHONETE MOTOR DIESEL, POTÊNCIA 180 CV, CABINE DUPLA, 4X4 - IMPOSTOS E SEGUROS. AF_11/2015"]
[null,"CAMINHONETE MOTOR DIESEL, POTÊNCIA 180 CV, CABINE DUPLA, 4X4 - IMPOSTOS E SEGUROS. AF_11/2015","H"]
["92136","CAMINHONETE MOTOR DIESEL, POTÊNCIA 180 CV, CABINE DUPLA, 4X4 - MANUTENÇÃO. AF_11/2015"]
[null,"CAMINHONETE MOTOR DIESEL, POTÊNCIA 180 CV, CABINE DUPLA, 4X4 - MANUTENÇÃO. AF_11/2015","H"]
["92137","CAMINHONETE MOTOR DIESEL, POTÊNCIA 180 CV, CABINE DUPLA, 4X4 - MATERIAIS NA OPERAÇÃO. AF_11/2015"]
[null,"CAMINHONETE MOTOR DIESEL, POTÊNCIA 180 CV, CABINE DUPLA, 4X4 - MATERIAIS NA OPERAÇÃO. AF_11/2015","H"]
["a1.pneus","PICK-UP DIESEL REPOSIÇÃO DE PNEUS R16 COM BASE NA UTILIZAÇÃO NO O&M PISF (1jg./ano)"]
[null,"PICK-UP DIESEL, POT. 180 CV, CD, 4x4 - REPOSIÇÃO DE PNEUS COM BASE NA UTILIZAÇÃO NO O&M PISF (1jg./ano)","H"]
["a2.comb.","PICK-UP DIESEL, POT. 180 CV, CD, 4x4 - COMBUSTÍVEL ADICIONAL COM BASE NA UTILIZAÇÃO NO O&M PISF"]
[null,"PICK-UP DIESEL, POT. 180 CV, CD, 4x4 - COMBUSTÍVEL ADICIONAL COM BASE NA UTILIZAÇÃO NO O&M PISF","L/H"]
["92140","PICAPE SIMPLES MOTOR 1.6 FLEX, MANUAL, POTÊNCIA 101/104 CV - DEPRECIAÇÃO. AF_11/2015","H","","",""]
[null,"PICAPE SIMPLES MOTOR 1.6 FLEX, MANUAL, POTÊNCIA 101/104 CV - DEPRECIAÇÃO. AF_11/2015","H"]
["92141","PICAPE SIMPLES MOTOR 1.6 FLEX, MANUAL, POTÊNCIA 101/104 CV - JUROS. AF_11/2015","H"]
[null,"PICAPE SIMPLES MOTOR 1.6 FLEX, MANUAL, POTÊNCIA 101/104 CV - JUROS. AF_11/2015","H"]
["92142","PICAPE SIMPLES MOTOR 1.6 FLEX, MANUAL, POTÊNCIA 101/104 CV - IMPOSTOS E SEGUROS. AF_11/2015","H"]
[null,"PICAPE SIMPLES MOTOR 1.6 FLEX, MANUAL, POTÊNCIA 101/104 CV - IMPOSTOS E SEGUROS. AF_11/2015","H"]
["92143","PICAPE SIMPLES MOTOR 1.6 FLEX, MANUAL, POTÊNCIA 101/104 CV - MANUTENÇÃO. AF_11/2015","H"]
[null,"PICAPE SIMPLES MOTOR 1.6 FLEX, MANUAL, POTÊNCIA 101/104 CV - MANUTENÇÃO. AF_11/2015","H"]
["92144","PICAPE SIMPLES MOTOR 1.6 FLEX, MANUAL, POTÊNCIA 101/104 CV - MATERIAIS NA OPERAÇÃO. AF_11/2015","H"]
[null,"PICAPE SIMPLES MOTOR 1.6 FLEX, MANUAL, POTÊNCIA 101/104 CV - MATERIAIS NA OPERAÇÃO. AF_11/2015","H",null,null,null,""]
["a3.pneus","VEÍCULO FLEX  REPOSIÇÃO DE PNEUS R14 COM BASE NA UTILIZAÇÃO NO O&M PISF (1jg./ano)"]
[null,"VEÍCULO FLEX  REPOSIÇÃO DE PNEUS R14 COM BASE NA UTILIZAÇÃO NO O&M PISF (1jg./ano)","H"]
["a4.comb.","VEÍCULO FLEX COMBUSTÍVEL ADICIONAL COM BASE NA UTILIZAÇÃO NO O&M PISF"]
[null,"VEÍCULO FLEX COMBUSTÍVEL ADICIONAL COM BASE NA UTILIZAÇÃO NO O&M PISF","L/H"]
["INSUMOS"]
["CÓD.","DESCRICAO DO INSUMO","UND","COEF.","P. UNIT.","CUSTO T."]
[1159,"CAMINHONETE COM MOTOR A DIESEL, POTÊNCIA 180 CV, CABINE DUPLA, 4X4","UN"]
[4221,"ÓLEO DIESEL COMBUSTÍVEL COMUM","L"]
[13617,"PICAPE SIMPLES MOTOR 1.6 FLEX, MANUAL, POT. MÍNIMA 101/104 CV, 2 PORTAS - SIMILAR A GOL 4 PORTAS","UN"]
[4222,"GASOLINA COMUM","L"]
["CÁLCULO HORÁRIO MÉDIO EM CIRCUITO MISTO DO CONSUMO DE COMBUSTÍVEL E CÁLCULO MÉDIO DO KM RODADO POR MÊS MÉDIO*",null,"H","KM","KM/L médio","L/H"]
["I.Rodovia","Cálclo da distância em rodovia mista BR(Federal em boas condições) e PE(Estadual em boas condições) vias asfaltadas e sinalizadas",1,77.400000000000006]
["II.Est.Vic.","Cálclo da distância em Estrada Vicinal em condições medianas",1,35.6]
["MÉDIA","Média entre as condições I e II",1,56.5,null,null,"Arredondando"]
["CHP-Flex","Considerando a necessidade de 35% de horas produtivas mês e que o mês médio nos dá 176 horas (44 hs/sem. x 4 = 176 hs)-FLEX",176]
["CHP-Diesel","Considerando a necessidade de 45% de horas produtivas mês e que o mês médio nos dá 176 horas (44 hs/sem. x 4 = 176 hs)-DIESEL",176]
["OBSERVAÇÃO: O mês médio leva em consideração que há meses de 28 dias, outros com 30 dias e outros com 31 dias. Há meses que têm mais feriados e outros não, incluindo recessos e paradas técnicas."]
["Outra observação importante é que se trata do quilômetro rodado médio de todos os veículos de cada categoria de combustível, servindo tanto para os veículos à diesel quanto aos à Gaolina/Flex."]
[]
["Consumo de pneus - Motocicleta",null,"UND","COEF.","P. UNIT.","CUSTO T.","% item"]
[null,"NXR 160 BROS ESDD FLEXONE","UN"]
[null,"NXR 160 BROS  REPOSIÇÃO DE PNEUS ARO 17 COM BASE NA UTILIZAÇÃO NO O&M PISF (1jg./ano)","H"]
[null,"NXR 160 BROS  REPOSIÇÃO DE PNEUS ARO 17 COM BASE NA UTILIZAÇÃO NO O&M PISF (1jg./ano)","MÊS",176]
[]
["Miniônibus com capacidade para 30 passageiros - 111 kW",null,"UND","COEF.","P. UNIT.","CUSTO T.","% item"]
["SICRO - E9134","Miniônibus com capacidade para 30 passageiros - 111 k","UN",1,null,0]
[null,"Ônibus  REPOSIÇÃO DE PNEUS ARO 22.5 COM BASE NA UTILIZAÇÃO NO O&M PISF (1jg./ano)","H","",null,""]
[null,"Ônibus  REPOSIÇÃO DE PNEUS ARO 22.5 COM BASE NA UTILIZAÇÃO NO O&M PISF (1jg./ano)","MÊS",176,"",""]
[]
["*Observações"]
["- SICRO 01/2022"]
["-SINAPI 04/2022"]
{"$rows_empty":14}
[{"$nulls":9},"SINAPI 04/2022 - NÃO DESONERADO"]
[{"$nulls":9},"SICRO 01/2022 - NÃO DESONERADO"]

{"sheet":"Equipamentos","index":26,"n_rows":261,"n_cols":12,"rows_kept":261,"cut":false,"hidden":false,"merged":[[121,0,121,5],[119,0,119,5],[124,0,124,6],[11,3,12,3],[11,4,12,4],[11,5,11,6],[15,2,15,6],[62,2,62,6],[13,2,13,6],[133,5,133,6],[127,2,127,4],[133,0,133,4],[134,0,134,4],[0,2,0,6],[1,2,1,6],[2,2,2,6],[4,0,5,6],[7,0,7,6],[11,1,12,1],[60,0,60,5],[73,0,73,5],[125,2,125,4],[125,5,125,6],[11,0,12,0],[11,2,12,2],[135,0,135,4],[132,5,132,6],[126,2,126,4],[126,5,126,6],[140,0,140,6],[139,0,139,6],[137,0,138,6],[127,5,127,6],[128,2,128,4],[128,5,128,6],[129,5,129,6],[129,0,129,4],[134,5,134,6],[135,5,135,6],[136,0,136,6],[132,0,132,4]]}
[null,null,"Ministério do Desenvolvimento Regional  - MDR"]
[null,null,"Companhia de Desenvolvimento dos Vales do São Francisco e do Parnaíba"]
[null,null,"Gerência de Operação do PISF - Centro de Controle e Operação (AD / GOI / CCO)"]
[]
[{"$f":"Mem_Calculo_VEICULOS!A5","v":"TERMO DE REFERÊNCIA PARA CONTRATAÇÃO DOS RECURSOS NECESSÁRIOS À OPERAÇÃO E MANUTENÇÃO DAS INFRAESTRUTURAS DO EIXO LESTE DO PISF - PROJETO DE INTEGRAÇÃO DO SÃO FRANCISCO COM AS BACIAS HIDROGRÁFICAS DO NORDESTE SETENTRIONAL"}]
[]
[]
["EQUIPAMENTOS"]
[]
[]
[]
["ITEM","CÓDIGO","DESCRIÇÃO","UNIDADE","QUANTIDADE","VALOR (R$)"]
[{"$nulls":5},"UNITARIO","TOTAL"]
[null,null,{"$f":"A8","v":"EQUIPAMENTOS"}]
[]
["1.",null,"EQUIPAMENTOS - MECÂNICA",{"$nulls":7},12,{"$f":"'ORCAMENTO_CONSOLIDADO (2)'!$K$1","v":6}]
["1.1","COT_AFER","Aferidor de manômetro de 0 a 150 bar ","un x mês",{"$f":"L17","v":6},null,{"$f":"IF(F17=\"\",\"\",ROUND(E17*F17,2))","v":""},null,12,null,{"$f":"I17/$K$16","v":1},{"$f":"ROUNDUP(K17*$L$16,0)","v":6}]
["1.2","COT_ALMO_FLEX","Almotolia de bico flexível 500ml","un x mês",{"$f":"L18","v":18},null,{"$f":"IF(F18=\"\",\"\",ROUND(E18*F18,2))","v":""},null,36,null,{"$f":"I18/$K$16","v":3},{"$f":"ROUNDUP(K18*$L$16,0)","v":18}]
["1.3","COT_ALMO_RIG","Almotolia de bico rígido 500ml","un x mês",18,null,"",null,36,null,3,{"$f":"ROUNDUP(K19*$L$16,0)","v":18}]
["1.4","\t4154/ORSE","Andaime metálico tipo fachadeiro Dim: Largura= 1,20m / Altura por peça= 2,00m. (Altura Total=10m - 5 peças por conjunto)","m² x mês",864,null,"",null,1728,null,144,864]
["1.5","COT_BANC_OFIC","Bancada para oficina (Dim: 1,2m x 2,5m) ","un x mês",36,null,"",null,72,null,6,36]
["1.6","COT_BOMB_GRAX","Bomba de graxa manual 5kg ","un x mês",18,null,"",null,36,null,3,18]
["1.7","13914 - SINAPI/PE","Talha Manual de Corrente com Alavanca 1,5 t Elevação 1,5m (Catraca 1,5 ton) ","un x mês",6,null,"",null,12,null,1,6]
["1.8","COT_CHAV_46","Chave de impacto 46mm boca/estria ","un x mês",12,null,"",null,24,null,2,12]
["1.9","COT_CHAV_55","Chave de impacto 55mm boca/estria ","un x mês",12,null,"",null,24,null,2,12]
["1.10","COT_CHAV_60","Chave de impacto 60mm boca/estria ","un x mês",12,null,"",null,24,null,2,12]
["1.11","COT_CHAV_65","Chave de impacto 65mm boca/estria ","un x mês",12,null,"",null,24,null,2,12]
["1.12","COT_CHAV_70","Chave de impacto 70mm boca/estria ","un x mês",12,null,"",null,24,null,2,12]
["1.13","COT_CHAV_75","Chave de impacto 75mm boca/estria","un x mês",24,null,"",null,48,null,4,24]
["1.14","COT_CHAV_85","Chave de impacto 85mm boca/estria","un x mês",24,null,"",null,48,null,4,24]
["1.15","COT_CINT_3T","Cinta para elevação de carga (comprimento: 3m / capacidade de carga: 3t)","un x mês",12,null,"",null,24,null,2,12]
["1.16","COT_CINT_20T","Cinta para elevação de carga  (comprimento: 6m / capacidade de carga: 20t)","un x mês",12,null,"",null,24,null,2,12]
["1.17","COT_CORT","Cortador a frio para tubos - Cortador Tubo Ferro Ferrari 1/8\" - 2\"","un x mês",12,null,"",null,24,null,2,12]
["1.18","COT_CURV","Curvador de tubos (Até 1”) - Curvador e Dobrador De Tubos Manual","un x mês",12,null,"",null,24,null,2,12]
["1.19","38476 - SINAPI/PE","Escada de abrir com 2 x 8 degraus (2,40m) em alumínio ","un x mês",24,null,"",null,48,null,4,24]
["1.20","38477 - SINAPI/PE","Escada de marinheiro extensível em duraluníno com 10 x 20 degraus (3,00m / 6,00m) ","un x mês",18,null,"",null,36,null,3,18]
["1.21","COT_ESCA_07","Escada metálica de 07 degraus ","un x mês",18,null,"",null,36,null,3,18]
["1.22","COT_ESCA_16","Escada articulada multifuncional 4x4 16 degraus","un x mês",6,null,"",null,12,null,1,6]
["1.23","COT_ESME","Esmerilhadeira angular de 4 ½” ","un x mês",12,null,"",null,24,null,2,12]
["1.24","11359 - SINAPI/PE","Esmerilhadeira angular de 7” ","un x mês",12,null,"",null,24,null,2,12]
["1.25","I9376 - SEINFRA/CE","Furadeira Manual 650W 1050 – 1450 RPM 220V Ø 13mm","un x mês",12,null,"",null,24,null,2,12]
["1.26","COT_INDU","Indutor elétrico para aquecimento de rolamentos (JM 500) ","un x mês",6,null,"",null,12,null,1,6]
["1.27","COT_LIXA","Lixadeira 4 1/2\" ","un x mês",12,null,"",null,24,null,2,12]
["1.28","COT_MACA_20T","Macaco de comando a distância 20 t - Macaco Hidráulico 20 Toneladas Tipo Garrafa","un x mês",12,null,"",null,24,null,2,12]
["1.29","COT_MACA_50T","Macaco de comando a distância 50 t - Macaco Hidráulico 50 Toneladas Tipo Garrafa","un x mês",12,null,"",null,24,null,2,12]
["1.30","COT_MACA_2T","Macaco tipo elevador capacidade de 2 t - Macaco Hidráulico 2 Toneladas tipo Garrafa","un x mês",12,null,"",null,24,null,2,12]
["1.31","COT_MACA_GIR","Macaco tipo girafa de 2 t - Guincho Hidráulico 2 Toneladas com Prolongador","un x mês",12,null,"",null,24,null,2,12]
["1.32","40403 - SINAPI/PE","Máquina de solda elétrica de 250 A com kit.","un x mês",12,null,"",null,24,null,2,12]
["1.33","COT_MORS","Morsa para bancada nº 08 ","un x mês",36,null,"",null,72,null,6,36]
["1.34","E9630-DNIT/PE","Conjunto Motor bomba 7,5 CV, 380 V, Q=75,6 m3/h e H=17 mca. (Poço de rebaixamento da EBV-3)","un x mês",6,null,"",null,12,null,1,6]
["1.35","COT_BOMB_SUB","Bomba Submersível 5 Cv Trifásica 380V, Q=2 - 52 m3/h e H= 3-25 mca.(Poço de rebaixamento do Res. de areias (Estrutura de Controle)","un x mês",6,null,"",null,12,null,1,6]
["1.36","COT_MOTO_ESMER","Motoesmeril de 1cv - 3.500 RPM ","un x mês",36,null,"",null,72,null,6,36]
["1.37","COT_MULT","Multiplicador de Torque Manual 2700 N.m/2000 lb.ft CDI GA190","un x mês",6,null,"",null,12,null,1,6]
["1.38","E9552 - DNIT/PE","Nível de precisão  ","un x mês",6,null,"",null,12,null,1,6]
["1.39","COT_PARA","Parafusadeira elétrica a bateria ","un x mês",12,null,"",null,24,null,2,12]
["1.40","COT_PREN","Prensa hidráulica de 10 ton ","un x mês",12,null,"",null,24,null,2,12]
["1.41","E9207-DNIT/PE","Retífica elétrica ","un x mês",12,null,"",null,24,null,2,12]
["1.42","E9748-DNIT/PE","Rosqueadeira ( para tubos de ½” a 4”) -Rosqueadeira Elétrica 1/2 A 4 Pol. 750w 220v-Br Motors-Brr124bsp","un x mês",6,null,"",null,12,null,1,6]
["1.43","10740 - SINAPI/PE","Talha capacidade 3t","un x mês",12,null,"",null,24,null,2,12]
["1.44","COT_TIFO","Tifor 3t","un x mês",12,null,"",null,24,null,2,12]
[{"$f":"\"TOTAL - \"&C16&\":\"","v":"TOTAL - EQUIPAMENTOS - MECÂNICA:"},{"$nulls":9},0,0]
[{"$nulls":10},0,0]
["2.",null,"EQUIPAMENTOS - ELÉTRICA",{"$nulls":7},0,0]
["2.1","COT_ANAL","Analisador de grandezas elétricas trifásico, display LCD colorido 5,6\", TRMS 1.000 V, corrente 3.000A ","un x mês",{"$f":"L64","v":6},null,{"$f":"IF(F64=\"\",\"\",ROUND(E64*F64,2))","v":""},null,12,null,1,6]
["2.2","COT_BANC_TESTE","Bancada de teste, amperimetro 150A, voltímetro 40V ","un x mês",6,null,"",null,12,null,1,6]
["2.3","COT_BANC_PROT","Bancada protegida contra eletricidade estática ","un x mês",6,null,"",null,12,null,1,6]
["2.4","COT_DATA","Data Logger de 4 a 20 mA (verificação de intermitência em instrumentação) ","un x mês",6,null,"",null,12,null,1,6]
["2.5","13761 - SINAPI/PE","Estação de solda com temperatura ajustável e proteção antiestático ","un x mês",6,null,"",null,12,null,1,6]
["2.6","10236 - ORSE/SE","Fonte de alimentação com tensão variável de 0 a 30Vcc de 3 A ","un x mês",6,null,"",null,12,null,1,6]
["2.7","COT_FONT","Fonte de bancada 12 V ","un x mês",6,null,"",null,12,null,1,6]
["2.8","I9376 - SEINFRA/CE","Furadeira Manual 650W 1050 – 1450 RPM 220V Ø 13mm","un x mês",6,null,"",null,12,null,1,6]
["2.9","COT_GERA","Gerador de corrente e tensão de 0 a 20 mA e 0 a 10V, precisão de 0,1% ","un x mês",6,null,"",null,12,null,1,6]
["2.10","COT_TTR ","TTR - medidor digital de relação de espiras, escala de medição 0,8000:1 a 8.000,0: 1 ","un x mês",6,null,"",null,12,null,1,6]
[{"$f":"\"TOTAL - \"&C63&\":\"","v":"TOTAL - EQUIPAMENTOS - ELÉTRICA:"},{"$nulls":9},0,0]
[{"$nulls":10},0,0]
["3.",null,"EQUIPAMENTOS - CIVIL",{"$nulls":7},0,0]
["3.1",null,"MANUTENÇÃO",{"$nulls":7},0,0]
["3.1.1","E9630-DNIT/PE","Bomba submersível com capacidade de 75 m³/h - 3,6 kW","un x mês",{"$f":"L78","v":12},null,{"$f":"IF(F78=\"\",\"\",ROUND(E78*F78,2))","v":""},null,24,null,2,12]
["3.1.2",{"$f":"B20","v":"\t4154/ORSE"},"Andaime metálico tipo fachadeiro Dim: Largura= 1,20m / Altura por peça= 2,00m. (Altura Total=10m - 5 peças por conjunto)","m² x mês",432,null,"",null,864,null,72,432]
["3.1.3","E9519 - DNIT/PE","Betoneira com motor a gasolina com capacidade de 600 l - 10 kW","un x mês",12,null,"",null,24,null,2,12]
["3.1.4","746 - SINAPI/PE","Lavadora de alta pressão a diesel, partida elétrica, motor de 10 hp","un x mês",6,null,"",null,12,null,1,6]
["3.1.5","36503 - SINAPI/PE","MOTOBOMBA TRASH (PARA AGUA SUJA) AUTO ESCORVANTE, MOTOR GASOLINA DE 6,41 HP, DIAMETROS DE SUCCAO X RECALQUE: 3\" X 3\", HM/Q: 10/60 A 23/0","un x mês",12,null,"",null,24,null,{"$f":"I82/$K$16","v":2},{"$f":"ROUNDUP(K82*$L$16,0)","v":12}]
["3.1.6","E9630-DNIT/PE","Bomba submersível com capacidade de 75 m³/h - 3,6 kW","un x mês",12,null,"",null,24,null,2,12]
["3.1.7","E9579-DNIT/PE","CAMINHÃO BASCULANTE 10 M3, TRUCADO CABINE SIMPLES, PESO BRUTO TOTAL 23.000 KG, CARGA ÚTIL MÁXIMA 15.935 KG, DISTÂNCIA ENTRE EIXOS 4,80 M, POTÊNCIA 230 CV INCLUSIVE CAÇAMBA METÁLICA ","un x mês",24,null,"",null,48,null,4,24]
["3.1.8","E9592-DNIT/PE","CAMINHÃO TRUCADO (C/ TERCEIRO EIXO) ELETRÔNICO - POTÊNCIA 231CV - PBT = 22000KG - DIST. ENTRE EIXOS 5170 MM - INCLUI CARROCERIA FIXA ABERTA DE MADEIRA","un x mês",24,null,"",null,48,null,4,24]
["3.1.9","E9509-DNIT/PE","Caminhão Comboio para lubrificação e abastecimento (melosa), convencional totalmente equipado (Capacidade de Combustível: 5.000 l, Capacidade de Lubrificante: 500 l, Capacidade de Graxa: 200 kg, Capacidade de Água: 300 l, Recipiente para Óleo Usado: 200 l, Compressor de Ar e Bomba- d’agua).","un x mês",6,null,"",null,12,null,1,6]
["3.1.10","E9686-DNIT/PE","Caminhão guindauto com capacidade de carga até 10,0 t.","un x mês",12,null,"",null,24,null,2,12]
["3.1.11","6259 - SINAPI/PE","Caminhão tanque, capacidade de volume  6000 l e potência 136,0 hp .","un x mês",30,null,"",null,60,null,5,30]
["3.1.12","89883-SINAPI/PE","Cavalo Mecânico com Reboque M. Benz Randon LS-1634/45 29,5 t, ou similar","un x mês",6,null,"",null,12,null,1,6]
["3.1.13","E9107-DNIT/PE","Compactador de solo a percussão (soquete), com motor gasolina de 4 tempos, peso entre 55 e 65 kg, força de impacto de 1.000 a 1.500 kgf, frequência de 600 a 700 golpes por minuto,velocidade de trabalho entre 10 e 15 m/min, potência entre 2 e 3 hp.","un x mês",6,null,"",null,12,null,1,6]
["3.1.14","E9556-DNIT/PE","Compactador de solo, tipo placa vibratória reversível, com motor a diesel, peso entre 700 e 820 kg, força centrífuga entre 6.200 e 10.000 kgf, largura de trabalho entre 650 e 720 mm, frequência de vibração entre 3.000 e 3.500 rpm, velocidade de trabalho entre 25 e 30 m/min, potência entre 13,0 e 15,0 hp.","un x mês",6,null,"",null,12,null,1,6]
["3.1.15","E9513-DNIT/PE","Compressor de ar rebocável, vazão 400 pcm, pressão efetiva de trabalho 102 psi, motor diesel, potência 110 cv.","un x mês",3,null,"",null,6,null,0.5,3]
["3.1.16","COT_CONJ_30","Conjunto motorbomba com 30 kW de potência no motor elétrico (25 mca x 0,1 m³/s) para esgotamento, com respectivos mangotes de sucção e descarga a serem especificados em função dos diâmetros. ","un x mês",3,null,"",null,6,null,0.5,3]
["3.1.17","36483 - SINAPI/PE","ESCAVADEIRA HIDRAULICA SOBRE ESTEIRAS CACAMBA 0,40 A 1,20 M3, PESO OPERACIONAL 21,19 T, POTENCIA LIQUIDA 173 HP","un x mês",6,null,"",null,12,null,1,6]
["3.1.18","E9066-DNIT/PE","Grupo gerador de 13/14 KVA, 220v, trifásico, silenciado, com 100 metros de cabos e 01 QTA. ","un x mês",6,null,"",null,12,null,1,6]
["3.1.19","E9776 - DNIT/PE","Grupo gerador de 145/160 kVA","un x mês",6,null,"",null,12,null,1,6]
["3.1.20","E9778 - DNIT/PE","Grupo gerador de 310/340 kVA","un x mês",6,null,"",null,12,null,1,6]
["3.1.21","E9535 - DNIT/PE","Serra circular de bancada, modelo pica-pau, diâmetro de 350 mm. Características do motor: trifásico, potência de 5 hp, frequência de 60 H.","un x mês",12,null,"",null,24,null,2,12]
["3.1.22","40403 - SINAPI/PE","Máquina de solda elétrica de 250 A com kit.","un x mês",12,null,"",null,24,null,2,12]
["3.1.23","E9568-DNIT/PE","Furadeira elétrica profissional.","un x mês",12,null,"",null,24,null,2,12]
["3.1.24","13192 - SINAPI/PE","Lixadeira elétrica angular para concreto, potência 1.400 W, prato diamantado de 5''.","un x mês",12,null,"",null,24,null,2,12]
["3.1.25","14619 - SINAPI/PE","Máquina para corte com disco abrasivo de diâmetro de 18'' (450 mm), com motor elétrico trifásico de 10 cv.","un x mês",12,null,"",null,24,null,2,12]
["3.1.26","40703 - SINAPI/PE","Martelete rompedor 33 kg.","un x mês",6,null,"",null,12,null,1,6]
["3.1.27","36533 - SINAPI/PE","Martelo demolidor pneumático manual, com redução de vibração, peso de 31,5 kg.","un x mês",12,null,"",null,24,null,2,12]
["3.1.28","13227 - SINAPI/PE","MOTONIVELADORA POTENCIA BASICA LIQUIDA (PRIMEIRA MARCHA) 171 HP, PESO BRUTO 14768 KG, LARGURA DA LAMINA DE 3,7 M","un x mês",6,null,"",null,12,null,1,6]
["3.1.29","E9585 - DNIT/PE","Motoserra portátil com motor a gosolina de 60 cc.","un x mês",18,null,"",null,36,null,3,18]
["3.1.30","11651 - SINAPI/PE","Perfuratriz pneumática manual de peso médio, 18 kg, comprimento de curso de 6 m, diâmetro do pistão de 5,5 cm","un x mês",3,null,"",null,6,null,0.5,3]
["3.1.31","E9526-DNIT/PE","Retroescavadeira sobre rodas com carregadeira, tração 4x4, potência líquida 72 hp, peso operacional mínimo de 7.140 kg, capacidade mínima da carregadeira de 0,79 m³ e da retroescavadeira mínima de 0,18 m³, profundidade de escavação máxima de 4,50 m.","un x mês",24,null,"",null,48,null,4,24]
["3.1.32","E9089 - DNIT/PE","Roçadeira costal com motor a gasolina de  32 cc.","un x mês",24,null,"",null,48,null,4,24]
["3.1.33","COT - SOLD","Soldador manual para mantas Leister Triac-st","un x mês",12,null,"",null,24,null,2,12]
["3.1.34","COT_TORR","Torre de iluminação 4000 W","un x mês",12,null,"",null,24,null,2,12]
["3.1.35","COT - TRIT","Triturador de Galhos e Resíduos TR-500G à Gasolina Motor 13HP","un x mês",24,null,"",null,48,null,4,24]
["3.1.36","39628 - SINAPI/PE","Motor a diesel para vibrador de imersão de 4,7 cv.","un x mês",6,null,"",null,12,null,1,6]
["3.1.37","39399 - SINAPI/PE","Vibrador de imersão, com ponteira de 35 mm, mangote de 5 m, sem motor.","un x mês",2,null,"",null,4,null,0.33333333333333331,2]
["3.1.38","39400 - SINAPI/PE","Vibrador de imersão, com ponteira de 45 mm, mangote de 5 m, sem motor.","un x mês",2,null,"",null,4,null,0.33333333333333331,2]
["3.1.39","39401 - SINAPI/PE","Vibrador de imersão, com ponteira de 60 mm, mangote de 5 m, sem motor.","un x mês",2,null,"",null,4,null,0.33333333333333331,2]
[{"$f":"\"TOTAL - \"&C77&\":\"","v":"TOTAL - MANUTENÇÃO:"}]
[]
[]
[{"$f":"\"TOTAL - \"&C76&\" - (R$):\"","v":"TOTAL - EQUIPAMENTOS - CIVIL - (R$):"}]
[]
[{"$f":"\"TOTAL - \"&C14&\" - (R$):\"","v":"TOTAL - EQUIPAMENTOS - (R$):"}]
[]
[]
[{"$f":"\"RESUMO - \"&A$8","v":"RESUMO - EQUIPAMENTOS"}]
["ITEM",null,"DESCRIÇÃO",null,null,"VALOR TOTAL (R$)"]
["01",null,{"$f":"C16","v":"EQUIPAMENTOS - MECÂNICA"}]
["02",null,{"$f":"C63","v":"EQUIPAMENTOS - ELÉTRICA"}]
["03",null,{"$f":"C76","v":"EQUIPAMENTOS - CIVIL"}]
[{"$f":"\"TOTAL GERAL - \"&A125&\" -  (R$):\"","v":"TOTAL GERAL - RESUMO - EQUIPAMENTOS -  (R$):"}]
[]
[]
["NOME DO INFORMANTE:",{"$nulls":4},"QUALIFICAÇÃO:"]
[]
["ASSINATURA:",{"$nulls":4},"DATA:"]
[]
["OBSERVAÇÃO:"]
["1. A unidade adotada na planilha (un x mês) foi de acordo com o cronograma de alocação de recursos materiais, onde foi feita a divisão de uso mensalmente de cada equipamento, por canteiro. Dessa forma, é possivel diluir o custo durante todo o período do contrato."]
[]
["2. Os preços apresentados inlcuem o custo de operadores, motoristas e demais mão de obra necesária para utilização do mesmo. Bem como combustível, quando requeridos."]
[]
[]
["1. Considerado a carga horária de 176 horas/mês"]
[]
[null,null,"Carga horária mensal:",176,{"$f":"582.5/(12*30*8)","v":0.20225694444444445}]
[]
[null,null,null,"Operativa","R$/h (Operativa)","R$/h (Improdutiva)","R$/mês"]
[null,"COT_AFER","Aferidor de manômetro de 0 a 150 bar ",1,null,null,382.30555555555554]
[null,"COT_ALMO_FLEX","Almotolia de bico flexível 500ml",1,null,null,2.6751851851851853]
[null,"COT_ALMO_RIG","Almotolia de bico rígido 500ml",1,null,null,1.8862962962962959]
[null,"COT_ANAL","Analisador de grandezas elétricas trifásico, display LCD colorido 5,6\", TRMS 1.000 V, corrente 3.000A ",1,null,null,2485.67]
[null,"COT_ANDA","Andaime metálico tipo fachadeiro Dim: Largura= 1,20m / Altura por peça= 2,00m. (Altura Total=10m - 5 peças por conjunto)",1,null,null,{"$f":"((1224/144)+(0.98*30))/2","v":18.95}]
[null,"COT_BANC_TESTE","Bancada de teste, amperimetro 150A, voltímetro 40V ",1,null,null,13.76]
[null,"COT_BANC_OFIC","Bancada para oficina (Dim: 1,2m x 2,5m) ",1,null,null,58.701481481481487]
[null,"COT_BANC_PROT","Bancada protegida contra eletricidade estática ",1,null,null,61.09]
[null,"E9043-DNIT/PE","Embarcação de alumínio com comprimento de 6 m e motor de popa - 18,60 kW (inclusive barqueiro)",1,null,null,12389.28]
[null,"10537 - SINAPI/PE","Betoneira, capacidade nominal 400 l, capacidade de mistura 310 l, motor a diesel potência 5 cv, sem carregador.",1,null,null,691.36]
[null,"36398 - SINAPI/PE","Betoneira, capacidade nominal 600 l, capacidade de mistura 440 l,  motor a diesel potência 10 cv, com carregador.",1,null,null,2033.28]
[null,"COT_BOMB_GRAX","Bomba de graxa manual 5kg ",1,null,null,14.312222222222223]
[null,"36503 - SINAPI/PE","MOTOBOMBA TRASH (PARA AGUA SUJA) AUTO ESCORVANTE, MOTOR GASOLINA DE 6,41 HP, DIAMETROS DE SUCCAO X RECALQUE: 3\" X 3\", HM/Q: 10/60 A 23/0",1,null,null,603.91999999999996]
[null,"E9630-DNIT/PE","Bomba submersível com capacidade de 75 m³/h - 3,6 kW",1,null,null,302.17]
[null,"COT_BOMB_SUB","Bomba Submersível 5 Cv Trifásica 380V, Q=2 - 52 m3/h e H= 3-25 mca.(Poço de rebaixamento do Res. de areias (Estrutura de Controle)",1,null,null,905.89027777777778]
[null,"91386 - SINAPI/PE","CAMINHÃO BASCULANTE 10 M3, TRUCADO CABINE SIMPLES, PESO BRUTO TOTAL 23.000 KG, CARGA ÚTIL MÁXIMA 15.935 KG, DISTÂNCIA ENTRE EIXOS 4,80 M, POTÊNCIA 230 CV INCLUSIVE CAÇAMBA METÁLICA ",1,null,null,52766.67]
[null,"91031 - SINAPI/PE","CAMINHÃO TRUCADO (C/ TERCEIRO EIXO) ELETRÔNICO - POTÊNCIA 231CV - PBT = 22000KG - DIST. ENTRE EIXOS 5170 MM - INCLUI CARROCERIA FIXA ABERTA DE MADEIRA",1,null,null,48073.07]
[null,"E9509-DNIT/PE","Caminhão Comboio para lubrificação e abastecimento (melosa), convencional totalmente equipado (Capacidade de Combustível: 5.000 l, Capacidade de Lubrificante: 500 l, Capacidade de Graxa: 200 kg, Capacidade de Água: 300 l, Recipiente para Óleo Usado: 200 l, Compressor de Ar e Bomba- d’agua).",1,null,null,49301.32]
[null,"E9686-DNIT/PE","Caminhão guindauto com capacidade de carga até 10,0 t.",1,null,null,67170.570000000007]
[null,"6259 - SINAPI/PE","Caminhão tanque, capacidade de volume  6000 l e potência 136,0 hp .",1,null,null,46992.35]
[null,"A9382-DNIT/PE","Dolly intermediário com 2 eixos para semirreboque (para embarcação)",1,null,null,5698.37]
[null,"89883-SINAPI/PE","Cavalo Mecânico com Reboque M. Benz Randon LS-1634/45 29,5 t, ou similar",1,null,null,66504.75]
[null,"COT_CHAV_46","Chave de impacto 46mm boca/estria ",1,null,null,6.8411111111111111]
[null,"COT_CHAV_55","Chave de impacto 55mm boca/estria ",1,null,null,12.591481481481482]
[null,"COT_CHAV_60","Chave de impacto 60mm boca/estria ",1,null,null,13.599444444444442]
[null,"COT_CHAV_65","Chave de impacto 65mm boca/estria ",1,null,null,24.81722222222222]
[null,"COT_CHAV_70","Chave de impacto 70mm boca/estria ",1,null,null,22.496296296296297]
[null,"COT_CHAV_75","Chave de impacto 75mm boca/estria",1,null,null,37.027592592592597]
[null,"COT_CHAV_85","Chave de impacto 85mm boca/estria",1,null,null,62.664444444444449]
[null,"COT_CINT_20T","Cinta para elevação de carga  (comprimento: 6m / capacidade de carga: 20t)",1,null,null,69.444444444444443]
[null,"COT_CINT_3T","Cinta para elevação de carga (comprimento: 3m / capacidade de carga: 3t)",1,null,null,6.4644444444444442]
[null,"E9107-DNIT/PE","Compactador de solo a percussão (soquete), com motor gasolina de 4 tempos, peso entre 55 e 65 kg, força de impacto de 1.000 a 1.500 kgf, frequência de 600 a 700 golpes por minuto,velocidade de trabalho entre 10 e 15 m/min, potência entre 2 e 3 hp.",1,null,null,868.19]
[null,"E9556-DNIT/PE","Compactador de solo, tipo placa vibratória reversível, com motor a diesel, peso entre 700 e 820 kg, força centrífuga entre 6.200 e 10.000 kgf, largura de trabalho entre 650 e 720 mm, frequência de vibração entre 3.000 e 3.500 rpm, velocidade de trabalho entre 25 e 30 m/min, potência entre 13,0 e 15,0 hp.",1,null,null,968]
[null,"E9661-DNIT/PE","Compressor de ar rebocável, vazão 189 pcm, pressão efetiva de trabalho 102 psi, motor diesel, potência  63 cv.",1,null,null,7949.88]
[null,"E9513-DNIT/PE","Compressor de ar rebocável, vazão 400 pcm, pressão efetiva de trabalho 102 psi, motor diesel, potência 110 cv.",1,null,null,13545.12]
[null,"E9630-DNIT/PE","Conjunto Motor bomba 7,5 CV, 380 V, Q=75,6 m3/h e H=17 mca. (Poço de rebaixamento da EBV-3)",1,null,null,302.17]
[null,"COT_CONJ_160","Conjunto motorbomba com 160 kW de potência no motor elétrico (25 mca x 0,5 m³/s) para esgotamento, com respectivos mangotes de sucção e descarga a serem especificados em função dos diâmetros. ",1,null,null,{"$f":"113150/12","v":9429.1666666666661}]
[null,"COT_CONJ_30","Conjunto motorbomba com 30 kW de potência no motor elétrico (25 mca x 0,1 m³/s) para esgotamento, com respectivos mangotes de sucção e descarga a serem especificados em função dos diâmetros. ",1,null,null,3195.47]
[null,"COT_CORT","Cortador a frio para tubos - Cortador Tubo Ferro Ferrari 1/8\" - 2\"",1,null,null,19.653703703703702]
[null,"COT_CURV","Curvador de tubos (Até 1”) - Curvador e Dobrador De Tubos Manual",1,null,null,78.407037037037028]
[null,"E9609-DNIT/PE","Draga de sucção para extração de areia com tubo de descarga de 150 mm - 100 kW",1,null,null,21381.73]
[null,"COT_DATA","Data Logger de 4 a 20 mA (verificação de intermitência em instrumentação) ",1,null,null,31.96]
[null,"E9528-DNIT/PE","Empilhadeira sobre pneus com torre de três estágios, 4,80 m de elevação, com deslocador lateral dos garfos, motor glp 2.4 l, capacidade nominal de carga de 2,5 t.",1,{"$f":" 86.2687-20.0299","v":66.238799999999998},{"$f":" 41.2745-20.0299","v":21.244600000000002},36789.360000000001]
[null,"E9206-DNIT/PE","Equipamento de solda MIG automática com acessórios - 14,6 kVA",1,null,null,5233.29]
[null,"COT_ESCA_16","Escada articulada multifuncional 4x4 16 degraus",1,null,null,19.143518518518519]
[null,"38476 - SINAPI/PE","Escada de abrir com 2 x 8 degraus (2,40m) em alumínio ",1,null,null,4.07]
[null,"38477 - SINAPI/PE","Escada de marinheiro extensível em duraluníno com 10 x 20 degraus (3,00m / 6,00m) ",1,{"$f":"975.46/(12*30*8)","v":0.3387013888888889},null,12.83]
[null,"COT_ESCA_07","Escada metálica de 07 degraus ",1,null,null,6.8944444444444448]
[null,"36483 - SINAPI/PE","ESCAVADEIRA HIDRAULICA SOBRE ESTEIRAS CACAMBA 0,40 A 1,20 M3, PESO OPERACIONAL 21,19 T, POTENCIA LIQUIDA 173 HP",1,null,null,54600.87999999999]
[null,"E9017-DNIT/PE","Escavadeira hidráulica sobre esteiras, caçamba 0,62 m³, peso operacional 12,61 t, potência líquida 95 hp.",1,null,null,49535.69]
[null,"COT_ESME","Esmerilhadeira angular de 4 ½” ",1,null,null,8.4977777777777774]
[null,"11359 - SINAPI/PE","Esmerilhadeira angular de 7” ",1,null,null,14.17]
[null,"13761 - SINAPI/PE","Estação de solda com temperatura ajustável e proteção antiestático ",1,null,null,983.76]
[null,"10236 - ORSE/SE","Fonte de alimentação com tensão variável de 0 a 30Vcc de 3 A ",1,{"$f":"193/(12*30*8)","v":6.7013888888888887E-2},null,4.0199999999999996]
[null,"COT_FONT","Fonte de bancada 12 V ",1,null,null,12.13]
[null,"E9568-DNIT/PE","Furadeira elétrica profissional.",1,null,null,84.66]
[null,"I9376 - SEINFRA/CE","Furadeira Manual 650W 1050 – 1450 RPM 220V Ø 13mm",1,0.08,null,18.809999999999999]
[null,"COT_GERA","Gerador de corrente e tensão de 0 a 20 mA e 0 a 10V, precisão de 0,1% ",1,null,null,47.27]
[null,"E9763-DNIT/PE","Grupo Gerador - 32,0 kVA, 220 V, trifásico, silenciado, com 100 metros de cabos e 01 QTA. ",1,null,null,3569.08]
[null,"E9066-DNIT/PE","Grupo gerador de 10 KVA, 220v, trifásico, silenciado, com 100 metros de cabos e 01 QTA. ",1,null,null,2786.78]
[null,"E9066-DNIT/PE","Grupo gerador de 15 kVA, 220V, trifásico, silenciado, com 100 metros de cabos e 01 QTA. ",1,null,null,2786.78]
[null,"E9521-DNIT/PE","Grupo gerador de 4 KVA, 220v, trifásico, silenciado, com 100 metros de cabos e 01 QTA. ",1,null,null,254.27]
[null,"39588 - SINAPI/PE","Grupo gerador diesel, com carenagem, potência standart entre 250 e 260 kVA, velocidade de 1800 rpm, frequência de 60 Hz.",1,null,null,15376.61]
[null,"COT_GRUP_15KVA","Grupo gerador, potência nominal 15 kVA (emergência), incluindo instalação, cabeamento, base de concreto e demais materiais necessários.",1,null,null,1719.95]
[null,"COT_INDU","Indutor elétrico para aquecimento de rolamentos (JM 500) ",1,null,null,2012.1599999999999]
[null,"COT_KIT ","Kit para enchimento e complementação para gás SF6, composto de adaptador ,regulador, mangueira e manômetro padrão ",1,null,null,542.9]
[null,"746 - SINAPI/PE","Lavadora de alta pressão a diesel, partida elétrica, motor de 10 hp",1,null,null,158]
[null,"COT_LIXA","Lixadeira 4 1/2\" ",1,null,null,21.661481481481484]
[null,"13192 - SINAPI/PE","Lixadeira elétrica angular para concreto, potência 1.400 W, prato diamantado de 5''.",1,null,null,88.31]
[null,"E9630-DNIT/PE","Bomba submersível com capacidade de 75 m³/h - 3,6 kW",1,null,null,302.17]
[null,"743 - SINAPI/PE","Locação de bomba submersível para drenagem e esgotamento, motor elétrico trifásico, potência de 2 cv, diâmetro de recalque de  2\". Faixa de operação: Q= 35 m³/h (± 3 m³/h) e AMT=2 m; Q=13 m³/h (± 3 m³/h) e AMT = 17 m (± 3 m).",1,1.96,null,{"$f":"ROUND($D$145*(D218*E218+(1-D218)*F218),2)","v":344.96}]
[null,"36500 - SINAPI/PE","Locação de grupo gerador acima de 125 até 180 kVA, motor diesel, rebocável, acionamento manual.",1,null,null,4902.32]
[null,"COT_MACA_20T","Macaco de comando a distância 20 t - Macaco Hidráulico 20 Toneladas Tipo Garrafa",1,null,null,10.920370370370371]
[null,"COT_MACA_50T","Macaco de comando a distância 50 t - Macaco Hidráulico 50 Toneladas Tipo Garrafa",1,null,null,39.440555555555555]
[null,"COT_MACA_2T","Macaco tipo elevador capacidade de 2 t - Macaco Hidráulico 2 Toneladas tipo Garrafa",1,null,null,3.088703703703704]
[null,"COT_MACA_GIR","Macaco tipo girafa de 2 t - Guincho Hidráulico 2 Toneladas com Prolongador",1,null,null,109.81425925925925]
[null,"40403 - SINAPI/PE","Máquina de solda elétrica de 250 A com kit.",1,null,null,12.64]
[null,"14619 - SINAPI/PE","Máquina para corte com disco abrasivo de diâmetro de 18'' (450 mm), com motor elétrico trifásico de 10 cv.",1,null,null,249.64]
[null,"40703 - SINAPI/PE","Martelete rompedor 33 kg.",1,{"$f":"8600/(12*30*8)","v":2.9861111111111112},null,645.36]
[null,"36533 - SINAPI/PE","Martelo demolidor pneumático manual, com redução de vibração, peso de 31,5 kg.",1,null,null,288.29000000000002]
[null,"37514 - SINAPI/PE","Minicarregadeira sobre rodas, potência líquida de 47 hp, capacidade nominal de operação de 646 kg.",1,null,null,16446.72]
[null,"COT_MORS","Morsa para bancada nº 08 ",1,null,null,15.273888888888889]
[null,"COT_MOTO_ESMER","Motoesmeril de 1cv - 3.500 RPM ",1,null,null,34.413611111111109]
[null,"13227 - SINAPI/PE","MOTONIVELADORA POTENCIA BASICA LIQUIDA (PRIMEIRA MARCHA) 171 HP, PESO BRUTO 14768 KG, LARGURA DA LAMINA DE 3,7 M",1,null,null,65066.05333333333]
[null,"39628 - SINAPI/PE","Motor a diesel para vibrador de imersão de 4,7 cv.",1,null,null,55.75]
[null,"COT_MOTO_POP","Motor popa, tipo partida manual, potência 15 hp, aplicação barco Alumínio, características adicionais: válvulas automáticas descompressão, refrigerado a ar, quantidade marchas 2 und, quantidade cilíndro 2 und, capacidade tanque 23 l, tipo motor: 2 tempos, velocidade: 4.500 a 5.800 rpm.",1,null,null,759.06]
[null,"E9585 - DNIT/PE","Motoserra portátil com motor a gosolina de 60 cc.",1,null,null,1062.4000000000001]
[null,"COT_MULT","Multiplicador de Torque Manual 2700 N.m/2000 lb.ft CDI GA190",1,null,null,517.34944444444454]
[null,"E9552 - DNIT/PE","Nível de precisão  ",1,null,null,729.35]
[null,"4262 - SINAPI/PE","Pá carregadeira sobre rodas, potência líquida 128 hp, capacidade da caçamba de 1,7 a 2,8 m³, peso operacional de 11.632 kg.",null,null,null,48738.400000000001]
[null,"COT_PARA","Parafusadeira elétrica a bateria ",1,null,null,19.775925925925929]
[null,"11651 - SINAPI/PE","Perfuratriz pneumática manual de peso médio, 18 kg, comprimento de curso de 6 m, diâmetro do pistão de 5,5 cm",1,null,null,10609.33]
[null,"COT_PLAT","Plataforma Aérea, altura de trabalho 16,0 m, capacidade de carga 227 kg, fonte de energia: diesel, painel de controle na base e na plataforma, altura arriada: 2,0 m.",1,null,null,11411.96]
[null,"COT_PREN","Prensa hidráulica de 10 ton ",1,null,null,30.551666666666662]
[null,"E9207-DNIT/PE","Retífica elétrica ",1,null,null,302.55]
[null,"E9526-DNIT/PE","Retroescavadeira sobre rodas com carregadeira, tração 4x4, potência líquida 72 hp, peso operacional mínimo de 7.140 kg, capacidade mínima da carregadeira de 0,79 m³ e da retroescavadeira mínima de 0,18 m³, profundidade de escavação máxima de 4,50 m.",1,null,null,33948.019999999997]
[null,"E9089 - DNIT/PE","Roçadeira costal com motor a gasolina de  32 cc.",1,null,null,879.28]
[null,"10664 - SINAPI/PE","Roçadeira deslocável, largura de trabalho de 1,3 m.",1,null,null,128.41999999999999]
[null,"E9685-DNIT/PE","Rolo compactador pé-de-carneiro vibratório, potência 125 hp, peso operacional sem/com lastro 11,95/13,30 t, impacto dinâmico 38,5/22,5 t, largura de trabalho 2,15 m.",1,null,null,48048.5]
[null,"E9748-DNIT/PE","Rosqueadeira ( para tubos de ½” a 4”) -Rosqueadeira Elétrica 1/2 A 4 Pol. 750w 220v-Br Motors-Brr124bsp",1,null,null,7398.16]
["E9535-DNIT/PE","E9535 - DNIT/PE","Serra circular de bancada, modelo pica-pau, diâmetro de 350 mm. Características do motor: trifásico, potência de 5 hp, frequência de 60 H.",1,null,null,381.54]
[null,"COT - SOLD","Soldador manual para mantas Leister Triac-st",1,null,null,336.25]
["E9719-DNIT/PE","10740 - SINAPI/PE","Talha capacidade 3t",1,null,null,124.34]
[null,"13914 - SINAPI/PE","Talha Manual de Corrente com Alavanca 1,5 t Elevação 1,5m (Catraca 1,5 ton) ",1,null,null,15.88]
[null,"COT_TIFO","Tifor 3t",1,null,null,149.00425925925927]
[null,"COT_TORR","Torre de iluminação 4000 W",1,null,null,1080.52]
[null,"89883-SINAPI/PE","Transportes de máquinas e equipamentos por caminhão cavalo mecânico com carreta-prancha capacidade 30t",1,null,null,66504.75]
[null,"36511 - SINAPI/PE","Trator Agrícola para reboque de máquina roçadeira",1,null,null,36883.15]
[null,"E9540-DNIT/PE","Trator de esteiras, potência de 150 hp, peso operacional de 16,7 t, com roda motriz elevada e lâmina com contato de 3,18 m³.",1,null,null,46552.639999999999]
[null,"COT - TRIT","Triturador de Galhos e Resíduos TR-500G à Gasolina Motor 13HP",1,null,null,328.1]
[null,"COT_TTR ","TTR - medidor digital de relação de espiras, escala de medição 0,8000:1 a 8.000,0: 1 ",1,null,null,223.72]
["E9069-DNIT/PE","39399 - SINAPI/PE","Vibrador de imersão, com ponteira de 35 mm, mangote de 5 m, sem motor.",1,null,null,25.02]
["E9069-DNIT/PE","39400 - SINAPI/PE","Vibrador de imersão, com ponteira de 45 mm, mangote de 5 m, sem motor.",1,null,null,27.4]
["E9069-DNIT/PE","39401 - SINAPI/PE","Vibrador de imersão, com ponteira de 60 mm, mangote de 5 m, sem motor.",1,null,null,30.5]

{"sheet":"CPU_EQUIPAMENTOS_","index":27,"n_rows":1402,"n_cols":18,"rows_kept":1402,"cut":false,"hidden":false,"merged":[[30,4,30,5],[30,8,30,9],[30,12,30,13],[125,8,125,9],[125,12,125,13],[1401,1,1401,3],[1401,4,1401,5],[1401,8,1401,9],[1401,12,1401,13],[1397,14,1401,17],[1398,4,1398,5],[1398,8,1398,9],[1398,12,1398,13],[1399,4,1399,5],[1399,8,1399,9],[1399,12,1399,13],[1400,4,1400,5],[1400,8,1400,9],[1400,12,1400,13],[1396,4,1396,5],[1396,8,1396,9],[1396,12,1396,13],[1397,4,1397,5],[1397,8,1397,9],[1397,12,1397,13],[1394,4,1394,5],[1394,8,1394,9],[1394,12,1394,13],[1395,4,1395,5],[1395,8,1395,9],[1395,12,1395,13],[1392,4,1392,5],[1392,8,1392,9],[1392,12,1392,13],[1393,4,1393,5],[1393,8,1393,9],[1393,12,1393,13],[1390,14,1391,14],[1390,15,1391,15],[1390,16,1391,16],[1390,17,1391,17],[1391,4,1391,5],[1391,8,1391,9],[1391,12,1391,13],[1389,2,1389,5],[1389,6,1389,9],[1389,10,1389,13],[1390,4,1390,5],[1390,8,1390,9],[1390,12,1390,13],[1382,4,1382,5],[1382,8,1382,9],[1382,12,1382,13],[1383,1,1383,3],[1383,4,1383,5],[1383,8,1383,9],[1383,12,1383,13],[1379,4,1379,5],[1379,8,1379,9],[1379,12,1379,13],[1379,14,1383,17],[1380,4,1380,5],[1380,8,1380,9],[1380,12,1380,13],[1381,4,1381,5],[1381,8,1381,9],[1381,12,1381,13],[1377,4,1377,5],[1377,8,1377,9],[1377,12,1377,13],[1378,4,1378,5],[1378,8,1378,9],[1378,12,1378,13],[1375,4,1375,5],[1375,8,1375,9],[1375,12,1375,13],[1376,4,1376,5],[1376,8,1376,9],[1376,12,1376,13],[1372,17,1373,17],[1373,4,1373,5],[1373,8,1373,9],[1373,12,1373,13],[1374,4,1374,5],[1374,8,1374,9],[1374,12,1374,13],[1372,4,1372,5],[1372,8,1372,9],[1372,12,1372,13],[1372,14,1373,14],[1372,15,1373,15],[1372,16,1373,16],[1365,1,1365,3],[1365,4,1365,5],[1365,8,1365,9],[1365,12,1365,13],[1371,2,1371,5],[1371,6,1371,9],[1371,10,1371,13],[1361,14,1365,17],[1362,4,1362,5],[1362,8,1362,9],[1362,12,1362,13],[1363,4,1363,5],[1363,8,1363,9],[1363,12,1363,13],[1364,4,1364,5],[1364,8,1364,9],[1364,12,1364,13],[1360,4,1360,5],[1360,8,1360,9],[1360,12,1360,13],[1361,4,1361,5],[1361,8,1361,9],[1361,12,1361,13],[1358,4,1358,5],[1358,8,1358,9],[1358,12,1358,13],[1359,4,1359,5],[1359,8,1359,9],[1359,12,1359,13],[1356,4,1356,5],[1356,8,1356,9],[1356,12,1356,13],[1357,4,1357,5],[1357,8,1357,9],[1357,12,1357,13],[1354,14,1355,14],[1354,15,1355,15],[1354,16,1355,16],[1354,17,1355,17],[1355,4,1355,5],[1355,8,1355,9],[1355,12,1355,13],[1353,2,1353,5],[1353,6,1353,9],[1353,10,1353,13],[1354,4,1354,5],[1354,8,1354,9],[1354,12,1354,13],[1346,4,1346,5],[1346,8,1346,9],[1346,12,1346,13],[1347,1,1347,3],[1347,4,1347,5],[1347,8,1347,9],[1347,12,1347,13],[1343,4,1343,5],[1343,8,1343,9],[1343,12,1343,13],[1343,14,1347,17],[1344,4,1344,5],[1344,8,1344,9],[1344,12,1344,13],[1345,4,1345,5],[1345,8,1345,9],[1345,12,1345,13],[1341,4,1341,5],[1341,8,1341,9],[1341,12,1341,13],[1342,4,1342,5],[1342,8,1342,9],[1342,12,1342,13],[1339,4,1339,5],[1339,8,1339,9],[1339,12,1339,13],[1340,4,1340,5],[1340,8,1340,9],[1340,12,1340,13],[1336,17,1337,17],[1337,4,1337,5],[1337,8,1337,9],[1337,12,1337,13],[1338,4,1338,5],[1338,8,1338,9],[1338,12,1338,13],[1336,4,1336,5],[1336,8,1336,9],[1336,12,1336,13],[1336,14,1337,14],[1336,15,1337,15],[1336,16,1337,16],[1325,1,1325,3],[1325,4,1325,5],[1325,8,1325,9],[1325,12,1325,13],[1329,0,1331,18],[1335,2,1335,5],[1335,6,1335,9],[1335,10,1335,13],[1321,14,1325,17],[1322,4,1322,5],[1322,8,1322,9],[1322,12,1322,13],[1323,4,1323,5],[1323,8,1323,9],[1323,12,1323,13],[1324,4,1324,5],[1324,8,1324,9],[1324,12,1324,13],[1320,4,1320,5],[1320,8,1320,9],[1320,12,1320,13],[1321,4,1321,5],[1321,8,1321,9],[1321,12,1321,13],[1318,4,1318,5],[1318,8,1318,9],[1318,12,1318,13],[1319,4,1319,5],[1319,8,1319,9],[1319,12,1319,13],[1316,4,1316,5],[1316,8,1316,9],[1316,12,1316,13],[1317,4,1317,5],[1317,8,1317,9],[1317,12,1317,13],[1314,14,1315,14],[1314,15,1315,15],[1314,16,1315,16],[1314,17,1315,17],[1315,4,1315,5],[1315,8,1315,9],[1315,12,1315,13],[1313,2,1313,5],[1313,6,1313,9],[1313,10,1313,13],[1314,4,1314,5],[1314,8,1314,9],[1314,12,1314,13],[1306,4,1306,5],[1306,8,1306,9],[1306,12,1306,13],[1307,1,1307,3],[1307,4,1307,5],[1307,8,1307,9],[1307,12,1307,13],[1303,4,1303,5],[1303,8,1303,9],[1303,12,1303,13],[1303,14,1307,17],[1304,4,1304,5],[1304,8,1304,9],[1304,12,1304,13],[1305,4,1305,5],[1305,8,1305,9],[1305,12,1305,13],[1301,4,1301,5],[1301,8,1301,9],[1301,12,1301,13],[1302,4,1302,5],[1302,8,1302,9],[1302,12,1302,13],[1299,4,1299,5],[1299,8,1299,9],[1299,12,1299,13],[1300,4,1300,5],[1300,8,1300,9],[1300,12,1300,13],[1296,17,1297,17],[1297,4,1297,5],[1297,8,1297,9],[1297,12,1297,13],[1298,4,1298,5],[1298,8,1298,9],[1298,12,1298,13],[1296,4,1296,5],[1296,8,1296,9],[1296,12,1296,13],[1296,14,1297,14],[1296,15,1297,15],[1296,16,1297,16],[1289,1,1289,3],[1289,4,1289,5],[1289,8,1289,9],[1289,12,1289,13],[1295,2,1295,5],[1295,6,1295,9],[1295,10,1295,13],[1285,14,1289,17],[1286,4,1286,5],[1286,8,1286,9],[1286,12,1286,13],[1287,4,1287,5],[1287,8,1287,9],[1287,12,1287,13],[1288,4,1288,5],[1288,8,1288,9],[1288,12,1288,13],[1284,4,1284,5],[1284,8,1284,9],[1284,12,1284,13],[1285,4,1285,5],[1285,8,1285,9],[1285,12,1285,13],[1282,4,1282,5],[1282,8,1282,9],[1282,12,1282,13],[1283,4,1283,5],[1283,8,1283,9],[1283,12,1283,13],[1280,4,1280,5],[1280,8,1280,9],[1280,12,1280,13],[1281,4,1281,5],[1281,8,1281,9],[1281,12,1281,13],[1278,14,1279,14],[1278,15,1279,15],[1278,16,1279,16],[1278,17,1279,17],[1279,4,1279,5],[1279,8,1279,9],[1279,12,1279,13],[1277,2,1277,5],[1277,6,1277,9],[1277,10,1277,13],[1278,4,1278,5],[1278,8,1278,9],[1278,12,1278,13],[1270,4,1270,5],[1270,8,1270,9],[1270,12,1270,13],[1271,1,1271,3],[1271,4,1271,5],[1271,8,1271,9],[1271,12,1271,13],[1267,4,1267,5],[1267,8,1267,9],[1267,12,1267,13],[1267,14,1271,17],[1268,4,1268,5],[1268,8,1268,9],[1268,12,1268,13],[1269,4,1269,5],[1269,8,1269,9],[1269,12,1269,13],[1265,4,1265,5],[1265,8,1265,9],[1265,12,1265,13],[1266,4,1266,5],[1266,8,1266,9],[1266,12,1266,13],[1263,4,1263,5],[1263,8,1263,9],[1263,12,1263,13],[1264,4,1264,5],[1264,8,1264,9],[1264,12,1264,13],[1260,17,1261,17],[1261,4,1261,5],[1261,8,1261,9],[1261,12,1261,13],[1262,4,1262,5],[1262,8,1262,9],[1262,12,1262,13],[1260,4,1260,5],[1260,8,1260,9],[1260,12,1260,13],[1260,14,1261,14],[1260,15,1261,15],[1260,16,1261,16],[1253,1,1253,3],[1253,4,1253,5],[1253,8,1253,9],[1253,12,1253,13],[1259,2,1259,5],[1259,6,1259,9],[1259,10,1259,13],[1249,14,1253,17],[1250,4,1250,5],[1250,8,1250,9],[1250,12,1250,13],[1251,4,1251,5],[1251,8,1251,9],[1251,12,1251,13],[1252,4,1252,5],[1252,8,1252,9],[1252,12,1252,13],[1248,4,1248,5],[1248,8,1248,9],[1248,12,1248,13],[1249,4,1249,5],[1249,8,1249,9],[1249,12,1249,13],[1246,4,1246,5],[1246,8,1246,9],[1246,12,1246,13],[1247,4,1247,5],[1247,8,1247,9],[1247,12,1247,13],[1244,4,1244,5],[1244,8,1244,9],[1244,12,1244,13],[1245,4,1245,5],[1245,8,1245,9],[1245,12,1245,13],[1242,14,1243,14],[1242,15,1243,15],[1242,16,1243,16],[1242,17,1243,17],[1243,4,1243,5],[1243,8,1243,9],[1243,12,1243,13],[1241,2,1241,5],[1241,6,1241,9],[1241,10,1241,13],[1242,4,1242,5],[1242,8,1242,9],[1242,12,1242,13],[1234,4,1234,5],[1234,8,1234,9],[1234,12,1234,13],[1235,1,1235,3],[1235,4,1235,5],[1235,8,1235,9],[1235,12,1235,13],[1231,4,1231,5],[1231,8,1231,9],[1231,12,1231,13],[1231,14,1235,17],[1232,4,1232,5],[1232,8,1232,9],[1232,12,1232,13],[1233,4,1233,5],[1233,8,1233,9],[1233,12,1233,13],[1229,4,1229,5],[1229,8,1229,9],[1229,12,1229,13],[1230,4,1230,5],[1230,8,1230,9],[1230,12,1230,13],[1227,4,1227,5],[1227,8,1227,9],[1227,12,1227,13],[1228,4,1228,5],[1228,8,1228,9],[1228,12,1228,13],[1224,17,1225,17],[1225,4,1225,5],[1225,8,1225,9],[1225,12,1225,13],[1226,4,1226,5],[1226,8,1226,9],[1226,12,1226,13],[1224,4,1224,5],[1224,8,1224,9],[1224,12,1224,13],[1224,14,1225,14],[1224,15,1225,15],[1224,16,1225,16],[1217,1,1217,3],[1217,4,1217,5],[1217,8,1217,9],[1217,12,1217,13],[1223,2,1223,5],[1223,6,1223,9],[1223,10,1223,13],[1213,14,1217,17],[1214,4,1214,5],[1214,8,1214,9],[1214,12,1214,13],[1215,4,1215,5],[1215,8,1215,9],[1215,12,1215,13],[1216,4,1216,5],[1216,8,1216,9],[1216,12,1216,13],[1212,4,1212,5],[1212,8,1212,9],[1212,12,1212,13],[1213,4,1213,5],[1213,8,1213,9],[1213,12,1213,13],[1210,4,1210,5],[1210,8,1210,9],[1210,12,1210,13],[1211,4,1211,5],[1211,8,1211,9],[1211,12,1211,13],[1208,4,1208,5],[1208,8,1208,9],[1208,12,1208,13],[1209,4,1209,5],[1209,8,1209,9],[1209,12,1209,13],[1206,14,1207,14],[1206,15,1207,15],[1206,16,1207,16],[1206,17,1207,17],[1207,4,1207,5],[1207,8,1207,9],[1207,12,1207,13],[1205,2,1205,5],[1205,6,1205,9],[1205,10,1205,13],[1206,4,1206,5],[1206,8,1206,9],[1206,12,1206,13],[1198,4,1198,5],[1198,8,1198,9],[1198,12,1198,13],[1199,1,1199,3],[1199,4,1199,5],[1199,8,1199,9],[1199,12,1199,13],[1195,4,1195,5],[1195,8,1195,9],[1195,12,1195,13],[1195,14,1199,17],[1196,4,1196,5],[1196,8,1196,9],[1196,12,1196,13],[1197,4,1197,5],[1197,8,1197,9],[1197,12,1197,13],[1193,4,1193,5],[1193,8,1193,9],[1193,12,1193,13],[1194,4,1194,5],[1194,8,1194,9],[1194,12,1194,13],[1191,4,1191,5],[1191,8,1191,9],[1191,12,1191,13],[1192,4,1192,5],[1192,8,1192,9],[1192,12,1192,13],[1188,17,1189,17],[1189,4,1189,5],[1189,8,1189,9],[1189,12,1189,13],[1190,4,1190,5],[1190,8,1190,9],[1190,12,1190,13],[1188,4,1188,5],[1188,8,1188,9],[1188,12,1188,13],[1188,14,1189,14],[1188,15,1189,15],[1188,16,1189,16],[1181,1,1181,3],[1181,4,1181,5],[1181,8,1181,9],[1181,12,1181,13],[1187,2,1187,5],[1187,6,1187,9],[1187,10,1187,13],[1177,14,1181,17],[1178,4,1178,5],[1178,8,1178,9],[1178,12,1178,13],[1179,4,1179,5],[1179,8,1179,9],[1179,12,1179,13],[1180,4,1180,5],[1180,8,1180,9],[1180,12,1180,13],[1176,4,1176,5],[1176,8,1176,9],[1176,12,1176,13],[1177,4,1177,5],[1177,8,1177,9],[1177,12,1177,13],[1174,4,1174,5],[1174,8,1174,9],[1174,12,1174,13],[1175,4,1175,5],[1175,8,1175,9],[1175,12,1175,13],[1172,4,1172,5],[1172,8,1172,9],[1172,12,1172,13],[1173,4,1173,5],[1173,8,1173,9],[1173,12,1173,13],[1170,14,1171,14],[1170,15,1171,15],[1170,16,1171,16],[1170,17,1171,17],[1171,4,1171,5],[1171,8,1171,9],[1171,12,1171,13],[1169,2,1169,5],[1169,6,1169,9],[1169,10,1169,13],[1170,4,1170,5],[1170,8,1170,9],[1170,12,1170,13],[1162,4,1162,5],[1162,8,1162,9],[1162,12,1162,13],[1163,1,1163,3],[1163,4,1163,5],[1163,8,1163,9],[1163,12,1163,13],[1159,4,1159,5],[1159,8,1159,9],[1159,12,1159,13],[1159,14,1163,17],[1160,4,1160,5],[1160,8,1160,9],[1160,12,1160,13],[1161,4,1161,5],[1161,8,1161,9],[1161,12,1161,13],[1157,4,1157,5],[1157,8,1157,9],[1157,12,1157,13],[1158,4,1158,5],[1158,8,1158,9],[1158,12,1158,13],[1155,4,1155,5],[1155,8,1155,9],[1155,12,1155,13],[1156,4,1156,5],[1156,8,1156,9],[1156,12,1156,13],[1152,17,1153,17],[1153,4,1153,5],[1153,8,1153,9],[1153,12,1153,13],[1154,4,1154,5],[1154,8,1154,9],[1154,12,1154,13],[1152,4,1152,5],[1152,8,1152,9],[1152,12,1152,13],[1152,14,1153,14],[1152,15,1153,15],[1152,16,1153,16],[1145,1,1145,3],[1145,4,1145,5],[1145,8,1145,9],[1145,12,1145,13],[1151,2,1151,5],[1151,6,1151,9],[1151,10,1151,13],[1141,14,1145,17],[1142,4,1142,5],[1142,8,1142,9],[1142,12,1142,13],[1143,4,1143,5],[1143,8,1143,9],[1143,12,1143,13],[1144,4,1144,5],[1144,8,1144,9],[1144,12,1144,13],[1140,4,1140,5],[1140,8,1140,9],[1140,12,1140,13],[1141,4,1141,5],[1141,8,1141,9],[1141,12,1141,13],[1138,4,1138,5],[1138,8,1138,9],[1138,12,1138,13],[1139,4,1139,5],[1139,8,1139,9],[1139,12,1139,13],[1136,4,1136,5],[1136,8,1136,9],[1136,12,1136,13],[1137,4,1137,5],[1137,8,1137,9],[1137,12,1137,13],[1134,14,1135,14],[1134,15,1135,15],[1134,16,1135,16],[1134,17,1135,17],[1135,4,1135,5],[1135,8,1135,9],[1135,12,1135,13],[1133,2,1133,5],[1133,6,1133,9],[1133,10,1133,13],[1134,4,1134,5],[1134,8,1134,9],[1134,12,1134,13],[1126,4,1126,5],[1126,8,1126,9],[1126,12,1126,13],[1127,1,1127,3],[1127,4,1127,5],[1127,8,1127,9],[1127,12,1127,13],[1123,4,1123,5],[1123,8,1123,9],[1123,12,1123,13],[1123,14,1127,17],[1124,4,1124,5],[1124,8,1124,9],[1124,12,1124,13],[1125,4,1125,5],[1125,8,1125,9],[1125,12,1125,13],[1121,4,1121,5],[1121,8,1121,9],[1121,12,1121,13],[1122,4,1122,5],[1122,8,1122,9],[1122,12,1122,13],[1119,4,1119,5],[1119,8,1119,9],[1119,12,1119,13],[1120,4,1120,5],[1120,8,1120,9],[1120,12,1120,13],[1116,17,1117,17],[1117,4,1117,5],[1117,8,1117,9],[1117,12,1117,13],[1118,4,1118,5],[1118,8,1118,9],[1118,12,1118,13],[1116,4,1116,5],[1116,8,1116,9],[1116,12,1116,13],[1116,14,1117,14],[1116,15,1117,15],[1116,16,1117,16],[1109,1,1109,3],[1109,4,1109,5],[1109,8,1109,9],[1109,12,1109,13],[1115,2,1115,5],[1115,6,1115,9],[1115,10,1115,13],[1105,14,1109,17],[1106,4,1106,5],[1106,8,1106,9],[1106,12,1106,13],[1107,4,1107,5],[1107,8,1107,9],[1107,12,1107,13],[1108,4,1108,5],[1108,8,1108,9],[1108,12,1108,13],[1104,4,1104,5],[1104,8,1104,9],[1104,12,1104,13],[1105,4,1105,5],[1105,8,1105,9],[1105,12,1105,13],[1102,4,1102,5],[1102,8,1102,9],[1102,12,1102,13],[1103,4,1103,5],[1103,8,1103,9],[1103,12,1103,13],[1100,4,1100,5],[1100,8,1100,9],[1100,12,1100,13],[1101,4,1101,5],[1101,8,1101,9],[1101,12,1101,13],[1098,14,1099,14],[1098,15,1099,15],[1098,16,1099,16],[1098,17,1099,17],[1099,4,1099,5],[1099,8,1099,9],[1099,12,1099,13],[1097,2,1097,5],[1097,6,1097,9],[1097,10,1097,13],[1098,4,1098,5],[1098,8,1098,9],[1098,12,1098,13],[1090,4,1090,5],[1090,8,1090,9],[1090,12,1090,13],[1091,1,1091,3],[1091,4,1091,5],[1091,8,1091,9],[1091,12,1091,13],[1087,4,1087,5],[1087,8,1087,9],[1087,12,1087,13],[1087,14,1091,17],[1088,4,1088,5],[1088,8,1088,9],[1088,12,1088,13],[1089,4,1089,5],[1089,8,1089,9],[1089,12,1089,13],[1085,4,1085,5],[1085,8,1085,9],[1085,12,1085,13],[1086,4,1086,5],[1086,8,1086,9],[1086,12,1086,13],[1083,4,1083,5],[1083,8,1083,9],[1083,12,1083,13],[1084,4,1084,5],[1084,8,1084,9],[1084,12,1084,13],[1080,17,1081,17],[1081,4,1081,5],[1081,8,1081,9],[1081,12,1081,13],[1082,4,1082,5],[1082,8,1082,9],[1082,12,1082,13],[1080,4,1080,5],[1080,8,1080,9],[1080,12,1080,13],[1080,14,1081,14],[1080,15,1081,15],[1080,16,1081,16],[1067,1,1067,3],[1067,4,1067,5],[1067,8,1067,9],[1067,12,1067,13],[1073,0,1075,18],[1079,2,1079,5],[1079,6,1079,9],[1079,10,1079,13],[1063,14,1067,17],[1064,4,1064,5],[1064,8,1064,9],[1064,12,1064,13],[1065,4,1065,5],[1065,8,1065,9],[1065,12,1065,13],[1066,4,1066,5],[1066,8,1066,9],[1066,12,1066,13],[1062,4,1062,5],[1062,8,1062,9],[1062,12,1062,13],[1063,4,1063,5],[1063,8,1063,9],[1063,12,1063,13],[1060,4,1060,5],[1060,8,1060,9],[1060,12,1060,13],[1061,4,1061,5],[1061,8,1061,9],[1061,12,1061,13],[1058,4,1058,5],[1058,8,1058,9],[1058,12,1058,13],[1059,4,1059,5],[1059,8,1059,9],[1059,12,1059,13],[1056,14,1057,14],[1056,15,1057,15],[1056,16,1057,16],[1056,17,1057,17],[1057,4,1057,5],[1057,6,1057,7],[1057,8,1057,9],[1057,12,1057,13],[1055,2,1055,5],[1055,6,1055,9],[1055,10,1055,13],[1056,4,1056,5],[1056,8,1056,9],[1056,12,1056,13],[1047,4,1047,5],[1047,8,1047,9],[1047,12,1047,13],[1048,1,1048,3],[1048,4,1048,5],[1048,8,1048,9],[1048,12,1048,13],[1044,4,1044,5],[1044,8,1044,9],[1044,12,1044,13],[1044,14,1048,17],[1045,4,1045,5],[1045,8,1045,9],[1045,12,1045,13],[1046,4,1046,5],[1046,8,1046,9],[1046,12,1046,13],[1042,4,1042,5],[1042,8,1042,9],[1042,12,1042,13],[1043,4,1043,5],[1043,8,1043,9],[1043,12,1043,13],[1040,4,1040,5],[1040,8,1040,9],[1040,12,1040,13],[1041,4,1041,5],[1041,8,1041,9],[1041,12,1041,13],[1037,17,1038,17],[1038,4,1038,5],[1038,8,1038,9],[1038,12,1038,13],[1039,4,1039,5],[1039,8,1039,9],[1039,12,1039,13],[1037,4,1037,5],[1037,8,1037,9],[1037,12,1037,13],[1037,14,1038,14],[1037,15,1038,15],[1037,16,1038,16],[1029,1,1029,3],[1029,4,1029,5],[1029,8,1029,9],[1029,12,1029,13],[1036,2,1036,5],[1036,6,1036,9],[1036,10,1036,13],[1025,14,1029,17],[1026,4,1026,5],[1026,8,1026,9],[1026,12,1026,13],[1027,4,1027,5],[1027,8,1027,9],[1027,12,1027,13],[1028,4,1028,5],[1028,8,1028,9],[1028,12,1028,13],[1024,4,1024,5],[1024,8,1024,9],[1024,12,1024,13],[1025,4,1025,5],[1025,8,1025,9],[1025,12,1025,13],[1022,4,1022,5],[1022,8,1022,9],[1022,12,1022,13],[1023,4,1023,5],[1023,8,1023,9],[1023,12,1023,13],[1020,4,1020,5],[1020,8,1020,9],[1020,12,1020,13],[1021,4,1021,5],[1021,8,1021,9],[1021,12,1021,13],[1018,14,1019,14],[1018,15,1019,15],[1018,16,1019,16],[1018,17,1019,17],[1019,4,1019,5],[1019,8,1019,9],[1019,12,1019,13],[1017,2,1017,5],[1017,6,1017,9],[1017,10,1017,13],[1018,4,1018,5],[1018,8,1018,9],[1018,12,1018,13],[1009,4,1009,5],[1009,8,1009,9],[1009,12,1009,13],[1010,1,1010,3],[1010,4,1010,5],[1010,8,1010,9],[1010,12,1010,13],[1006,4,1006,5],[1006,8,1006,9],[1006,12,1006,13],[1006,14,1010,17],[1007,4,1007,5],[1007,8,1007,9],[1007,12,1007,13],[1008,4,1008,5],[1008,8,1008,9],[1008,12,1008,13],[1004,4,1004,5],[1004,8,1004,9],[1004,12,1004,13],[1005,4,1005,5],[1005,8,1005,9],[1005,12,1005,13],[1002,4,1002,5],[1002,8,1002,9],[1002,12,1002,13],[1003,4,1003,5],[1003,8,1003,9],[1003,12,1003,13],[999,17,1000,17],[1000,4,1000,5],[1000,8,1000,9],[1000,12,1000,13],[1001,4,1001,5],[1001,8,1001,9],[1001,12,1001,13],[999,4,999,5],[999,8,999,9],[999,12,999,13],[999,14,1000,14],[999,15,1000,15],[999,16,1000,16],[991,1,991,3],[991,4,991,5],[991,8,991,9],[991,12,991,13],[998,2,998,5]],"merged_total":2220,"flags":["merged_cut"]}
[null,null,"Ministério do Desenvolvimento Regional  - MDR"]
[null,null,"Companhia de Desenvolvimento dos Vales do São Francisco e do Parnaíba"]
["Gerência de Operação do PISF - Centro de Controle e Operação (AD / GOI / CCO)"]
[]
[{"$f":"[3]Mem_Calculo_VEICULOS!A5","v":"TERMO DE REFERÊNCIA PARA CONTRATAÇÃO DOS RECURSOS NECESSÁRIOS À OPERAÇÃO E MANUTENÇÃO DAS INFRAESTRUTURAS DO EIXO LESTE DO PISF - PROJETO DE INTEGRAÇÃO DO SÃO FRANCISCO COM AS BACIAS HIDROGRÁFICAS DO NORDESTE SETENTRIONAL"}]
[]
[]
["COMPOSIÇÃO DE PREÇO - EQUIPAMENTOS"]
[]
[]
[null,"COMPOSIÇÕES - EQUIPAMENTOS - CIVIL"]
[]
[]
[]
[null,{"$f":"ROUNDUP(E21/E36,0)","v":38},{"$nulls":4},{"$f":"ROUNDUP(I21/I36,0)","v":25},null,null,null,{"$f":"ROUNDUP(M21/M36,0)","v":17}]
[null,"CHP e CHI:"]
[null,null,"Pá Carregadeira 128hp (SINAPI 4262)",null,null,null,"Grupo Gerador 145/160 KVA (E9776)",null,null,null,"Betoneira 600l- 10kW- motor a gasolina (E9519)"]
[null,null,"Cód.Comp.","Índice","SINAPI/PE ",null,"Cód.Comp.","Índice","SICRO",null,null,"Índice","SICRO"]
[null,null,"SINAPI","SINAPI","4262 (128Hp/95,4Kw)",null,null,"SICRO","E9776",null,null,"SICRO","E9519(600l)"]
[null,"Mês Ref.",null,null,"2022-04-01",null,null,null,"2022-01-01",null,null,null,"2022-01-01"]
[null,"Aquisição",4262,1,720000,null,null,null,107062.0469,null,null,null,38762.335099999997]
[null,"Depreciação",5627,5.5999999999999999E-5,{"$f":"TRUNC(D22*$E$21,2)","v":40.32},null,null,null,5.3531000000000004,null,null,null,3.101]
[null,"Juros",5628,7.6000000000000001E-6,5.47,null,null,null,{"$f":"TRUNC(H23*$I$21,2)","v":0}]
[null,"Manutenção",5629,6.9999999999999994E-5,{"$f":"TRUNC(D24*$E$21,2)","v":50.4},null,null,null,3.8235999999999999,null,null,null,2.3256999999999999]
[null,"Mat.na Op.",5630,10.77,{"$f":"TRUNC(D25*E26,2)","v":73.77},null,null,null,{"$f":"TRUNC(H25*I26,2)","v":0}]
[null,"Óleo Diesel","I - 4221","I - 4221",6.85]
[null,"Operador ec",88301,1,33.33]
[null,"Oport.Capit.",{"$nulls":6},1.8874,null,null,null,0.71750000000000003]
[null,"Seg. e Imp."]
[null,"M.d.o"]
[null,"Operação",{"$nulls":6},107.5552,null,null,null,20.824999999999999]
[null,"CHP",null,null,{"$f":"E22+E23+E24+E25+E27","v":203.28999999999996},null,null,null,{"$f":"I22+I23+I24+I25+I27+I28+I30+I31","v":118.6193},null,null,null,{"$f":"M22+M23+M24+M25+M27+M28+M30+M31","v":26.969200000000001}]
[null,"CHI",null,null,{"$f":"E22+E23+E27","v":79.12},null,null,null,{"$f":"I22+I23+I27+I28+I30","v":7.2405000000000008},null,null,null,{"$f":"M22+M23+M27+M28+M30","v":3.8185000000000002}]
[null,"Horas Produtivas",null,{"$f":"($C$42*$D$42*$E$42)*30%","v":42},{"$f":"E32*D34","v":8538.1799999999985},null,null,{"$f":"($C$42*$D$42*$E$42)*20%","v":28},{"$f":"I32*H34","v":3321.3404},null,null,{"$f":"($C$42*$D$42*$E$42)*50%","v":70},{"$f":"M32*L34","v":1887.8440000000001}]
[null,"Horas Improdutivas",null,{"$f":"$C$43-D34","v":134},{"$f":"D35*E33","v":10602.08},null,null,{"$f":"$C$43-H34","v":148},{"$f":"H35*I33","v":1071.5940000000001},null,null,{"$f":"$C$43-L34","v":106},{"$f":"L35*M33","v":404.76100000000002}]
[null,"TOTAL HPM+HIM",null,null,{"$f":"E34+E35","v":19140.259999999998},null,null,null,{"$f":"I34+I35","v":4392.9344000000001},null,null,null,{"$f":"M34+M35","v":2292.605}]
[null,"Horas/dia","Dias/sem.","Dias/mês","Horas/mês"]
[null,24,7,30,{"$f":"D38*B38","v":720},"minimizado"]
[]
[null,"44 horas úteis semanais:",null,"Produtiva"]
[null,"hs/semana","semana","horas/dia","dias/sem.","horas/sem."]
[null,44,4,7,5,{"$f":"D42*E42","v":35}]
[null,"=>",{"$f":"B42*C42","v":176},"Total de horas úteis/mês"]
[]
[]
[]
[null,{"$f":"ROUNDUP(E53/E67,0)","v":37},{"$nulls":4},{"$f":"ROUNDUP(I53/I67,0)","v":40}]
[]
[null,null,"Bomba submersível - 3,6 KW (DNIT 9630)",null,null,null,"Lavadora de alta pressão, 10 hp (746)"]
[null,null,"Cód.Comp.","Índice","SICRO - DNIT",null,null,"Índice","SINAPI/PE "]
[null,null,"DNIT","DNIT","E9630",null,null,"SINAPI",746]
[null,"Mês Ref.",null,null,"2022-01-01",null,null,null,"2022-04-01"]
[null,"Aquisição","E9630",1,4479.8519999999999,null,null,746,2050]
[null,"Depreciação",null,null,0.3584,null,null,99829,0.14000000000000001]
[null,"Juros",{"$nulls":5},99830,0.01]
[null,"Manutenção",null,null,0.31359999999999999,null,null,99831,0.18]
[null,"Mat.na Op."]
[null,"Óleo Diesel"]
[null,"Operador ec"]
[null,"Oport.Capit.",null,null,8.2900000000000001E-2]
[null,"Seg. e Imp."]
[null,"M.d.o"]
[null,"CHP",null,null,{"$f":"E54+E55+E56+E57+E59+E60","v":0.7548999999999999},null,null,null,{"$f":"I54+I55+I56+I57+I59","v":0.33}]
[null,"CHI",null,null,{"$f":"E54+E55+E59+E60","v":0.44130000000000003},null,null,null,{"$f":"I54+I55+I59","v":0.15000000000000002}]
[null,"Horas Produtivas",null,{"$f":"($C$73*$D$73*$E$73)*100%","v":140},{"$f":"E63*D65","v":105.68599999999999},null,null,{"$f":"($C$73*$D$73*$E$73)*100%","v":140},{"$f":"I63*H65","v":46.2}]
[null,"Horas Improdutivas",null,{"$f":"$C$43-D65","v":36},{"$f":"D66*E64","v":15.886800000000001},null,null,{"$f":"$C$43-H65","v":36},{"$f":"H66*I64","v":5.4}]
[null,"TOTAL HPM+HIM",null,null,{"$f":"E65+E66","v":121.5728},null,null,null,{"$f":"I65+I66","v":51.6}]
[null,"Horas/dia","Dias/sem.","Dias/mês","Horas/mês"]
[null,24,7,30,{"$f":"D69*B69","v":720},"minimizado"]
[]
[null,"44 horas úteis semanais:",null,"Produtiva"]
[null,"hs/semana","semana","horas/dia","dias/sem.","horas/sem."]
[null,44,4,7,5,{"$f":"D73*E73","v":35}]
[null,"=>",{"$f":"B73*C73","v":176},"Total de horas úteis/mês"]
[]
[]
[]
[null,{"$f":"ROUNDUP(E84/E98,0)","v":10}]
[]
[null,null,"Motobomba Trash Autoescorvante (36503)"]
[null,null,"Cód.Comp.","Índice","SINAPI/PE "]
[null,null,"SINAPI","SINAPI",36503]
[null,"Mês Ref.",null,null,"2022-04-01"]
[null,"Aquisição",36503,1,4262.72]
[null,"Depreciação",7044,6.3999999999999997E-5,{"$f":"TRUNC(D85*$E$84,2)","v":0.27}]
[null,"Juros",7045,7.6000000000000001E-6,{"$f":"TRUNC(D86*$E$84,2)","v":0.03}]
[null,"Manutenção",7046,6.9999999999999994E-5,{"$f":"TRUNC(D87*$E$84,2)","v":0.28999999999999998}]
[null,"Mat.na Op.",7047,4.0599999999999996,{"$f":"TRUNC(D88*E89,2)","v":29.39}]
[null,"Gasolina comum","I - 4222","I - 4222",7.24]
[null,"Operador ec"]
[null,"Oport.Capit."]
[null,"Seg. e Imp."]
[null,"M.d.o"]
[null,"CHP",null,null,{"$f":"E85+E86+E87+E88+E90","v":29.98}]
[null,"CHI",null,null,{"$f":"E85+E86+E90","v":0.30000000000000004}]
[null,"Horas Produtivas",null,{"$f":"($C$105*$D$105*$E$105)*10%","v":14},{"$f":"E94*D96","v":419.72}]
[null,"Horas Improdutivas",null,{"$f":"$C$43-D96","v":162},{"$f":"D97*E95","v":48.600000000000009}]
[null,"TOTAL HPM+HIM",null,null,{"$f":"E96+E97","v":468.32000000000005}]
[]
[null,"Horas/dia","Dias/sem.","Dias/mês","Horas/mês"]
[null,24,7,30,{"$f":"D101*B101","v":720},"minimizado"]
[]
[null,"44 horas úteis semanais:",null,"Produtiva"]
[null,"hs/semana","semana","horas/dia","dias/sem.","horas/sem."]
[null,44,4,7,5,{"$f":"D105*E105","v":35}]
[null,"=>",{"$f":"B105*C105","v":176},"Total de horas úteis/mês"]
[]
[]
[]
[null,{"$f":"ROUNDUP(E116/E131,0)","v":0},{"$nulls":4},{"$f":"ROUNDUP(I116/I131,0)","v":35},null,null,null,{"$f":"ROUNDUP(M116/M131,0)","v":39}]
[]
[null,null,"Escavadeira, caçamba 173 hp (SICRO E9017)",null,null,null,"Grupo gerador 310/340 kva (E9778)",null,null,null,"Serra circular, 5hp (E9535)"]
[null,null,"Cód.Comp.","Índice","SICRO",null,"Cód.Comp.","Índice","SICRO",null,null,"Índice","SICRO - DNIT"]
[null,null,"SICRO","SICRO","E9017",null,null,"SICRO","E9778",null,null,"SICRO - DNIT","E9535"]
[null,"Mês Ref.",null,null,"01/041/2022",null,null,null,"2022-01-01",null,null,null,"2022-01-01"]
[null,"Aquisição",{"$nulls":6},203207.44190000001,null,null,"E9535",5261.9063999999998]
[null,"Depreciação",{"$nulls":6},10.160399999999999,null,null,null,0.47360000000000002]
[null,"Juros",{"$nulls":6},{"$f":"TRUNC(H118*$I$116,2)","v":0},null,null,null,{"$f":"TRUNC(L118*$M$21,2)","v":0}]
[null,"Manutenção",{"$nulls":6},7.2573999999999996,null,null,null,0.2631]
[null,"Mat.na Op.",{"$nulls":6},{"$f":"H120*I121","v":0},null,null,null,{"$f":"TRUNC(L120*$M$26,2)","v":0}]
[null,"Óleo Diesel"]
[null,"Operador ec",{"$nulls":9},0]
[null,"Oport.Capit.",{"$nulls":6},3.5823,null,null,null,9.74E-2]
[null,"Seg. e Imp."]
[null,"M.d.o"]
[null,"Operação",{"$nulls":6},241.072]
[null,"CHP",null,null,178.24,null,null,null,{"$f":"I117+I118+I119+I120+I122+I123+I125+I126","v":262.07209999999998},null,null,null,{"$f":"M117+M118+M119+M120+M122+M123+M125","v":0.83410000000000006}]
[null,"CHI",null,null,89.32,null,null,null,{"$f":"I117+I118+I122+I123+I125","v":13.742699999999999},null,null,null,{"$f":"M117+M118+M122+M125+M123","v":0.57100000000000006}]
[null,"Horas Produtivas",null,{"$f":"($C$138*$D$138*$E$138)*30%","v":42},{"$f":"E127*D129","v":7486.08},null,null,{"$f":"($C$138*$D$138*$E$138)*10%","v":14},{"$f":"I127*H129","v":3669.0093999999999},null,null,{"$f":"($C$138*$D$138*$E$138)*100%","v":140},{"$f":"M127*L129","v":116.77400000000002}]
[null,"Horas Improdutivas",null,{"$f":"$C$43-D129","v":134},{"$f":"D130*E128","v":11968.88},null,null,{"$f":"$C$43-H129","v":162},{"$f":"H130*I128","v":2226.3173999999999},null,null,{"$f":"$C$43-L129","v":36},{"$f":"L130*M128","v":20.556000000000001}]
[null,"TOTAL HPM+HIM",null,null,{"$f":"E129+E130","v":19454.96},null,null,null,{"$f":"I129+I130","v":5895.3267999999998},null,null,null,{"$f":"M129+M130","v":137.33000000000001}]
[]
[null,"Horas/dia","Dias/sem.","Dias/mês","Horas/mês"]
[null,24,7,30,{"$f":"D134*B134","v":720},"minimizado"]
[]
[null,"44 horas úteis semanais:",null,"Produtiva"]
[null,"hs/semana","semana","horas/dia","dias/sem.","horas/sem."]
[null,44,4,7,5,{"$f":"D138*E138","v":35}]
[null,"=>",{"$f":"B138*C138","v":176},"Total de horas úteis/mês"]
[]
[]
[]
[null,"CRITERIO RECEITA FEDERAL",null,"3.1.36",null,null,"3.1.38",{"$nulls":4},"3.1.39"]
[null,"CHP e CHI:",null,"Máquina de solda, 250A (40403); Lixadeira elétrica, 1400 W (13192); Máquina para corte, 10 Cv (14619)"]
[]
[null,null,"Cód.Comp.","Índice","SINAPI/PE (AS)",null,"Cód.Comp.","Índice","SINAPI/PE (AS)",null,null,"Índice","SINAPI/PE (AS)",null,"1º.Pag.","ATUAL","Dif.","+ ou -"]
[null,null,"SINAPI","SINAPI",null,null,null,"SINAPI",null,null,null,"SINAPI"]
[null,"Mês Ref.",null,null,"2021-10-01",null,null,null,"2021-10-01",null,null,null,"2021-10-01",null,"2021-01-01","2021-03-01"]
[null,"Aquisição",40403,null,606.66999999999996,null,13192,null,4239.03,null,14619,null,11982.58]
[null,"Depreciação (RF)",null,null,{"$f":"TRUNC(D150*$E$21,2)","v":0},null,null,null,{"$f":"TRUNC(H150*$I$21,2)","v":0},null,null,null,{"$f":"TRUNC(L150*$M$21,2)","v":0}]
[null,"Juros",null,null,0,null,null,null,{"$f":"TRUNC(H151*$I$21,2)","v":0},null,null,null,{"$f":"TRUNC(L151*$M$21,2)","v":0}]
[null,"Manutenção",null,null,{"$f":"TRUNC(D152*$E$21,2)","v":0},null,null,null,{"$f":"TRUNC(H152*$I$21,2)","v":0},null,null,null,{"$f":"TRUNC(L152*$M$21,2)","v":0}]
[null,"Mat.na Op.",null,null,{"$f":"TRUNC(D153*E154,2)","v":0},null,null,null,{"$f":"H153*I154","v":0},null,null,null,{"$f":"TRUNC(L153*$M$26,2)","v":0}]
[null,"Óleo Diesel","I - 4221","I - 4221",null,null,null,"I - 4221",5.58,null,null,"I - 4221",5.58]
[null,"Operador ec",88301,1,null,null,null,0,null,null,null,0]
[null,"Oport.Capit."]
[null,"Seg. e Imp."]
[null,"M.d.o"]
[null,"CHP",null,"%CHP",{"$f":"E150+E151+E152+E153+E155","v":0},null,null,"%CHP",{"$f":"I150+I151+I152+I153+I155","v":0},null,null,"%CHP",{"$f":"M150+M151+M152+M153+M155","v":0}]
[null,"CHI",null,{"$f":"E160/E159","v":{"$error":"#DIV/0!"}},{"$f":"E150+E151+E155","v":0},null,null,{"$f":"I160/I159","v":{"$error":"#DIV/0!"}},{"$f":"I150+I151+I155","v":0},null,null,{"$f":"M160/M159","v":{"$error":"#DIV/0!"}},{"$f":"M150+M151+M155","v":0}]
[null,"CHS",null,{"$f":"E161/E159","v":{"$error":"#DIV/0!"}},{"$f":"E150+E151+(E155*(1/3))","v":0},null,null,{"$f":"I161/I159","v":{"$error":"#DIV/0!"}},{"$f":"I150+I151+(I155*(1/3))","v":0},null,null,{"$f":"M161/M159","v":{"$error":"#DIV/0!"}},{"$f":"M150+M151+(M155*(1/3))","v":0}]
[null,"Horas Produtivas",null,{"$f":"6*5*4","v":120},{"$f":"E159*$D$34","v":0},null,null,{"$f":"2*5*4","v":40},{"$f":"I159*H162","v":0},null,null,{"$f":"4*5*4","v":80},{"$f":"M159*L162","v":0}]
[null,"Horas Improdutivas",null,{"$f":"$C$43-D162","v":56},{"$f":"$D$35*E160","v":0},null,null,{"$f":"$C$43-H162","v":136},{"$f":"I160*H163","v":0},null,null,{"$f":"$C$43-L162","v":96},{"$f":"M160*L163","v":0}]
[null,"Horas de sobreaviso(1/3)",null,{"$f":"$E$38-D162-D163","v":544},{"$f":"(E150+E151+(E155*(1/3)*(1/3)))*#REF!","v":{"$error":"#REF!"}},null,null,{"$f":"$E$38-H162-H163","v":544},{"$f":"(I150+I151+(I155*(1/3)*(1/3)))*H164","v":0},null,null,{"$f":"$E$38-L162-L163","v":544},{"$f":"(M150+M151+(M155*(1/3)*(1/3)))*L164","v":0}]
[null,"TOTAL HPM+HIM",null,null,{"$f":"E162+E163+E164","v":{"$error":"#REF!"}},null,null,null,{"$f":"I162+I163+I164","v":0},null,null,null,{"$f":"M162+M163+M164","v":0}]
[null,null,"Preço Base Codevasf:"]
[null,"Horas/dia","Dias/sem.","Dias/mês","Horas/mês"]
[null,24,7,28,{"$f":"D168*B168","v":672},"minimizado"]
[{"$nulls":8},"Máquina de solda",null,null,null,"Lixadeira elétrica",null,null,"Máquina para corte"]
[null,"44 horas úteis semanais:",null,"Produtiva",{"$nulls":4},"Produtiva","Improdutiva",null,"Sobreaviso","Produtiva","Improdutiva","Sobreaviso","Produtiva","Improdutiva","Sobreaviso"]
[null,"hs/semana","semana","horas/dia","dias/sem.","horas/sem.",null,"semanas","horas/mês","horas/mês",null,"horas/mês","horas/mês","horas/mês","horas/mês","horas/mês","horas/mês","horas/mês"]
[null,44,4,6,5,{"$f":"D172*E172","v":30},null,4,{"$f":"D162","v":120},{"$f":"D163","v":56},null,{"$f":"D164","v":544},{"$f":"H162","v":40},{"$f":"H163","v":136},{"$f":"H164","v":544},{"$f":"L162","v":80},{"$f":"L163","v":96},{"$f":"L164","v":544}]
[null,"=>",{"$f":"B172*C172","v":176},"Total de horas úteis/mês",null,null,null,"-120","=>",56,null,{"$f":"L172+J172+I172","v":720},null,null,{"$f":"O172+N172+M172","v":720},null,null,{"$f":"R172+Q172+P172","v":720}]
[]
[]
[]
[null,{"$f":"ROUNDUP(E183/E197,0)","v":43},{"$nulls":8},{"$f":"ROUNDUP(M183/M197,0)","v":55}]
[]
[null,null,"Martele rompedor, 33 kg (40703)",{"$nulls":7},"Minicarregadeira, 47 hp (37514)"]
[null,null,"Cód.Comp.","Índice","SINAPI/PE (AS)",{"$nulls":6},"Índice","SINAPI/PE "]
[null,null,"SINAPI","SINAPI",40703,{"$nulls":6},"SINAPI",37514]
[null,"Mês Ref.",null,null,"2022-04-01",{"$nulls":7},"2022-04-01"]
[null,"Aquisição",40703,1,7700,{"$nulls":5},37514,1,400000]
[null,"Depreciação",102270,6.3999999999999997E-5,{"$f":"TRUNC(D184*$E$183,2)","v":0.49},{"$nulls":5},90688,8.0000000000000007E-5,{"$f":"TRUNC(L184*$M$183,2)","v":32}]
[null,"Juros",102271,7.5000000000000002E-6,{"$f":"TRUNC(D185*$E$183,2)","v":0.05},{"$nulls":5},90689,8.1000000000000004E-6,{"$f":"TRUNC(L185*$M$183,2)","v":3.24}]
[null,"Manutenção",102272,8.0000000000000007E-5,{"$f":"TRUNC(D186*$E$183,2)","v":0.61},{"$nulls":5},90690,1E-4,{"$f":"TRUNC(L186*$M$183,2)","v":40}]
[null,"Mat.na Op.",{"$nulls":8},90691,6.66,{"$f":"TRUNC(L187*$M$26,2)","v":0}]
[null,"Energia elétrica (kW)",{"$nulls":8},4221,1,6.85]
[null,"Operador ec"]
[null,"Oport.Capit."]
[null,"Seg. e Imp."]
[null,"M.d.o"]
[null,"CHP",null,null,{"$f":"E184+E185+E186+E187+E189","v":1.1499999999999999},{"$nulls":7},{"$f":"M184+M185+M186+M187+M189","v":75.240000000000009}]
[null,"CHI",null,null,{"$f":"E184+E185+E189","v":0.54},{"$nulls":7},{"$f":"M184+M185+M189","v":35.24}]
[null,"Horas Produtivas",null,{"$f":"($C$203*$D$203*$E$203)*100%","v":140},{"$f":"E193*D195","v":161},{"$nulls":6},{"$f":"($C$203*$D$203*$E$203)*20%","v":28},{"$f":"M193*L195","v":2106.7200000000003}]
[null,"Horas Improdutivas",null,{"$f":"$C$43-D195","v":36},{"$f":"D196*E194","v":19.440000000000001},{"$nulls":6},{"$f":"$C$43-L195","v":148},{"$f":"L196*M194","v":5215.5200000000004}]
[null,"TOTAL HPM+HIM",null,null,{"$f":"E195+E196","v":180.44},{"$nulls":7},{"$f":"M195+M196","v":7322.2400000000007}]
[null,"Horas/dia","Dias/sem.","Dias/mês","Horas/mês"]
[null,24,7,30,{"$f":"D199*B199","v":720},"minimizado"]
[]
[null,"44 horas úteis semanais:",null,"Produtiva"]
[null,"hs/semana","semana","horas/dia","dias/sem.","horas/sem."]
[null,44,4,7,5,{"$f":"D203*E203","v":35}]
[null,"=>",{"$f":"B203*C203","v":176},"Total de horas úteis/mês"]
[]
[]
[]
[null,{"$f":"ROUNDUP(E214/E228,0)","v":51},{"$nulls":4},{"$f":"ROUNDUP(I214/I228,0)","v":43}]
[]
[null,null,"Motoniveladora, 171 hp (13227)",null,null,null,"Perfuratriz, 18 kg (11651)"]
[null,null,"Cód.Comp.","Índice","SINAPI/PE ",null,"Cód.Comp.","Índice","SINAPI/PE (AS)"]
[null,null,"SINAPI",null,13227,null,null,null,11651]
[null,"Mês Ref.",null,null,"2022-04-01",null,null,null,"2022-04-01"]
[null,"Aquisição",13227,1,1615412.11,null,11651,1,12793.74]
[null,"Depreciação",89228,4.0000000000000003E-5,{"$f":"TRUNC(D215*$E$214,2)","v":64.61},null,95617,6.3999999999999997E-5,{"$f":"TRUNC(H215*$I$214,2)","v":0.81}]
[null,"Juros",89229,7.1999999999999997E-6,{"$f":"TRUNC(D216*$E$214,2)","v":11.63},null,95618,7.6000000000000001E-6,{"$f":"TRUNC(H216*$I$214,2)","v":0.09}]
[null,"Manutenção",5779,6.4300000000000004E-5,103.87,null,95619,8.0000000000000007E-5,{"$f":"TRUNC(H217*$I$214,2)","v":1.02}]
[null,"Mat.na Op.",53849,13.99,{"$f":"TRUNC(D218*E219,2)","v":95.83},null,null,null,{"$f":"TRUNC(H218*$M$26,2)","v":0}]
[null,"Óleo Diesel","I - 4221","I - 4221",6.85]
[null,"Operador ec",88300,1,41.29]
[null,"Oport.Capit."]
[null,"Seg. e Imp."]
[null,"M.d.o"]
[null,"CHP",null,null,{"$f":"E215+E216+E217+E218+E220","v":317.23},null,null,null,{"$f":"I215+I216+I217+I218+I220","v":1.92}]
[null,"CHI",null,null,{"$f":"E215+E216+E220","v":117.53},null,null,null,{"$f":"I215+I216+I220","v":0.9}]
[null,"Horas Produtivas",null,{"$f":"($C$234*$D$234*$E$234)*40%","v":56},{"$f":"E224*D226","v":17764.88},null,null,{"$f":"($C$234*$D$234*$E$234)*100%","v":140},{"$f":"I224*H226","v":268.8}]
[null,"Horas Improdutivas",null,{"$f":"$C$43-D226","v":120},{"$f":"D227*E225","v":14103.6},null,null,{"$f":"$C$43-H226","v":36},{"$f":"H227*I225","v":32.4}]
[null,"TOTAL HPM+HIM",null,null,{"$f":"E226+E227","v":31868.480000000003},null,null,null,{"$f":"I226+I227","v":301.2}]
[null,"Horas/dia","Dias/sem.","Dias/mês","Horas/mês"]
[null,24,7,30,{"$f":"D230*B230","v":720},"minimizado"]
[]
[null,"44 horas úteis semanais:",null,"Produtiva"]
[null,"hs/semana","semana","horas/dia","dias/sem.","horas/sem."]
[null,44,4,7,5,{"$f":"D234*E234","v":35}]
[null,"=>",{"$f":"B234*C234","v":176},"Total de horas úteis/mês"]
[]
[]
[]
[null,{"$f":"ROUNDUP(E245/E260,0)","v":5}]
[]
[null,null,"Motoserra - 2,30 kW (DNIT E9585)"]
[null,null,"Cód.Comp.","Índice","DNIT"]
[null,null,"DNIT","DNIT"]
[null,"Mês Ref.",null,null,"2022-01-01"]
[null,"Aquisição",null,null,1221.7498000000001]
[null,"Depreciação",null,null,0.9163]
[null,"Juros"]
[null,"Manutenção",null,null,0.9163]
[null,"Operação",null,null,4.7897999999999996]
[null,"Mat.na Op."]
[null,"Óleo Diesel"]
[null,"Operador ec"]
[null,"Oport.Capit.",null,null,0.12559999999999999]
[null,"Seg. e Imp."]
[null,"M.d.o"]
[null,"CHP",null,null,{"$f":"E246+E247+E248+E250+E253+E249","v":6.7479999999999993}]
[null,"CHI",null,null,{"$f":"E246+E247+E252+E253","v":1.0419}]
[null,"Horas Produtivas",null,{"$f":"($C$266*$D$266*$E$266)*10%","v":14},{"$f":"E256*D258","v":94.471999999999994}]
[null,"Horas Improdutivas",null,{"$f":"$C$43-D258","v":162},{"$f":"D259*E257","v":168.7878}]
[null,"TOTAL HPM+HIM",null,null,{"$f":"E258+E259","v":263.25979999999998}]
[null,"Horas/dia","Dias/sem.","Dias/mês","Horas/mês"]
[null,24,7,30,{"$f":"D262*B262","v":720},"minimizado"]
[]
[null,"44 horas úteis semanais:",null,"Produtiva"]
[null,"hs/semana","semana","horas/dia","dias/sem.","horas/sem."]
[null,44,4,7,5,{"$f":"D266*E266","v":35}]
[null,"=>",{"$f":"B266*C266","v":176},"Total de horas úteis/mês"]
[]
[]
[]
[]
[]
[null,{"$f":"ROUNDUP(E279/E294,0)","v":8}]
[]
[null,null,"Roçadeira costal ,32 cc ( DNIT E9089)"]
[null,null,"Cód.Comp.","Índice","DNIT"]
[null,null,"DNIT","DNIT","E9089"]
[null,"Mês Ref.",null,null,"2022-01-01"]
[null,"Aquisição","E9089",null,2592.4348]
[null,"Depreciação",null,null,0.38890000000000002]
[null,"Juros"]
[null,"Operação",null,null,9.1630000000000003]
[null,"Manutenção",null,null,0.30249999999999999]
[null,"Mat.na Op."]
[null,"Óleo Diesel"]
[null,"Operador ec"]
[null,"Oport.Capit.",null,null,5.33E-2]
[null,"Seg. e Imp."]
[null,"M.d.o"]
[null,"CHP",null,null,{"$f":"E280+E281+E283+E284+E286+E287+E288+E282","v":9.9077000000000002}]
[null,"CHI",null,null,{"$f":"E280+E281+E286+E287+E288","v":0.44220000000000004}]
[null,"Horas Produtivas",null,{"$f":"($C$301*$D$301*$E$301)*20%","v":28},{"$f":"E290*D292","v":277.41559999999998}]
[null,"Horas Improdutivas",null,{"$f":"$C$43-D292","v":148},{"$f":"D293*E291","v":65.445599999999999}]
[null,"TOTAL HPM+HIM",null,null,{"$f":"E292+E293","v":342.8612}]
[]
[null,"Horas/dia","Dias/sem.","Dias/mês","Horas/mês"]
[null,24,7,30,{"$f":"D297*B297","v":720},"minimizado"]
[]
[null,"44 horas úteis semanais:",null,"Produtiva"]
[null,"hs/semana","semana","horas/dia","dias/sem.","horas/sem."]
[null,44,4,7,5,{"$f":"D301*E301","v":35}]
[null,"=>",{"$f":"B301*C301","v":176},"Total de horas úteis/mês"]
[]
[]
[]
[]
[null,null,null,"3.1.55",null,null,"3.1.56",{"$nulls":4},"3.1.57"]
[null,"CHP e CHI:",null,"Motor a diesel, 4,7 CV (39628); Vibrador de imersão, ponteira 35 mm (39399); Vibrador de imersão, ponteira 45 mm (39400)"]
[]
[null,null,"Cód.Comp.","Índice","SINAPI/PE (AS)",null,"Cód.Comp.","Índice","SINAPI/PE (AS)",null,null,"Índice","SINAPI/PE (AS)",null,"1º.Pag.","ATUAL","Dif.","+ ou -"]
[null,null,"SINAPI","SINAPI",39628,null,null,"SINAPI",39399,null,null,"SINAPI",39400]
[null,"Mês Ref.",null,null,"2021-10-01",null,null,null,"2021-10-01",null,null,null,"2021-10-01",null,"2021-01-01","2021-03-01"]
[null,"Aquisição",39628,1,3685.15,null,39399,1,1200.82,null,39400,1,1305.24]
[null,"Depreciação",null,null,{"$f":"TRUNC(D314*$E$21,2)","v":0},null,null,null,{"$f":"TRUNC(H314*$I$21,2)","v":0},null,null,null,{"$f":"TRUNC(L314*$M$21,2)","v":0}]
[null,"Juros",null,null,0,null,null,null,{"$f":"TRUNC(H315*$I$21,2)","v":0},null,null,null,{"$f":"TRUNC(L315*$M$21,2)","v":0}]
[null,"Manutenção",null,null,{"$f":"TRUNC(D316*$E$21,2)","v":0},null,null,null,0,null,null,null,{"$f":"TRUNC(L316*$M$21,2)","v":0}]
[null,"Mat.na Op.",null,null,{"$f":"TRUNC(D317*E318,2)","v":0},null,null,null,{"$f":"H317*I318","v":0},null,null,null,{"$f":"TRUNC(L317*$M$26,2)","v":0}]
[null,"Óleo Diesel",{"$nulls":12},3.87,4.08,{"$f":"P318/E318-1","v":{"$error":"#DIV/0!"}},"+"]
[null,"Operador ec",{"$nulls":12},36.11,36.11,{"$f":"P319/E319-1","v":{"$error":"#DIV/0!"}},"+"]
[null,"Oport.Capit."]
[null,"Seg. e Imp."]
[null,"M.d.o"]
[null,"CHP",null,"%CHP",{"$f":"E314+E315+E316+E317+E319","v":0},null,null,"%CHP",{"$f":"I314+I315+I316+I317+I319","v":0},null,null,"%CHP",{"$f":"M314+M315+M316+M317+M319","v":0}]
[null,"CHI",null,{"$f":"E324/E323","v":{"$error":"#DIV/0!"}},{"$f":"E314+E315+E319","v":0},null,null,{"$f":"I324/I323","v":{"$error":"#DIV/0!"}},{"$f":"I314+I315+I319","v":0},null,null,{"$f":"M324/M323","v":{"$error":"#DIV/0!"}},{"$f":"M314+M315+M319","v":0}]
[null,"CHS",null,{"$f":"E325/E323","v":{"$error":"#DIV/0!"}},{"$f":"E314+E315+(E319*(1/3))","v":0},null,null,{"$f":"I325/I323","v":{"$error":"#DIV/0!"}},{"$f":"I314+I315+(I319*(1/3))","v":0},null,null,{"$f":"M325/M323","v":{"$error":"#DIV/0!"}},{"$f":"M314+M315+(M319*(1/3))","v":0},null,"Observação: Os operadores da betoneira e do grupo gerador foram contratados a parte no grupo de contratação de mão-de-obra, não incidindo esse valor na planilha da máquina."]
[null,"Horas Produtivas",null,{"$f":"6*5*4","v":120},{"$f":"E323*D326","v":0},null,null,{"$f":"2*5*4","v":40},{"$f":"I323*H326","v":0},null,null,{"$f":"4*5*4","v":80},{"$f":"M323*L326","v":0}]
[null,"Horas Improdutivas",null,{"$f":"$C$43-D326","v":56},{"$f":"D327*E324","v":0},null,null,{"$f":"$C$43-H326","v":136},{"$f":"I324*H327","v":0},null,null,{"$f":"$C$43-L326","v":96},{"$f":"M324*L327","v":0}]
[null,"Horas de sobreaviso(1/3)",null,{"$f":"$E$38-D326-D327","v":544},{"$f":"D328*E325","v":0},null,null,{"$f":"$E$38-H326-H327","v":544},{"$f":"(I314+I315+(I319*(1/3)*(1/3)))*H328","v":0},null,null,{"$f":"$E$38-L326-L327","v":544},{"$f":"(M314+M315+(M319*(1/3)*(1/3)))*L328","v":0}]
[null,"TOTAL HPM+HIM",null,null,{"$f":"E326+E327+E328","v":0},null,null,null,{"$f":"I326+I327+I328","v":0},null,null,null,{"$f":"M326+M327+M328","v":0}]
[null,null,"Preço Base Codevasf:",null,22405.040000000001,{"$f":"E330/E329-1","v":{"$error":"#DIV/0!"}},null,null,4017.78,{"$f":"I330/I329-1","v":{"$error":"#DIV/0!"}},null,null,1128.77,{"$f":"M330/M329-1","v":{"$error":"#DIV/0!"}}]
[null,null,"Preço Contratado COP:",null,15683.36,{"$f":"E331/E329-1","v":{"$error":"#DIV/0!"}},null,null,2812.48,{"$f":"I331/I329-1","v":{"$error":"#DIV/0!"}},null,null,790.24,{"$f":"M331/M329-1","v":{"$error":"#DIV/0!"}}]
[null,"Horas/dia","Dias/sem.","Dias/mês","Horas/mês"]
[null,24,7,28,{"$f":"D333*B333","v":672},"minimizado"]
[{"$nulls":8},"Pá carregadeira",null,null,null,"Grupo Gerador",null,null,"Betoneira"]
[null,"44 horas úteis semanais:",null,"Produtiva",{"$nulls":4},"Produtiva","Improdutiva",null,"Sobreaviso","Produtiva","Improdutiva","Sobreaviso","Produtiva","Improdutiva","Sobreaviso"]
[null,"hs/semana","semana","horas/dia","dias/sem.","horas/sem.",null,"semanas","horas/mês","horas/mês",null,"horas/mês","horas/mês","horas/mês","horas/mês","horas/mês","horas/mês","horas/mês"]
[null,44,4,6,5,{"$f":"D337*E337","v":30},null,4,{"$f":"D326","v":120},{"$f":"D327","v":56},null,{"$f":"D328","v":544},{"$f":"H326","v":40},{"$f":"H327","v":136},{"$f":"H328","v":544},{"$f":"L326","v":80},{"$f":"L327","v":96},{"$f":"L328","v":544}]
[null,"=>",{"$f":"B337*C337","v":176},"Total de horas úteis/mês",null,null,null,"-120","=>",56,null,{"$f":"L337+J337+I337","v":720},null,null,{"$f":"O337+N337+M337","v":720},null,null,{"$f":"R337+Q337+P337","v":720}]
[]
[]
[]
[null,null,null,"3.1.58"]
[null,"CHP e CHI:",null,"Vibrador de imersão, ponteira 60 mm (39401)"]
[]
[null,null,"Cód.Comp.","Índice","SINAPI/PE (AS)",null,"Cód.Comp.","Índice","SINAPI/PE (AS)",null,null,"Índice","SINAPI/PE (AS)",null,"1º.Pag.","ATUAL","Dif.","+ ou -"]
[null,null,"SINAPI","SINAPI",39401,null,null,"SINAPI",null,null,null,"SINAPI"]
[null,"Mês Ref.",null,null,"2021-10-01",null,null,null,"2021-10-01",null,null,null,"2021-10-01",null,"2021-01-01","2021-03-01"]
[null,"Aquisição",39401,1,1464.17]
[null,"Depreciação",null,null,{"$f":"TRUNC(D349*$E$21,2)","v":0},null,null,null,{"$f":"TRUNC(H349*$I$21,2)","v":0},null,null,null,{"$f":"TRUNC(L349*$M$21,2)","v":0}]
[null,"Juros",null,null,0,null,null,null,{"$f":"TRUNC(H350*$I$21,2)","v":0},null,null,null,{"$f":"TRUNC(L350*$M$21,2)","v":0}]
[null,"Manutenção",null,null,{"$f":"TRUNC(D351*$E$21,2)","v":0},null,null,null,0,null,null,null,{"$f":"TRUNC(L351*$M$21,2)","v":0}]
[null,"Mat.na Op.",null,null,{"$f":"TRUNC(D352*E353,2)","v":0},null,null,null,{"$f":"H352*I353","v":0},null,null,null,{"$f":"TRUNC(L352*$M$26,2)","v":0}]
[null,"Óleo Diesel",{"$nulls":12},3.87,4.08,{"$f":"P353/E353-1","v":{"$error":"#DIV/0!"}},"+"]
[null,"Operador ec",{"$nulls":12},36.11,36.11,{"$f":"P354/E354-1","v":{"$error":"#DIV/0!"}},"+"]
[null,"Oport.Capit."]
[null,"Seg. e Imp."]
[null,"M.d.o"]
[null,"CHP",null,"%CHP",{"$f":"E349+E350+E351+E352+E354","v":0},null,null,"%CHP",{"$f":"I349+I350+I351+I352+I354","v":0},null,null,"%CHP",{"$f":"M349+M350+M351+M352+M354","v":0}]
[null,"CHI",null,{"$f":"E359/E358","v":{"$error":"#DIV/0!"}},{"$f":"E349+E350+E354","v":0},null,null,{"$f":"I359/I358","v":{"$error":"#DIV/0!"}},{"$f":"I349+I350+I354","v":0},null,null,{"$f":"M359/M358","v":{"$error":"#DIV/0!"}},{"$f":"M349+M350+M354","v":0}]
[null,"CHS",null,{"$f":"E360/E358","v":{"$error":"#DIV/0!"}},{"$f":"E349+E350+(E354*(1/3))","v":0},null,null,{"$f":"I360/I358","v":{"$error":"#DIV/0!"}},{"$f":"I349+I350+(I354*(1/3))","v":0},null,null,{"$f":"M360/M358","v":{"$error":"#DIV/0!"}},{"$f":"M349+M350+(M354*(1/3))","v":0},null,"Observação: Os operadores da betoneira e do grupo gerador foram contratados a parte no grupo de contratação de mão-de-obra, não incidindo esse valor na planilha da máquina."]
[null,"Horas Produtivas",null,{"$f":"6*5*4","v":120},{"$f":"E358*$D$34","v":0},null,null,{"$f":"2*5*4","v":40},{"$f":"I358*H361","v":0},null,null,{"$f":"4*5*4","v":80},{"$f":"M358*L361","v":0}]
[null,"Horas Improdutivas",null,{"$f":"$C$43-D361","v":56},{"$f":"$D$35*E359","v":0},null,null,{"$f":"$C$43-H361","v":136},{"$f":"I359*H362","v":0},null,null,{"$f":"$C$43-L361","v":96},{"$f":"M359*L362","v":0}]
[null,"Horas de sobreaviso(1/3)",null,{"$f":"$E$38-D361-D362","v":544},{"$f":"(E349+E350+(E354*(1/3)*(1/3)))*#REF!","v":{"$error":"#REF!"}},null,null,{"$f":"$E$38-H361-H362","v":544},{"$f":"(I349+I350+(I354*(1/3)*(1/3)))*H363","v":0},null,null,{"$f":"$E$38-L361-L362","v":544},{"$f":"(M349+M350+(M354*(1/3)*(1/3)))*L363","v":0}]
[null,"TOTAL HPM+HIM",null,null,{"$f":"E361+E362+E363","v":{"$error":"#REF!"}},null,null,null,{"$f":"I361+I362+I363","v":0},null,null,null,{"$f":"M361+M362+M363","v":0}]
[null,null,"Preço Base Codevasf:",null,null,{"$f":"E365/E364-1","v":{"$error":"#REF!"}},null,null,null,{"$f":"I365/I364-1","v":{"$error":"#DIV/0!"}},null,null,null,{"$f":"M365/M364-1","v":{"$error":"#DIV/0!"}}]
[null,"Horas/dia","Dias/sem.","Dias/mês","Horas/mês"]
[null,24,7,28,{"$f":"D367*B367","v":672},"minimizado"]
[{"$nulls":8},"Pá carregadeira",null,null,null,"Grupo Gerador",null,null,"Betoneira"]
[null,"44 horas úteis semanais:",null,"Produtiva",{"$nulls":4},"Produtiva","Improdutiva",null,"Sobreaviso","Produtiva","Improdutiva","Sobreaviso","Produtiva","Improdutiva","Sobreaviso"]
[null,"hs/semana","semana","horas/dia","dias/sem.","horas/sem.",null,"semanas","horas/mês","horas/mês",null,"horas/mês","horas/mês","horas/mês","horas/mês","horas/mês","horas/mês","horas/mês"]
[null,44,4,6,5,{"$f":"D371*E371","v":30},null,4,{"$f":"D361","v":120},{"$f":"D362","v":56},null,{"$f":"D363","v":544},{"$f":"H361","v":40},{"$f":"H362","v":136},{"$f":"H363","v":544},{"$f":"L361","v":80},{"$f":"L362","v":96},{"$f":"L363","v":544}]
[null,"=>",{"$f":"B371*C371","v":176},"Total de horas úteis/mês",null,null,null,"-120","=>",56,null,{"$f":"L371+J371+I371","v":720},null,null,{"$f":"O371+N371+M371","v":720},null,null,{"$f":"R371+Q371+P371","v":720}]
[]
[]
[]
[]
[null,null,null,"3.1.9",null,null,"3.1.10",null,"3.1.11"]
[null,"CHP e CHI:",null,"caminhão basculante - volume 10m³ (DNIT 9579); caminhão basculante - volume 6m³ (DNIT 9506); caminhão carroceria - capacidade 15t (DNIT 9592)"]
[null,null,null,"*trocar item DNIT 9579 por SINAPI 91386"]
[null,null,"Cód.Comp.","Índice","SICRO - DNIT",null,"Cód.Comp.","Índice","SINAPI/PE (AS)",null,null,"Índice","SINAPI/PE (AS)",null,"1º.Pag.","ATUAL","Dif.","+ ou -"]
[null,null,"DNIT","DNIT","E9579",null,"DNIT","DNIT",9506,null,"DNIT","DNIT",9592]
[null,"Mês Ref.",null,null,"2021-07-01",null,null,null,"2021-10-01",null,null,null,"2021-10-01",null,"2021-01-01","2021-03-01"]
[null,"Aquisição",91386,null,{"$f":"558968.81 + 68643.35","v":627612.16000000003},null,"E9506",{"$nulls":4},"E9592"]
[null,"Depreciação"]
[null,"Juros"]
[null,"Manutenção"]
[null,"Mat.na Op."]
[null,"Óleo Diesel",{"$nulls":15},"+"]
[null,"Operador ec",{"$nulls":15},"+"]
[null,"Oport.Capit."]
[null,"Seg. e Imp."]
[null,"M.d.o"]
[null,"CHP",null,"%CHP",{"$f":"E384+E385+E386+E387+E389+E390","v":0},null,null,"%CHP",{"$f":"I384+I385+I386+I387+I389","v":0},null,null,"%CHP",{"$f":"M384+M385+M386+M387+M389","v":0}]
[null,"CHI",null,{"$f":"E394/E393","v":{"$error":"#DIV/0!"}},{"$f":"E384+E385+E389+E390","v":0},null,null,{"$f":"I394/I393","v":{"$error":"#DIV/0!"}},{"$f":"I384+I385+I389","v":0},null,null,{"$f":"M394/M393","v":{"$error":"#DIV/0!"}},{"$f":"M384+M385+M389","v":0}]
[null,"CHS",null,{"$f":"E395/E393","v":{"$error":"#DIV/0!"}},{"$f":"E384+E385+(E389*(1/3))+E390","v":0},null,null,{"$f":"I395/I393","v":{"$error":"#DIV/0!"}},{"$f":"I384+I385+(I389*(1/3))","v":0},null,null,{"$f":"M395/M393","v":{"$error":"#DIV/0!"}},{"$f":"M384+M385+(M389*(1/3))","v":0},null,"Observação: Os operadores da betoneira e do grupo gerador foram contratados a parte no grupo de contratação de mão-de-obra, não incidindo esse valor na planilha da máquina."]
[null,"Horas Produtivas",null,40,{"$f":"E393*$D$65","v":0},null,null,{"$f":"4*5*4","v":80},{"$f":"I393*H396","v":0},null,null,{"$f":"2*5*4","v":40},{"$f":"M393*L396","v":0}]
[null,"Horas Improdutivas",null,{"$f":"$C$43-D396","v":136},{"$f":"$D$66*E394","v":0},null,null,{"$f":"$C$43-H396","v":96},{"$f":"I394*H397","v":0},null,null,{"$f":"$C$43-L396","v":136},{"$f":"M394*L397","v":0}]
[null,"Horas de sobreaviso(1/3)",null,{"$f":"$E$38-D396-D397","v":544},{"$f":"(E384+E385+(E389*(1/3)*(1/3)))*#REF!","v":{"$error":"#REF!"}},null,null,{"$f":"$E$38-H396-H397","v":544},{"$f":"(I384+I385+(I389*(1/3)*(1/3)))*H398","v":0},null,null,{"$f":"$E$38-L396-L397","v":544},{"$f":"(M384+M385+(M389*(1/3)*(1/3)))*L398","v":0}]
[null,"TOTAL HPM+HIM",null,null,{"$f":"E396+E397+E398","v":{"$error":"#REF!"}},null,null,null,{"$f":"I396+I397+I398","v":0},null,null,null,{"$f":"M396+M397+M398","v":0}]
[null,null,"Preço Base Codevasf:"]
[null,"Horas/dia","Dias/sem.","Dias/mês","Horas/mês"]
[null,24,7,28,{"$f":"D402*B402","v":672},"minimizado"]
[{"$nulls":8},"Bomba submersível",null,null,null,"Betoneira",null,null,"Lavadora"]
[null,"44 horas úteis semanais:",null,"Produtiva",{"$nulls":4},"Produtiva","Improdutiva",null,"Sobreaviso","Produtiva","Improdutiva","Sobreaviso","Produtiva","Improdutiva","Sobreaviso"]
[null,"hs/semana","semana","horas/dia","dias/sem.","horas/sem.",null,"semanas","horas/mês","horas/mês",null,"horas/mês","horas/mês","horas/mês","horas/mês","horas/mês","horas/mês","horas/mês"]
[null,44,4,6,5,{"$f":"D406*E406","v":30},null,4,{"$f":"D396","v":40},{"$f":"D397","v":136},null,{"$f":"D398","v":544},{"$f":"H396","v":80},{"$f":"H397","v":96},{"$f":"H398","v":544},{"$f":"L396","v":40},{"$f":"L397","v":136},{"$f":"L398","v":544}]
[null,"=>",{"$f":"B406*C406","v":176},"Total de horas úteis/mês",null,null,null,"-120","=>",56,null,{"$f":"L406+J406+I406","v":720},null,null,{"$f":"O406+N406+M406","v":720},null,null,{"$f":"R406+Q406+P406","v":720}]
[]
[]
[]
[]
[null,{"$f":"ROUNDUP(E418/E432,0)","v":0}]
[]
[null,null,"caminhão basculante - volume 10m³ (E9579)"]
[null,null,"Cód.Comp.","Índice","sicro"]
[null,null,"SICRO","SICRO",91386]
[null,"Mês Ref.",null,null,"2022-01-01"]
[null,"Aquisição"]
[null,"Depreciação"]
[null,"Juros"]
[null,"Manutenção"]
[null,"Mat.na Op."]
[null,"Óleo Diesel"]
[null,"Operador ec"]
[null,"Oport.Capit."]
[null,"Seg. e Imp."]
[null,"M.d.o"]
[null,"CHP",null,"%CHP",249.494]
[null,"CHI",null,{"$f":"E429/E428","v":0.30411272415368706},75.874300000000005]
[null,"Horas Produtivas",null,{"$f":"($C$439*$D$439*$E$439)*40%","v":56},{"$f":"E428*D430","v":13971.664000000001}]
[null,"Horas Improdutivas",null,{"$f":"$C$43-D430","v":120},{"$f":"D431*E429","v":9104.9160000000011}]
[null,"TOTAL HPM+HIM",null,null,{"$f":"E430+E431","v":23076.58}]
[]
[null,"Horas/dia","Dias/sem.","Dias/mês","Horas/mês"]
[null,24,7,30,{"$f":"D435*B435","v":720},"minimizado"]
[]
[null,"44 horas úteis semanais:",null,"Produtiva"]
[null,"hs/semana","semana","horas/dia","dias/sem.","horas/sem."]
[null,44,4,7,5,{"$f":"D439*E439","v":35}]
[null,"=>",{"$f":"B439*C439","v":176},"Total de horas úteis/mês"]
[]
[]
[]
[null,{"$f":"ROUNDUP(E450/E464,0)","v":0}]
[]
[null,null,"caminhão carroceria - capacidade 15t (E9592)"]
[null,null,"Cód.Comp.","Índice","SICRO"]
[null,null,"SICRO","SICRO","E9592"]
[null,"Mês Ref.",null,null,"2022-01-01"]
[null,"Aquisição"]
[null,"Depreciação"]
[null,"Juros"]
[null,"Manutenção"]
[null,"Mat.na Op."]
[null,"Óleo Diesel"]
[null,"Operador ec"]
[null,"Oport.Capit."]
[null,"Seg. e Imp."]
[null,"M.d.o"]
[null,"CHP",null,null,248.2681]
[null,"CHI",null,null,75.363]
[null,"Horas Produtivas",null,{"$f":"($C$472*$D$472*$E$472)*70%","v":98},{"$f":"E460*D462","v":24330.273799999999}]
[null,"Horas Improdutivas",null,{"$f":"$C$43-D462","v":78},{"$f":"D463*E461","v":5878.3140000000003}]
[null,"TOTAL HPM+HIM",null,null,{"$f":"E462+E463","v":30208.587800000001}]
[]
[]
[null,"Horas/dia","Dias/sem.","Dias/mês","Horas/mês"]
[null,24,7,30,{"$f":"D468*B468","v":720},"minimizado"]
[]
[null,"44 horas úteis semanais:",null,"Produtiva"]
[null,"hs/semana","semana","horas/dia","dias/sem.","horas/sem."]
[null,44,4,7,5,{"$f":"D472*E472","v":35}]
[null,"=>",{"$f":"B472*C472","v":176},"Total de horas úteis/mês"]
[]
[]
[]
[null,{"$f":"ROUNDUP(E483/E497,0)","v":0}]
[]
[null,null,"Caminhão Comboio (DNIT E9509)"]
[null,null,"Cód.Comp.","Índice","SICRO"]
[null,null,"SICRO","SICRO","E9509"]
[null,"Mês Ref.",null,null,"2022-01-01"]
[null,"Aquisição"]
[null,"Depreciação"]
[null,"Juros"]
[null,"Manutenção"]
[null,"Mat.na Op."]
[null,"Óleo Diesel"]
[null,"Operador ec"]
[null,"Oport.Capit."]
[null,"Seg. e Imp."]
[null,"M.d.o"]
[null,"CHP",null,null,244.78819999999999]
[null,"CHI",null,null,72.114699999999999]
[null,"Horas Produtivas",null,{"$f":"($C$505*$D$505*$E$505)*57%","v":79.8},{"$f":"E493*$D$495","v":19534.09836}]
[null,"Horas Improdutivas",null,{"$f":"$C$43-D495","v":96.2},{"$f":"$D$496*E494","v":6937.4341400000003}]
[null,"TOTAL HPM+HIM",null,null,{"$f":"E495+E496","v":26471.532500000001}]
[]
[]
[null,"Horas/dia","Dias/sem.","Dias/mês","Horas/mês"]
[null,24,7,30,{"$f":"D501*B501","v":720},"minimizado"]
[]
[null,"44 horas úteis semanais:",null,"Produtiva"]
[null,"hs/semana","semana","horas/dia","dias/sem.","horas/sem."]
[null,44,4,7,5,{"$f":"D505*E505","v":35}]
[null,"=>",{"$f":"B505*C505","v":176},"Total de horas úteis/mês"]
[]
[]
[]
[]
[null,{"$f":"ROUNDUP(E517/E531,0)","v":0}]
[]
[null,null,"caminhão guindauto, 10,0 t (E9686 DNIT)"]
[null,null,"Cód.Comp.","Índice","SICRO"]
[null,null,"SICRO","SICRO","E9686"]
[null,"Mês Ref.",null,null,"2022-01-01"]
[null,"Aquisição"]
[null,"Depreciação"]
[null,"Juros"]
[null,"Manutenção"]
[null,"Mat.na Op."]
[null,"Óleo Diesel"]
[null,"Operador ec"]
[null,"Oport.Capit."]
[null,"Seg. e Imp."]
[null,"M.d.o"]
[null,"CHP",null,null,279.4948]
[null,"CHI",null,null,104.87909999999999]
[null,"Horas Produtivas",null,{"$f":"($C$539*$D$539*$E$539)*57%","v":79.8},{"$f":"E527*$D$529","v":22303.68504}]
[null,"Horas Improdutivas",null,{"$f":"$C$43-D529","v":96.2},{"$f":"$D$530*E528","v":10089.369419999999}]
[null,"TOTAL HPM+HIM",null,null,{"$f":"E529+E530","v":32393.054459999999}]
[]
[]
[null,"Horas/dia","Dias/sem.","Dias/mês","Horas/mês"]
[null,24,7,30,{"$f":"D535*B535","v":720},"minimizado"]
[]
[null,"44 horas úteis semanais:",null,"Produtiva"]
[null,"hs/semana","semana","horas/dia","dias/sem.","horas/sem."]
[null,44,4,7,5,{"$f":"D539*E539","v":35}]
[null,"=>",{"$f":"B539*C539","v":176},"Total de horas úteis/mês"]
[]
[]
[]
[null,{"$f":"ROUNDUP(E550/E564,0)","v":0}]
[]
[null,null,"caminhão tanque, 6000 L (SICRO E9605)"]
[null,null,"Cód.Comp.","Índice","SICRO"]
[null,null,"SICRO","SICRO","E9605"]
[null,"Mês Ref.",null,null,"2022-01-01"]
[null,"Aquisição","E9605"]
[null,"Depreciação"]
[null,"Juros"]
[null,"Manutenção"]
[null,"Mat.na Op."]
[null,"Óleo Diesel"]
[null,"Operador ec"]
[null,"Oport.Capit."]
[null,"Seg. e Imp."]
[null,"M.d.o"]
[null,"CHP",null,null,234.19]
[null,"CHI",null,null,69.73]
[null,"Horas Produtivas",null,{"$f":"($C$572*$D$572*$E$572)*40%","v":56},{"$f":"E560*D562","v":13114.64}]
[null,"Horas Improdutivas",null,{"$f":"$C$43-D562","v":120},{"$f":"D563*E561","v":8367.6}]
[null,"TOTAL HPM+HIM",null,null,{"$f":"E562+E563","v":21482.239999999998}]
[]
[]
[null,"Horas/dia","Dias/sem.","Dias/mês","Horas/mês"]
[null,24,7,30,{"$f":"D568*B568","v":720},"minimizado"]
[]
[null,"44 horas úteis semanais:",null,"Produtiva"]
[null,"hs/semana","semana","horas/dia","dias/sem.","horas/sem."]
[null,44,4,7,5,{"$f":"D572*E572","v":35}]
[null,"=>",{"$f":"B572*C572","v":176},"Total de horas úteis/mês"]
[]
[]
[]
[]
[]
[null,{"$f":"ROUNDUP(E585/E600,0)","v":33},{"$nulls":4},{"$f":"ROUNDUP(I585/I600,0)","v":32}]
[]
[null,null," compactador de solo a percussão (DNIT 9107)",null,null,null,"compactador de solo tipo placa reversível (DNIT 9556)"]
[null,null,"Cód.Comp.","Índice","SICRO - DNIT",null,"Cód.Comp.","Índice","SICRO - DNIT"]
[null,null,"DNIT","DNIT",9107,null,"DNIT","DNIT",9556]
[null,"Mês Ref.",null,null,"2022-01-01",null,null,null,"2022-01-01"]
[null,"Aquisição","E9107",1,9481.2548999999999,null,"E9556",1,9486.6787000000004]
[null,"Depreciação",null,null,0.6321,null,null,null,0.63239999999999996]
[null,"Juros"]
[null,"Manutenção",null,null,0.6321,null,null,null,0.63239999999999996]
[null,"Mat.na Op."]
[null,"Óleo Diesel"]
[null,"Operador ec"]
[null,"Oport.Capit.",null,null,0.1706,null,null,null,0.17069999999999999]
[null,"Seg. e Imp.",null,null,0]
[null,"Operação",null,null,4.6647999999999996,null,null,null,4.9176000000000002]
[null,"M.d.o",null,null,0,null,null,null,0]
[null,"CHP",null,null,{"$f":"E586+E587+E588+E589+E592+E594","v":6.0995999999999997},null,null,null,{"$f":"I586+I587+I588+I589+I592+I594","v":6.3531000000000004}]
[null,"CHI",null,null,{"$f":"E586+E592+E595","v":0.80269999999999997},null,null,null,{"$f":"I586+I592+I595","v":0.80309999999999993}]
[null,"Horas Produtivas",null,{"$f":"($C$607*$D$607*$E$607)*20%","v":28},{"$f":"E596*D598","v":170.78879999999998},null,null,{"$f":"($C$607*$D$607*$E$607)*20%","v":28},{"$f":"I596*H598","v":177.88680000000002}]
[null,"Horas Improdutivas",null,{"$f":"$C$43-D598","v":148},{"$f":"D599*E597","v":118.7996},null,null,{"$f":"$C$43-H598","v":148},{"$f":"H599*I597","v":118.85879999999999}]
[null,"TOTAL HPM+HIM",null,null,{"$f":"E598+E599","v":289.58839999999998},null,null,null,{"$f":"I598+I599","v":296.74560000000002}]
[]
[null,"Horas/dia","Dias/sem.","Dias/mês","Horas/mês"]
[null,24,7,30,{"$f":"D603*B603","v":720},"minimizado"]
[]
[null,"44 horas úteis semanais:",null,"Produtiva"]
[null,"hs/semana","semana","horas/dia","dias/sem.","horas/sem."]
[null,44,4,7,5,{"$f":"D607*E607","v":35}]
[null,"=>",{"$f":"B607*C607","v":176},"Total de horas úteis/mês"]
[]
[]
[]
[null,{"$f":"ROUNDUP(E618/E632,0)","v":0}]
[]
[null,null,"cavalo mecânico, 20t (SICRO E9666 )"]
[null,null,"Cód.Comp.","Índice","SICRO"]
[null,null,"SICRO","SICRO","E9666"]
[null,"Mês Ref.",null,null,"2022-01-01"]
[null,"Aquisição","E9666"]
[null,"Depreciação"]
[null,"Juros"]
[null,"Manutenção"]
[null,"Mat.na Op."]
[null,"Óleo Diesel"]
[null,"Operador ec"]
[null,"Oport.Capit."]
[null,"Seg. e Imp."]
[null,"M.d.o"]
[null,"CHP",null,null,378.45]
[null,"CHI",null,null,118.68]
[null,"Horas Produtivas",null,{"$f":"($C$639*$D$639*$E$639)*30%","v":42},{"$f":"E628*D630","v":15894.9}]
[null,"Horas Improdutivas",null,{"$f":"$C$43-D630","v":134},{"$f":"D631*E629","v":15903.12}]
[null,"TOTAL HPM+HIM",null,null,{"$f":"E630+E631","v":31798.02}]
[null,null,"Preço Base Codevasf:"]
[null,"Horas/dia","Dias/sem.","Dias/mês","Horas/mês"]
[null,24,7,30,{"$f":"D635*B635","v":720},"minimizado"]
[]
[null,"44 horas úteis semanais:",null,"Produtiva"]
[null,"hs/semana","semana","horas/dia","dias/sem.","horas/sem."]
[null,44,4,7,5,{"$f":"D639*E639","v":35}]
[null,"=>",{"$f":"B639*C639","v":176},"Total de horas úteis/mês"]
[]
[]
[]
[]
[null,{"$f":"ROUNDUP(E651/E666,0)","v":34},{"$nulls":4},{"$f":"ROUNDUP(I651/I666,0)","v":36},null,null,null,{"$f":"ROUNDUP(M651/M666,0)","v":33}]
[]
[null,null,"Compressor de ar, 400 pcm (DNIT E9513)",null,null,null,"Compressor de ar, 189 pcm  (DNIT E9661)",null,null,null,"Empilhadeira sobre pneus (DNIT E9528)"]
[null,null,"Cód.Comp.","Índice","SICRO - DNIT",null,"Cód.Comp.","Índice","SICRO - DNIT",null,"Cód.Comp.","Índice","SICRO - DNIT"]
[null,null,"DNIT","DNIT","E9513",null,"DNIT","DNIT","E9661",null,"DNIT","DNIT","E9528"]
[null,"Mês Ref.",null,1,"2022-01-01",null,null,null,"2022-01-01",null,null,null,"2022-01-01"]
[null,"Aquisição","E9513",1,238622.95809999999,null,"E9661",1,122025.6249,null,"E9528",1,380699.48790000001]
[null,"Depreciação",null,null,15.908200000000001,null,null,null,8.1349999999999998,null,null,null,30.456]
[null,"Juros"]
[null,"Manutenção",null,null,15.908200000000001,null,null,null,8.1349999999999998,null,null,null,26.649000000000001]
[null,"Mat.na Op."]
[null,"Óleo Diesel"]
[null,"Operador ec"]
[null,"Oport.Capit.",null,null,4.2942,null,null,null,2.1960000000000002,null,null,null,7.0467000000000004]
[null,"Seg. e Imp.",{"$nulls":6},0]
[null,"Operação",null,null,67.197599999999994,null,null,null,29.865600000000001,null,null,null,43.92]
[null,"M.d.o",{"$nulls":6},0,null,null,null,22.790500000000002]
[null,"CHP",null,null,{"$f":"E652+E653+E654+E655+E657+E658+E660","v":103.3082},null,null,null,{"$f":"I652+I653+I654+I655+I658+I660","v":48.331600000000002},null,null,null,{"$f":"M652+M653+M654+M655+M658+M660+M661","v":130.8622}]
[null,"CHI",null,null,{"$f":"E652+E653+E657+E658","v":20.202400000000001},null,null,null,{"$f":"I652+I658+I661","v":10.331},null,null,null,{"$f":"M652+M658+M661","v":60.293199999999999}]
[null,"Horas Produtivas",null,{"$f":"($C$673*$D$673*$E$673)*30%","v":42},{"$f":"E662*D664","v":4338.9444000000003},null,null,{"$f":"($C$673*$D$673*$E$673)*30%","v":42},{"$f":"I662*H664","v":2029.9272000000001},null,null,{"$f":"($C$673*$D$673*$E$673)*10%","v":14},{"$f":"M662*L664","v":1832.0708}]
[null,"Horas Improdutivas",null,{"$f":"$C$43-D664","v":134},{"$f":"D665*E663","v":2707.1215999999999},null,null,{"$f":"$C$43-H664","v":134},{"$f":"H665*I663","v":1384.354},null,null,{"$f":"$C$43-L664","v":162},{"$f":"L665*M663","v":9767.4984000000004}]
[null,"TOTAL HPM+HIM",null,null,{"$f":"E664+E665","v":7046.0660000000007},null,null,null,{"$f":"I664+I665","v":3414.2812000000004},null,null,null,{"$f":"M664+M665","v":11599.5692}]
[]
[null,"Horas/dia","Dias/sem.","Dias/mês","Horas/mês"]
[null,24,7,30,{"$f":"D669*B669","v":720},"minimizado"]
[]
[null,"44 horas úteis semanais:",null,"Produtiva"]
[null,"hs/semana","semana","horas/dia","dias/sem.","horas/sem."]
[null,44,4,7,5,{"$f":"D673*E673","v":35}]
[null,"=>",{"$f":"B673*C673","v":176},"Total de horas úteis/mês"]
[]
[]
[]
[null,{"$f":"ROUNDUP(E684/E699,0)","v":45},{"$nulls":4},{"$f":"ROUNDUP(I684/I699,0)","v":49}]
[]
[null,null,"Draga de sucção, 100kW (DNIT E9609)",null,null,null,"Equipamento de solda MIG, 14,6 kVA (DNIT E9206)"]
[null,null,"Cód.Comp.","Índice","SICRO - DNIT",null,"Cód.Comp.","Índice","SICRO - DNIT"]
[null,null,"DNIT","DNIT","E9609",null,"DNIT","DNIT","E9206"]
[null,"Mês Ref.",null,1,"2022-01-01",null,null,null,"2022-01-01"]
[null,"Aquisição","E9609",1,585619.95799999998,null,"E9206",1,87341.080700000006]
[null,"Depreciação",null,null,4.5751999999999997,null,null,null,6.9873000000000003]
[null,"Juros"]
[null,"Manutenção",null,null,10.167,null,null,null,6.9873000000000003]
[null,"Mat.na Op."]
[null,"Óleo Diesel"]
[null,"Operador ec"]
[null,"Oport.Capit.",null,null,3.2932999999999999,null,null,null,1.6167]
[null,"Seg. e Imp."]
[null,"Operação",null,null,73.2,null,null,null,0]
[null,"M.d.o",null,null,39.7301,null,null,null,0]
[null,"CHP",null,null,{"$f":"E685+E686+E687+E688+E690+E691+E693+E694","v":130.96559999999999},null,null,null,{"$f":"I685+I686+I687+I688+I691+I693","v":15.5913}]
[null,"CHI",null,null,{"$f":"E685+E686+E690+E691+E694","v":47.598599999999998},null,null,null,{"$f":"I685+I691+I694","v":8.604000000000001}]
[null,"Horas Produtivas",null,{"$f":"($C$706*$D$706*$E$706)*40%","v":56},{"$f":"E695*D697","v":7334.0735999999997},null,null,{"$f":"($C$706*$D$706*$E$706)*30%","v":42},{"$f":"I695*H697","v":654.83460000000002}]
[null,"Horas Improdutivas",null,{"$f":"$C$43-D697","v":120},{"$f":"D698*E696","v":5711.8319999999994},null,null,{"$f":"$C$43-H697","v":134},{"$f":"H698*I696","v":1152.9360000000001}]
[null,"TOTAL HPM+HIM",null,null,{"$f":"E697+E698","v":13045.905599999998},null,null,null,{"$f":"I697+I698","v":1807.7706000000003}]
[]
[null,"Horas/dia","Dias/sem.","Dias/mês","Horas/mês"]
[null,24,7,30,{"$f":"D702*B702","v":720},"minimizado"]
[]
[null,"44 horas úteis semanais:",null,"Produtiva"]
[null,"hs/semana","semana","horas/dia","dias/sem.","horas/sem."]
[null,44,4,7,5,{"$f":"D706*E706","v":35}]
[null,"=>",{"$f":"B706*C706","v":176},"Total de horas úteis/mês"]
[]
[]
[]
[]
[null,{"$f":"ROUNDUP(E718/E733,0)","v":6},{"$nulls":4},{"$f":"ROUNDUP(I718/I733,0)","v":37}]
[]
[null,null,"Grupo gerador de 4kVA (DNIT E9521)",null,null,null,"Grupo gerador de 13/14kVA (DNIT E9066)"]
[null,null,"Cód.Comp.","Índice","SICRO - DNIT",null,"Cód.Comp.","Índice","SICRO - DNIT"]
[null,null,"DNIT","DNIT","E9521",null,"DNIT","DNIT","E9066"]
[null,"Mês Ref.",null,null,"2022-01-01",null,null,null,"2022-01-01"]
[null,"Aquisição","E9521",1,3366.3245000000002,null,"E9066",1,54424.7664]
[null,"Depreciação",null,null,0.16830000000000001,null,null,null,2.7212000000000001]
[null,"Juros"]
[null,"Manutenção",null,null,0.1202,null,null,null,1.9437]
[null,"Mat.na Op."]
[null,"Óleo Diesel"]
[null,"Operador ec"]
[null,"Oport.Capit.",null,null,5.9299999999999999E-2,null,null,null,0.95940000000000003]
[null,"Seg. e Imp.",null,null,0]
[null,"Operação",null,null,3.7128000000000001,null,null,null,10.199199999999999]
[null,"M.d.o",null,null,0,null,null,null,0]
[null,"CHP",null,null,{"$f":"E719+E720+E721+E722+E724+E725+E727","v":4.0606},null,null,null,{"$f":"I719+I720+I721+I722+I725+I727","v":15.823499999999999}]
[null,"CHI",null,null,{"$f":"E719+E720+E724+E725","v":0.2276},null,null,null,{"$f":"I719+I725+I728","v":3.6806000000000001}]
[null,"Horas Produtivas",null,{"$f":"($C$740*$D$740*$E$740)*100%","v":140},{"$f":"E729*D731","v":568.48400000000004},null,null,{"$f":"($C$740*$D$740*$E$740)*50%","v":70},{"$f":"I729*H731","v":1107.645}]
[null,"Horas Improdutivas",null,{"$f":"$C$43-D731","v":36},{"$f":"D732*E730","v":8.1936},null,null,{"$f":"$C$43-H731","v":106},{"$f":"H732*I730","v":390.14359999999999}]
[null,"TOTAL HPM+HIM",null,null,{"$f":"E731+E732","v":576.67759999999998},null,null,null,{"$f":"I731+I732","v":1497.7885999999999}]
[]
[null,"Horas/dia","Dias/sem.","Dias/mês","Horas/mês"]
[null,24,7,30,{"$f":"D736*B736","v":720},"minimizado"]
[]
[null,"44 horas úteis semanais:",null,"Produtiva"]
[null,"hs/semana","semana","horas/dia","dias/sem.","horas/sem."]
[null,44,4,7,5,{"$f":"D740*E740","v":35}]
[null,"=>",{"$f":"B740*C740","v":176},"Total de horas úteis/mês"]
[]
[]
[]
[]
[null,{"$f":"ROUNDUP(E752/E767,0)","v":42},{"$nulls":4},{"$f":"ROUNDUP(I752/I767,0)","v":24},null,null,null,{"$f":"ROUNDUP(M752/M767,0)","v":37}]
[]
[null,null,"Furadeira elétrica (DNIT E9568)",null,null,null,"Retroescavadeira, 72 hp (DNIT E9526)",null,null,null,"Rolo compactador, 125 hp (DNIT E9685)"]
[null,null,"Cód.Comp.","Índice","SICRO - DNIT",null,"Cód.Comp.","Índice","SICRO - DNIT",null,"Cód.Comp.","Índice","SICRO - DNIT"]
[null,null,"DNIT","DNIT","E9568",null,"DNIT","DNIT","E9526",null,"DNIT","DNIT","E9685"]
[null,"Mês Ref.",null,null,"2022-01-01",null,null,null,"2022-01-01",null,null,null,"2022-01-01"]
[null,"Aquisição","E9568",1,1269.9018000000001,null,"E9526",1,369252.14740000002,null,"E9685",1,514466.94669999997]
[null,"Depreciação",null,null,0.1016,null,null,null,25.8477,null,null,null,34.297800000000002]
[null,"Juros"]
[null,"Manutenção",null,null,6.3500000000000001E-2,null,null,null,25.8477,null,null,null,34.297800000000002]
[null,"Mat.na Op."]
[null,"Óleo Diesel"]
[null,"Operador ec"]
[null,"Oport.Capit.",null,null,2.35E-2,null,null,null,6.8349000000000002,null,null,null,9.2583000000000002]
[null,"Seg. e Imp."]
[null,"Operação",null,null,0,null,null,null,36.795200000000001,null,null,null,64.025599999999997]
[null,"M.d.o",null,null,0,null,null,null,28.238199999999999,null,null,null,28.238199999999999]
[null,"CHP",null,null,{"$f":"E753+E754+E755+E756+E758+E759","v":0.18859999999999999},null,null,null,{"$f":"I753+I754+I755+I756+I759+I761+I762","v":123.56370000000001},null,null,null,{"$f":"M753+M754+M755+M756+M759+M761+M762","v":170.11770000000001}]
[null,"CHI",null,null,{"$f":"E753+E754+E758+E759","v":0.12509999999999999},null,null,null,{"$f":"I753+I759+I762","v":60.9208},null,null,null,{"$f":"M753+M759+M762","v":71.794299999999993}]
[null,"Horas Produtivas",null,{"$f":"($C$774*$D$774*$E$774)*100%","v":140},{"$f":"E763*D765","v":26.404},null,null,{"$f":"($C$774*$D$774*$E$774)*59%","v":82.6},{"$f":"I763*H765","v":10206.36162},null,null,{"$f":"($C$774*$D$774*$E$774)*10%","v":14},{"$f":"M763*L765","v":2381.6478000000002}]
[null,"Horas Improdutivas",null,{"$f":"$C$43-D765","v":36},{"$f":"D766*E764","v":4.5035999999999996},null,null,{"$f":"$C$43-H765","v":93.4},{"$f":"H766*I764","v":5690.0027200000004},null,null,{"$f":"$C$43-L765","v":162},{"$f":"L766*M764","v":11630.676599999999}]
[null,"TOTAL HPM+HIM",null,null,{"$f":"E765+E766","v":30.907599999999999},null,null,null,{"$f":"I765+I766","v":15896.36434},null,null,null,{"$f":"M765+M766","v":14012.3244}]
[]
[null,"Horas/dia","Dias/sem.","Dias/mês","Horas/mês"]
[null,24,7,30,{"$f":"D770*B770","v":720},"minimizado"]
[]
[null,"44 horas úteis semanais:",null,"Produtiva"]
[null,"hs/semana","semana","horas/dia","dias/sem.","horas/sem."]
[null,44,4,7,5,{"$f":"D774*E774","v":35}]
[null,"=>",{"$f":"B774*C774","v":176},"Total de horas úteis/mês"]
[]
[]
[]
[null,{"$f":"ROUNDUP(E785/E800,0)","v":55}]
[]
[null,null,"Trator de esteiras, 150 hp (DNIT E9540)"]
[null,null,"Cód.Comp.","Índice","SICRO - DNIT"]
[null,null,"DNIT","DNIT","E9540"]
[null,"Mês Ref.",null,null,"2022-01-01"]
[null,"Aquisição","E9540",1,1054478.547]
[null,"Depreciação",null,null,41.0075]
[null,"Juros"]
[null,"Manutenção",null,null,58.582099999999997]
[null,"Mat.na Op."]
[null,"Óleo Diesel"]
[null,"Operador ec"]
[null,"Oport.Capit.",null,null,18.072600000000001]
[null,"Seg. e Imp."]
[null,"Operação",null,null,86.766400000000004]
[null,"M.d.o",null,null,28.238199999999999]
[null,"CHP",null,null,{"$f":"E786+E787+E788+E789+E791+E792+E794+E795","v":232.66679999999999}]
[null,"CHI",null,null,{"$f":"E786+E787+E791+E792+E795","v":87.318299999999994}]
[null,"Horas Produtivas",null,{"$f":"($C$808*$D$808*$E$808)*20%","v":28},{"$f":"E796*D798","v":6514.6704}]
[null,"Horas Improdutivas",null,{"$f":"$C$43-D798","v":148},{"$f":"D799*E797","v":12923.108399999999}]
[null,"TOTAL HPM+HIM",null,null,{"$f":"E798+E799","v":19437.7788}]
[]
[]
[null,"Horas/dia","Dias/sem.","Dias/mês","Horas/mês"]
[null,24,7,30,{"$f":"D804*B804","v":720},"minimizado"]
[]
[null,"44 horas úteis semanais:",null,"Produtiva"]
[null,"hs/semana","semana","horas/dia","dias/sem.","horas/sem."]
[null,44,4,7,5,{"$f":"D808*E808","v":35}]
[null,"=>",{"$f":"B808*C808","v":176},"Total de horas úteis/mês"]
[]
[]
[]
["COMPOSIÇÕES - EQUIPAMENTOS - SEGURANÇA DE BARRAGENS"]
[]
[]
[]
[null,{"$f":"ROUNDUP(E823/E838,0)","v":38},{"$nulls":4},{"$f":"ROUNDUP(I823/I838,0)","v":5},null,null,null,{"$f":"ROUNDUP(M823/M838,0)","v":56}]
[]
[null,null,"Grupo Gerador - 32,0 kVA (DNIT E9763)",null,null,null,"Embarcação de alumínio (DNIT E9043)",null,null,null,"Carreta Reboque (DNIT A9382)"]
[null,null,"Cód.Comp.","Índice","SICRO - DNIT",null,"Cód.Comp.","Índice","SICRO - DNIT",null,"Cód.Comp.","Índice","SICRO - DNIT"]
[null,null,"DNIT",null,"E9763",null,"DNIT",null,"E9043",null,"DNIT",null,"A9382"]
[null,"Mês Ref.",null,"E9763","2022-01-01",null,null,null,"2022-01-01",null,null,null,"2022-01-01"]
[null,"Aquisição","E9763",1,56397.639799999997,null,"E9043",1,24450.997100000001,null,"A9382",1,97410.416500000007]
[null,"Depreciação",null,null,2.8199000000000001,null,null,null,0.38200000000000001,null,null,null,6.4939999999999998]
[null,"Juros"]
[null,"Manutenção",null,null,2.0142000000000002,null,null,null,0.42449999999999999,null,null,null,7.3057999999999996]
[null,"Mat.na Op."]
[null,"Óleo Diesel"]
[null,"Operador ec"]
[null,"Oport.Capit.",null,null,0.99419999999999997,null,null,null,0.14410000000000001,null,null,null,3.2555000000000001]
[null,"Seg. e Imp."]
[null,"Operação",null,null,27.815999999999999,null,null,null,44.268000000000001]
[null,"M.d.o",{"$nulls":6},31.3796]
[null,"CHP",null,null,{"$f":"E824+E825+E826+E827+E829+E830+E832","v":33.644300000000001},null,null,null,{"$f":"I824+I825+I826+I827+I830+I832+I833","v":76.598200000000006},null,null,null,{"$f":"M824+M825+M826+M827+M830+M832+M833","v":17.055299999999999}]
[null,"CHI",null,null,{"$f":"E824+E825+E829+E830","v":3.8140999999999998},null,null,null,{"$f":"I824+I830+I833","v":31.9057},null,null,null,{"$f":"M824+M830+M833","v":9.7494999999999994}]
[null,"Horas Produtivas",null,{"$f":"($C$845*$D$845*$E$845)*20%","v":28},{"$f":"E834*D836","v":942.04040000000009},null,null,{"$f":"($C$845*$D$845*$E$845)*5%","v":7},{"$f":"I834*H836","v":536.18740000000003},null,null,{"$f":"($C$845*$D$845*$E$845)*5%","v":7},{"$f":"M834*L836","v":119.38709999999999}]
[null,"Horas Improdutivas",null,{"$f":"$C$43-D836","v":148},{"$f":"D837*E835","v":564.48680000000002},null,null,{"$f":"$C$43-H836","v":169},{"$f":"H837*I835","v":5392.0632999999998},null,null,{"$f":"$C$43-L836","v":169},{"$f":"L837*M835","v":1647.6654999999998}]
[null,"TOTAL HPM+HIM",null,null,{"$f":"E836+E837","v":1506.5272},null,null,null,{"$f":"I836+I837","v":5928.2506999999996},null,null,null,{"$f":"M836+M837","v":1767.0525999999998}]
[null,null,"Preço Base Codevasf:"]
[null,"Horas/dia","Dias/sem.","Dias/mês","Horas/mês"]
[null,24,7,28,{"$f":"D841*B841","v":672},"minimizado"]
[]
[null,"44 horas úteis semanais:",null,"Produtiva"]
[null,"hs/semana","semana","horas/dia","dias/sem.","horas/sem."]
[null,44,4,7,5,{"$f":"D845*E845","v":35}]
[null,"=>",{"$f":"B845*C845","v":176},"Total de horas úteis/mês"]
[]
[]
["COMPOSIÇÕES - EQUIPAMENTOS - MECÂNICA"]
[]
[]
[]
[null,{"$f":"ROUNDUP(E859/E873,0)","v":42}]
[]
[null,null,"Nível de precisão (E9552 - DNIT/PE)"]
[null,null,"Cód.Comp.","Índice","SICRO - DNIT"]
[null,null,"DNIT",null,"E9552"]
[null,"Mês Ref.",null,null,"2022-01-01"]
[null,"Aquisição","E9552",1,12940.8215]
[null,"Depreciação",null,null,1.0353000000000001]
[null,"Juros",null,null,{"$f":"TRUNC(D861*$E$183,2)","v":0}]
[null,"Manutenção",null,null,0.64700000000000002]
[null,"Mat.na Op.",null,null,{"$f":"TRUNC(D863*E864,2)","v":0}]
[null,"Energia elétrica (kW)"]
[null,"Operador ec"]
[null,"Oport.Capit.",null,null,0.23949999999999999]
[null,"Seg. e Imp."]
[null,"M.d.o"]
[null,"CHP",null,null,{"$f":"E860+E861+E862+E863+E865+E866","v":1.9218000000000002}]
[null,"CHI",null,null,{"$f":"E860+E861+E865+E866","v":1.2748000000000002}]
[null,"Horas Produtivas",null,{"$f":"($C$880*$D$880*$E$880)*100%","v":140},{"$f":"E869*D871","v":269.05200000000002}]
[null,"Horas Improdutivas",null,{"$f":"$C$43-D871","v":36},{"$f":"D872*E870","v":45.892800000000008}]
[null,"TOTAL HPM+HIM",null,null,{"$f":"E871+E872","v":314.94480000000004}]
[null,null,"Preço Base Codevasf:"]
[null,"Horas/dia","Dias/sem.","Dias/mês","Horas/mês"]
[null,24,7,30,{"$f":"D876*B876","v":720},"minimizado"]
[]
[null,"44 horas úteis semanais:",null,"Produtiva"]
[null,"hs/semana","semana","horas/dia","dias/sem.","horas/sem."]
[null,44,4,7,5,{"$f":"D880*E880","v":35}]
[null,"=>",{"$f":"B880*C880","v":176},"Total de horas úteis/mês"]
[]
[]
[]
[null,{"$f":"ROUNDUP(E891/E906,0)","v":37},{"$nulls":4},{"$f":"ROUNDUP(I891/I906,0)","v":36},null,null,null,{"$f":"ROUNDUP(M891/M906,0)","v":48}]
[]
[null,null,"Conjunto Motor bomba 7,5 CV (E9630 - DNIT/PE)",null,null,null,"Retífica elétrica (E9207 - DNIT/PE)",null,null,null,"Rosqueadeira (E9748 - DNIT/PE)"]
[null,null,"Cód.Comp.","Índice","SICRO - DNIT",null,"Cód.Comp.","Índice","SICRO - DNIT",null,"Cód.Comp.","Índice","SICRO - DNIT"]
[null,null,"DNIT",null,"E9630",null,"DNIT",null,"E9207",null,"DNIT",null,"E9748"]
[null,"Mês Ref.",null,null,"2022-01-01",null,null,null,"2022-01-01",null,null,null,"2022-01-01"]
[null,"Aquisição","E9630",1,4479.8519999999999,null,"E9207",1,4520.2924999999996,null,"E9748",1,5481.4259000000002]
[null,"Depreciação",null,null,0.3584,null,null,null,0.36159999999999998,null,null,null,0.31319999999999998]
[null,"Juros"]
[null,"Manutenção",null,null,0.31359999999999999,null,null,null,0.36159999999999998,null,null,null,0.31319999999999998]
[null,"Mat.na Op."]
[null,"Óleo Diesel"]
[null,"Operador ec"]
[null,"Oport.Capit.",null,null,8.2900000000000001E-2,null,null,null,8.3699999999999997E-2,null,null,null,9.6600000000000005E-2]
[null,"Seg. e Imp."]
[null,"Operação"]
[null,"M.d.o",{"$nulls":10},0]
[null,"CHP",null,null,{"$f":"E892+E893+E894+E895+E897+E898+E900","v":0.7548999999999999},null,null,null,{"$f":"I892+I893+I894+I895+I898+I900+I901","v":0.80689999999999995},null,null,null,{"$f":"M892+M893+M894+M895+M898+M900+M901","v":0.72299999999999998}]
[null,"CHI",null,null,{"$f":"E892+E893+E897+E898","v":0.44130000000000003},null,null,null,{"$f":"I892+I898+I901","v":0.44529999999999997},null,null,null,{"$f":"M892+M898+M901","v":0.4098}]
[null,"Horas Produtivas",null,{"$f":"($C$913*$D$913*$E$913)*100%","v":140},{"$f":"E902*D904","v":105.68599999999999},null,null,{"$f":"($C$913*$D$913*$E$913)*100%","v":140},{"$f":"I902*H904","v":112.96599999999999},null,null,{"$f":"($C$913*$D$913*$E$913)*100%","v":140},{"$f":"M902*L904","v":101.22}]
[null,"Horas Improdutivas",null,{"$f":"$C$43-D904","v":36},{"$f":"D905*E903","v":15.886800000000001},null,null,{"$f":"$C$43-H904","v":36},{"$f":"H905*I903","v":16.030799999999999},null,null,{"$f":"$C$43-L904","v":36},{"$f":"L905*M903","v":14.752800000000001}]
[null,"TOTAL HPM+HIM",null,null,{"$f":"E904+E905","v":121.5728},null,null,null,{"$f":"I904+I905","v":128.99680000000001},null,null,null,{"$f":"M904+M905","v":115.97280000000001}]
[null,null,"Preço Base Codevasf:"]
[null,"Horas/dia","Dias/sem.","Dias/mês","Horas/mês"]
[null,24,7,30,{"$f":"D909*B909","v":720},"minimizado"]
[]
[null,"44 horas úteis semanais:",null,"Produtiva"]
[null,"hs/semana","semana","horas/dia","dias/sem.","horas/sem."]
[null,44,4,7,5,{"$f":"D913*E913","v":35}]
[null,"=>",{"$f":"B913*C913","v":176},"Total de horas úteis/mês"]
[]
[]
["COMPOSIÇÕES - EQUIPAMENTOS - ELÉTRICA"]
[]
[]
[]
[null,{"$f":"ROUNDUP(E927/E943,0)","v":8}]
[]
[null,null,"Estação de solda com temperatura (13761 - SINAPI/PE)"]
[null,null,"Cód.Comp.","Índice","SINAPI"]
[null,null,"SINAPI",null,13761]
[null,"Mês Ref.",null,null,"2022-04-01"]
[null,"Aquisição",13761,1,2470.6999999999998]
[null,"Depreciação",92712,6.3999999999999997E-5,{"$f":"TRUNC(D928*E927,2)","v":0.15}]
[null,"Juros",92713,7.6000000000000001E-6,{"$f":"TRUNC(D929*E927,2)","v":0.01}]
[null,"Manutenção",92714,8.0000000000000007E-5,{"$f":"TRUNC(D930*E927,2)","v":0.19}]
[null,"Mat.na Op.",92715,null,{"$f":"TRUNC(D932*E932,2)+TRUNC(D933*E933,2)","v":20.509999999999998}]
[null,"Acetileno","I 00000001",0.3261,51.5]
[null,"Oxigênio","I 00000002",0.33,11.28]
[null,"Operador ec"]
[null,"Oport.Capit."]
[null,"Seg. e Imp."]
[null,"Operação"]
[null,"M.d.o"]
[null,"CHP",92716,null,{"$f":"E928+E929+E930+E931+E934+E935+E937","v":20.86}]
[null,"CHI",92717,null,{"$f":"E928+E929+E934+E935","v":0.16}]
[null,"Horas Produtivas",null,{"$f":"($C$950*$D$950*$E$950)*10%","v":14},{"$f":"E939*D941","v":292.03999999999996}]
[null,"Horas Improdutivas",null,{"$f":"$C$43-D941","v":162},{"$f":"D942*E940","v":25.92}]
[null,"TOTAL HPM+HIM",null,null,{"$f":"E941+E942","v":317.95999999999998}]
[null,null,"Preço Base Codevasf:"]
[null,"Horas/dia","Dias/sem.","Dias/mês","Horas/mês"]
[null,24,7,30,{"$f":"D946*B946","v":720},"minimizado"]
[]
[null,"44 horas úteis semanais:",null,"Produtiva"]
[null,"hs/semana","semana","horas/dia","dias/sem.","horas/sem."]
[null,44,4,7,5,{"$f":"D950*E950","v":35}]
[null,"=>",{"$f":"B950*C950","v":176},"Total de horas úteis/mês"]
[]
[]
["COMPOSIÇÕES ADOTANDO CRITÉRIO DA RECEITA FEDERAL"]
[]
[]
[]
[]
[null,"CRITERIO RECEITA FEDERAL",null,"3.1.36",null,null,"3.1.38",{"$nulls":4},"3.1.39"]
[null,"CHP e CHI:"]
[null,null,"Máquina de solda, 250A (40403)",null,null,null," Lixadeira elétrica, 1400 W (13192)",null,null,null," Máquina para corte, 10 Cv (14619)"]
[null,null,"Cód.Comp.","Índice","SINAPI/PE ",null,"Cód.Comp.","Índice","SINAPI/PE ",null,null,"Índice","SINAPI/PE ",null,"1º.Pag.","ATUAL","Dif.","+ ou -"]
[null,null,"SINAPI",{"$nulls":4},"SINAPI",null,null,null,"SINAPI"]
[null,"Mês Ref.",null,null,"2022-04-01",null,null,null,"2022-04-01",null,null,null,"2022-04-01"]
[null,"Valor de Aquisição",40403,1,456.21,null,13192,null,4257.7299999999996,null,14619,null,12035.45]
[null,"taxa residual (%)",null,50,{"$f":"(D966/100)*$E$965","v":228.10499999999999},null,null,50,{"$f":"(H966/100)*$I$965","v":2128.8649999999998},null,null,50,{"$f":"(L966/100)*$M$965","v":6017.7250000000004}]
[null,"Vida útil (anos)",null,2,null,null,null,2,null,null,null,2]
[null,"Depreciação anual (R$)",null,null,{"$f":"(E965-E966)/D967","v":114.05249999999999},null,null,null,{"$f":"(I965-I966)/H967","v":1064.4324999999999},null,null,null,{"$f":"(M965-M966)/L967","v":3008.8625000000002}]
[{"$nulls":14},"Observação: vida útil adaptada para dois anos, nas ferramentas, devido ao desgaste com a intensidade (uso severo) dos serviços propostos utilizando as mesmas."]
[]
[]
[]
[null,"Valor Mensal (R$)",null,null,{"$f":"E968/12","v":9.5043749999999996},null,null,null,{"$f":"I968/12","v":88.70270833333332},null,null,null,{"$f":"M968/12","v":250.73854166666669}]
[]
[]
[]
[]
[null,"CRITERIO RECEITA FEDERAL",null,"3.1.41",{"$nulls":7},"3.1.55"]
[null,"CHP e CHI:"]
[null,null,"Martelo demolidor pneumático (SINAPI 36533)",{"$nulls":7},"Motor a diesel - 4,7 cv"]
[null,null,"Cód.Comp.","Índice","SINAPI/PE (AS)",{"$nulls":6},"Índice","SINAPI/PE (AS)",null,"1º.Pag.","ATUAL","Dif.","+ ou -"]
[null,null,"SINAPI",{"$nulls":8},"SINAPI"]
[null,"Mês Ref.",null,null,"2022-04-01",{"$nulls":7},"2022-04-01"]
[null,"Valor de Aquisição",36533,1,16519.740000000002,{"$nulls":5},39628,null,4954.4799999999996]
[null,"taxa residual (%)",null,25,{"$f":"(D985/100)*$E$984","v":4129.9350000000004},{"$nulls":6},25,{"$f":"(L985/100)*$M$984","v":1238.6199999999999}]
[null,"Vida útil (anos)",null,4,{"$nulls":7},4]
[null,"Depreciação anual (R$)",null,null,{"$f":"(E984-E985)/D986","v":3097.4512500000001},{"$nulls":7},{"$f":"(M984-M985)/L986","v":928.96499999999992}]
[{"$nulls":14},"Observação: vida útil adaptada para dois anos, nas ferramentas, devido ao desgaste com a intensidade (uso severo) dos serviços propostos utilizando as mesmas."]
[]
[]
[]
[null,"Valor Mensal (R$)",null,null,{"$f":"E987/12","v":258.12093750000003},{"$nulls":7},{"$f":"M987/12","v":77.413749999999993}]
[]
[]
[]
[]
[null,"CRITERIO RECEITA FEDERAL",null,"3.1.56",null,null,null,"3.1.57",null,null,null,"3.1.58"]
[null,"CHP e CHI:"]
[null,null,"Vibrador de imersão, ponteira 35 mm (39399)",null,null,null,"Vibrador de imersão, ponteira 45 mm (39400)",null,null,null,"Vibrador de imersão, ponteira 60 mm (39401)"]
[null,null,"Cód.Comp.","Índice","SINAPI/PE (AS)",null,"Cód.Comp.","Índice","SINAPI/PE (AS)",null,null,"Índice","SINAPI/PE (AS)",null,"1º.Pag.","ATUAL","Dif.","+ ou -"]
[null,null,"SINAPI",{"$nulls":4},"SINAPI",null,null,null,"SINAPI"]
[null,"Mês Ref.",null,null,"2022-04-01",null,null,null,"2022-04-01",null,null,null,"2022-04-01"]
[null,"Valor de Aquisição",39399,1,1614.44,null,39400,null,1754.83,null,39401,null,1968.5]
[null,"taxa residual (%)",null,50,{"$f":"(D1004/100)*$E$1003","v":807.22},null,null,50,{"$f":"(H1004/100)*$I$1003","v":877.41499999999996},null,null,50,{"$f":"(L1004/100)*$M$1003","v":984.25}]
[null,"Vida útil (anos)",null,2,null,null,null,2,null,null,null,2]
[null,"Depreciação anual (R$)",null,null,{"$f":"(E1003-E1004)/D1005","v":403.61},null,null,null,{"$f":"(I1003-I1004)/H1005","v":438.70749999999998},null,null,null,{"$f":"(M1003-M1004)/L1005","v":492.125}]
[{"$nulls":14},"Observação: vida útil adaptada para dois anos, nas ferramentas, devido ao desgaste com a intensidade (uso severo) dos serviços propostos utilizando as mesmas."]
[]
[]
[]
[null,"Valor Mensal (R$)",null,null,{"$f":"E1006/12","v":33.634166666666665},null,null,null,{"$f":"I1006/12","v":36.558958333333329},null,null,null,{"$f":"M1006/12","v":41.010416666666664}]
[]
[]
[]
[]
[null,"CRITERIO RECEITA FEDERAL",null,"3.1.51",null,null,null,"3.1.54"]
[null,"CHP e CHI:",null,"; "]
[null,null,"Torre de iluminação 4000 W (COT - TORR)",null,null,null,"Triturador de Galhos e Resíduos TR-500G à Gasolina Motor 13HP (COT - TRIT)"]
[null,null,"Cód.Comp.","Índice","COTAÇÃO",null,"Cód.Comp.","Índice","COTAÇÃO",{"$nulls":5},"1º.Pag.","ATUAL","Dif.","+ ou -"]
[null,null,"COTAÇÃO",{"$nulls":4},"COTAÇÃO"]
[null,"Mês Ref.",null,null,"2022-06-01",null,null,null,"2022-06-01"]
[null,"Valor de Aquisição","COT - TORR",1,79302.19,null,null,null,20071.7]
[null,"taxa residual (%)",null,25,{"$f":"(D1023/100)*$E$1022","v":19825.547500000001},null,null,50,{"$f":"(H1023/100)*$I$1022","v":10035.85}]
[null,"Vida útil (anos)",null,4,null,null,null,2]
[null,"Depreciação anual (R$)",null,null,{"$f":"(E1022-E1023)/D1024","v":14869.160625},null,null,null,{"$f":"(I1022-I1023)/H1024","v":5017.9250000000002}]
[{"$nulls":14},"Observação: vida útil adaptada para dois anos, no triturador, devido ao desgaste com a intensidade (uso severo) dos serviços propostos utilizando o mesmo"]
[]
[]
[]
[null,"Valor Mensal (R$)",null,null,{"$f":"E1025/12","v":1239.09671875},null,null,null,{"$f":"I1025/12","v":418.16041666666666}]
[]
[]
[]
[]
[null,"CRITERIO RECEITA FEDERAL"]
[null,"CHP e CHI:"]
[null,null,{"$f":"[4]Equipamentos!C80","v":"Andaime metálico tipo fachadeiro Dim: Largura= 1,20m / Altura por peça= 2,00m. (Altura Total=10m - 5 peças por conjunto)"},null,null,null,{"$f":"[4]Equipamentos!C97","v":"Conjunto motorbomba com 160 kW de potência no motor elétrico (25 mca x 0,5 m³/s) para esgotamento, com respectivos mangotes de sucção e descarga a serem especificados em função dos diâmetros. "},null,null,null,{"$f":"[4]Equipamentos!C98","v":"Conjunto motorbomba com 30 kW de potência no motor elétrico (25 mca x 0,1 m³/s) para esgotamento, com respectivos mangotes de sucção e descarga a serem especificados em função dos diâmetros. "}]
[null,null,"Cód.Comp.","Índice",{"$f":"C1039","v":"COT_ANDA"},null,"Cód.Comp.","Índice",{"$f":"G1039","v":"COT_CONJ_160"},null,"Cód.Comp.","Índice",{"$f":"K1039","v":"COT_CONJ_30"},null,"1º.Pag.","ATUAL","Dif.","+ ou -"]
[null,null,{"$f":"[4]Equipamentos!B80","v":"COT_ANDA"},null,"LOCAÇÃO",null,{"$f":"[4]Equipamentos!B97","v":"COT_CONJ_160"},"COTAÇÃO",null,null,{"$f":"[4]Equipamentos!B98","v":"COT_CONJ_30"}]
[null,"Mês Ref.",null,null,"2022-06-01",null,null,null,"2022-06-01",null,null,null,"2022-06-01"]
[null,"Valor de Aquisição",null,null,25.93,null,null,null,143891.07999999999,null,null,null,47930.6]
[null,"taxa residual (%)",{"$nulls":5},50,{"$f":"(H1042/100)*I1041","v":71945.539999999994},null,null,50,{"$f":"(L1042/100)*M1041","v":23965.3}]
[null,"Vida útil (anos)",{"$nulls":5},2,null,null,null,2]
[null,"Depreciação anual (R$)",{"$nulls":6},{"$f":"(I1041-I1042)/H1043","v":35972.769999999997},null,null,null,{"$f":"(M1041-M1042)/L1043","v":11982.65}]
[]
[]
[]
[]
[null,"Valor Mensal (R$)",null,null,{"$f":"E1041","v":25.93},null,null,null,{"$f":"I1044/12","v":2997.7308333333331},null,null,null,{"$f":"M1044/12","v":998.55416666666667}]
[]
[]
[]
[]
[null,"CRITERIO RECEITA FEDERAL"]
[null,"CHP e CHI:"]
[null,null,{"$f":"[4]Equipamentos!C125","v":"Soldador manual para mantas Leister Triac-st"},null,null,null,"Plataforma Aérea, altura de trabalho 16,0 m "]
[null,null,"Cód.Comp.","Índice",{"$f":"C1058","v":"COT - SOLD"},null,"Cód.Comp.","Índice",{"$f":"G1058","v":"COT_PLAT"},null,"Cód.Comp.","Índice",{"$f":"K1058","v":0},null,"1º.Pag.","ATUAL","Dif.","+ ou -"]
[null,null,{"$f":"[4]Equipamentos!B125","v":"COT - SOLD"},null,null,null,"COT_PLAT",null,"LOCAÇÃO"]
[null,"Mês Ref.",null,null,"2022-06-01",null,null,null,"2022-06-01"]
[null,"Valor de Aquisição",null,null,4893.8599999999997,null,null,null,15816.28,null,null,null,{"$f":"[4]Equipamentos!AA117","v":0}]
[null,"taxa residual (%)",null,50,{"$f":"(D1061/100)*E1060","v":2446.9299999999998},null,null,null,{"$f":"(H1061/100)*I1060","v":0},null,null,50,{"$f":"(L1061/100)*M1060","v":0}]
[null,"Vida útil (anos)",null,2,{"$nulls":7},2]
[null,"Depreciação anual (R$)",null,null,{"$f":"(E1060-E1061)/D1062","v":1223.4649999999999},{"$nulls":7},{"$f":"(M1060-M1061)/L1062","v":0}]
[]
[]
[]
[]
[null,"Valor Mensal (R$)",null,null,{"$f":"E1063/12","v":101.95541666666666},null,null,null,{"$f":"I1060","v":15816.28},null,null,null,{"$f":"M1063/12","v":0}]
[]
[]
[]
[]
[]
["COMPOSIÇÕES - EQUIPAMENTOS - MECÂNICA"]
[]
[]
[]
[null,"CRITERIO RECEITA FEDERAL",null,"1.7",null,null,"1.19",null,null,null,"1.20"]
[null,"CHP e CHI:"]
[null,null,"Talha Manual (13914 - SINAPI/PE)",null,null,null,"Escada de abrir (38476 - SINAPI/PE)",null,null,null,"Escada de marinheiro (38477 - SINAPI/PE)"]
[null,null,"Cód.Comp.","Índice","SINAPI (PE) - AS",null,"Cód.Comp.","Índice","SINAPI (PE)",null,"Cód.Comp.","Índice","SINAPI (PE)",null,"1º.Pag.","ATUAL","Dif.","+ ou -"]
[null,null,"SINAPI (PE)",null,13914,null,null,"COTAÇÃO",38476,null,null,null,38477]
[null,"Mês Ref.",null,null,"2022-04-01",null,null,null,"2022-04-01",null,null,null,"2022-04-01"]
[null,"Valor de Aquisição",13914,1,773.97,null,38476,1,443.12,null,38477,1,1254.9100000000001]
[null,"taxa residual (%)",null,50,{"$f":"(D1085/100)*$E$1084","v":386.98500000000001},null,null,15,{"$f":"(H1085/100)*$I$1084","v":66.468000000000004},null,null,15,{"$f":"(L1085/100)*$I$1084","v":66.468000000000004}]
[null,"Vida útil (anos)",null,2,null,null,null,6,null,null,null,6]
[null,"Depreciação anual (R$)",null,null,{"$f":"(E1084-E1085)/D1086","v":193.49250000000001},null,null,null,{"$f":"(I1084-I1085)/H1086","v":62.775333333333329},null,null,null,{"$f":"(M1084-M1085)/L1086","v":198.07366666666667}]
[{"$nulls":14},"Observação: vida útil adaptada para dois anos, na talha manual, devido ao desgaste com a intensidade (uso severo) dos serviços propostos utilizando o mesmo"]
[]
[]
[]
[null,"Valor Mensal (R$)",null,null,{"$f":"E1087/12","v":16.124375000000001},null,null,null,{"$f":"I1087/12","v":5.2312777777777777},null,null,null,{"$f":"M1087/12","v":16.506138888888888}]
[]
[]
[]
[null,"CRITERIO RECEITA FEDERAL",null,"1.24",null,null,null,"1.44"]
[null,"CHP e CHI:"]
[null,null,"Esmerilhadeira angular (11359 - SINAPI/PE)",null,null,null,"Talha capacidade 3t (10740 - SINAPI/PE)"]
[null,null,"Cód.Comp.","Índice","SINAPI (PE)",null,"Cód.Comp.","Índice","SINAPI (PE) - AS",null,"Cód.Comp.","Índice","SINAPI (PE)",null,"1º.Pag.","ATUAL","Dif.","+ ou -"]
[null,null,"SINAPI (PE)",null,11359,null,null,"SINAPI",10740]
[null,"Mês Ref.",null,null,"2022-04-01",null,null,null,"2022-04-01"]
[null,"Valor de Aquisição",11359,1,683,null,10740,1,10697.06]
[null,"taxa residual (%)",null,50,{"$f":"(D1103/100)*$E$1102","v":341.5},null,null,15,{"$f":"(H1103/100)*$I$1102","v":1604.559}]
[null,"Vida útil (anos)",null,2,null,null,null,6]
[null,"Depreciação anual (R$)",null,null,{"$f":"(E1102-E1103)/D1104","v":170.75},null,null,null,{"$f":"(I1102-I1103)/H1104","v":1515.4168333333334}]
[{"$nulls":14},"Observação: vida útil adaptada para dois anos, na talha manual, devido ao desgaste com a intensidade (uso severo) dos serviços propostos utilizando o mesmo"]
[]
[]
[]
[null,"Valor Mensal (R$)",null,null,{"$f":"E1105/12","v":14.229166666666666},null,null,null,{"$f":"I1105/12","v":126.28473611111112}]
[]
[]
[]
[null,"CRITERIO RECEITA FEDERAL",null,"1.1",null,null,null,"1.2",null,null,null,"1.3"]
[null,"CHP e CHI:"]
[null,null,{"$f":"[4]Equipamentos!C16","v":"Aferidor de manômetro de 0 a 150 bar "},null,null,null,{"$f":"[4]Equipamentos!C17","v":"Almotolia de bico flexível 500ml"},null,null,null,{"$f":"[4]Equipamentos!C18","v":"Almotolia de bico rígido 500ml"}]
[null,null,"Cód.Comp.","Índice",{"$f":"C1118","v":"COT_AFER"},null,"Cód.Comp.","Índice",{"$f":"G1118","v":"COT_ALMO_FLEX"},null,"Cód.Comp.","Índice",{"$f":"K1118","v":"COT_ALMO_RIG"},null,"1º.Pag.","ATUAL","Dif.","+ ou -"]
[null,null,{"$f":"E1117","v":"COT_AFER"},null,null,null,{"$f":"[4]Equipamentos!B17","v":"COT_ALMO_FLEX"},"COTAÇÃO",null,null,{"$f":"[4]Equipamentos!B18","v":"COT_ALMO_RIG"}]
[null,"Mês Ref."]
[null,"Valor de Aquisição",null,null,1599.96,null,null,null,38.97,null,null,null,55.05]
[null,"taxa residual (%)",null,50,{"$f":"(D1121/100)*E1120","v":799.98},null,null,50,{"$f":"(H1121/100)*I1120","v":19.484999999999999},null,null,50,{"$f":"(L1121/100)*M1120","v":27.524999999999999}]
[null,"Vida útil (anos)",null,2,null,null,null,2,null,null,null,2]
[null,"Depreciação anual (R$)",null,null,{"$f":"(E1120-E1121)/D1122","v":399.99},null,null,null,{"$f":"(I1120-I1121)/H1122","v":9.7424999999999997},null,null,null,{"$f":"(M1120-M1121)/L1122","v":13.762499999999999}]
[{"$nulls":14},"Observação: vida útil adaptada para dois anos, na talha manual, devido ao desgaste com a intensidade (uso severo) dos serviços propostos utilizando o mesmo"]
[]
[]
[]
[null,"Valor Mensal (R$)",null,null,{"$f":"E1123/12","v":33.332500000000003},null,null,null,{"$f":"I1123/12","v":0.81187500000000001},null,null,null,{"$f":"M1123/12","v":1.1468749999999999}]
[]
[]
[]
[null,"CRITERIO RECEITA FEDERAL",null,"1.5",null,null,null,"1.6",null,null,null,"1.8"]
[null,"CHP e CHI:"]
[null,null,{"$f":"[4]Equipamentos!C20","v":"Bancada para oficina (Dim: 1,2m x 2,5m) "},null,null,null,{"$f":"[4]Equipamentos!C21","v":"Bomba de graxa manual 5kg "},null,null,null,{"$f":"[4]Equipamentos!C23","v":"Chave de impacto 46mm boca/estria "}]
[null,null,"Cód.Comp.","Índice",{"$f":"C1136","v":"COT_BANC_OFIC"},null,"Cód.Comp.","Índice",{"$f":"G1136","v":"COT_BOMB_GRAX"},null,"Cód.Comp.","Índice",{"$f":"K1136","v":"COT_CHAV_46"},null,"1º.Pag.","ATUAL","Dif.","+ ou -"]
[null,null,{"$f":"[4]Equipamentos!B20","v":"COT_BANC_OFIC"},null,null,null,{"$f":"[4]Equipamentos!B21","v":"COT_BOMB_GRAX"},"COTAÇÃO",null,null,{"$f":"[4]Equipamentos!B23","v":"COT_CHAV_46"}]
[null,"Mês Ref."]
[null,"Valor de Aquisição",null,null,2023.53,null,null,null,273.83999999999997,null,null,null,126.53]
[null,"taxa residual (%)",null,50,{"$f":"(D1139/100)*E1138","v":1011.765},null,null,50,{"$f":"(H1139/100)*I1138","v":136.91999999999999},null,null,50,{"$f":"(L1139/100)*M1138","v":63.265000000000001}]
[null,"Vida útil (anos)",null,2,null,null,null,2,null,null,null,2]
[null,"Depreciação anual (R$)",null,null,{"$f":"(E1138-E1139)/D1140","v":505.88249999999999},null,null,null,{"$f":"(I1138-I1139)/H1140","v":68.459999999999994},null,null,null,{"$f":"(M1138-M1139)/L1140","v":31.6325}]
[{"$nulls":14},"Observação: vida útil adaptada para dois anos, na talha manual, devido ao desgaste com a intensidade (uso severo) dos serviços propostos utilizando o mesmo"]
[]
[]
[]
[null,"Valor Mensal (R$)",null,null,{"$f":"E1141/12","v":42.156874999999999},null,null,null,{"$f":"I1141/12","v":5.7049999999999992},null,null,null,{"$f":"M1141/12","v":2.6360416666666668}]
[]
[]
[]
[null,"CRITERIO RECEITA FEDERAL",null,"1.9",null,null,null,"1.10",null,null,null,"1.11"]
[null,"CHP e CHI:"]
[null,null,{"$f":"[4]Equipamentos!C24","v":"Chave de impacto 55mm boca/estria "},null,null,null,{"$f":"[4]Equipamentos!C25","v":"Chave de impacto 60mm boca/estria "},null,null,null,{"$f":"[4]Equipamentos!C26","v":"Chave de impacto 65mm boca/estria "}]
[null,null,"Cód.Comp.","Índice",{"$f":"C1154","v":"COT_CHAV_55"},null,"Cód.Comp.","Índice",{"$f":"G1154","v":"COT_CHAV_60"},null,"Cód.Comp.","Índice",{"$f":"K1154","v":"COT_CHAV_65"},null,"1º.Pag.","ATUAL","Dif.","+ ou -"]
[null,null,{"$f":"[4]Equipamentos!B24","v":"COT_CHAV_55"},null,null,null,{"$f":"[4]Equipamentos!B25","v":"COT_CHAV_60"},"COTAÇÃO",null,null,{"$f":"[4]Equipamentos!B26","v":"COT_CHAV_65"}]
[null,"Mês Ref."]
[null,"Valor de Aquisição",null,null,264,null,null,null,293.42,null,null,null,306.3]
[null,"taxa residual (%)",null,50,{"$f":"(D1157/100)*E1156","v":132},null,null,15,{"$f":"(H1157/100)*I1156","v":44.012999999999998},null,null,15,{"$f":"(L1157/100)*M1156","v":45.945}]
[null,"Vida útil (anos)",null,2,null,null,null,6,null,null,null,6]
[null,"Depreciação anual (R$)",null,null,{"$f":"(E1156-E1157)/D1158","v":66},null,null,null,{"$f":"(I1156-I1157)/H1158","v":41.567833333333333},null,null,null,{"$f":"(M1156-M1157)/L1158","v":43.392500000000005}]
[{"$nulls":14},"Observação: vida útil adaptada para dois anos, na talha manual, devido ao desgaste com a intensidade (uso severo) dos serviços propostos utilizando o mesmo"]
[]
[]
[]
[null,"Valor Mensal (R$)",null,null,{"$f":"E1159/12","v":5.5},null,null,null,{"$f":"I1159/12","v":3.4639861111111112},null,null,null,{"$f":"M1159/12","v":3.6160416666666673}]
[]
[]
[]
[null,"CRITERIO RECEITA FEDERAL",null,"1.12",null,null,null,"1.13",null,null,null,"1.14"]
[null,"CHP e CHI:"]
[null,null,{"$f":"[4]Equipamentos!C27","v":"Chave de impacto 70mm boca/estria "},null,null,null,{"$f":"[4]Equipamentos!C28","v":"Chave de impacto 75mm boca/estria"},null,null,null,{"$f":"[4]Equipamentos!C29","v":"Chave de impacto 85mm boca/estria"}]
[null,null,"Cód.Comp.","Índice",{"$f":"C1172","v":"COT_CHAV_70"},null,"Cód.Comp.","Índice",{"$f":"G1172","v":"COT_CHAV_75"},null,"Cód.Comp.","Índice",{"$f":"K1172","v":"COT_CHAV_85"},null,"1º.Pag.","ATUAL","Dif.","+ ou -"]
[null,null,{"$f":"[4]Equipamentos!B27","v":"COT_CHAV_70"},null,null,null,{"$f":"[4]Equipamentos!B28","v":"COT_CHAV_75"},"COTAÇÃO",null,null,{"$f":"[4]Equipamentos!B29","v":"COT_CHAV_85"}]
[null,"Mês Ref."]
[null,"Valor de Aquisição",null,null,320.22000000000003,null,null,null,499.77,null,null,null,854.63]
[null,"taxa residual (%)",null,50,{"$f":"(D1175/100)*E1174","v":160.11000000000001},null,null,15,{"$f":"(H1175/100)*I1174","v":74.965499999999992},null,null,15,{"$f":"(L1175/100)*M1174","v":128.19450000000001}]
[null,"Vida útil (anos)",null,2,null,null,null,6,null,null,null,6]
[null,"Depreciação anual (R$)",null,null,{"$f":"(E1174-E1175)/D1176","v":80.055000000000007},null,null,null,{"$f":"(I1174-I1175)/H1176","v":70.800749999999994},null,null,null,{"$f":"(M1174-M1175)/L1176","v":121.07258333333334}]
[{"$nulls":14},"Observação: vida útil adaptada para dois anos, na talha manual, devido ao desgaste com a intensidade (uso severo) dos serviços propostos utilizando o mesmo"]
[]
[]
[]
[null,"Valor Mensal (R$)",null,null,{"$f":"E1177/12","v":6.6712500000000006},null,null,null,{"$f":"I1177/12","v":5.9000624999999998},null,null,null,{"$f":"M1177/12","v":10.089381944444446}]
[]
[]
[]
[null,"CRITERIO RECEITA FEDERAL",null,"1.15",null,null,null,"1.16",null,null,null,"1.17"]
[null,"CHP e CHI:"]
[null,null,{"$f":"[4]Equipamentos!C30","v":"Cinta para elevação de carga (comprimento: 3m / capacidade de carga: 3t)"},null,null,null,{"$f":"[4]Equipamentos!C31","v":"Cinta para elevação de carga  (comprimento: 6m / capacidade de carga: 20t)"},null,null,null,{"$f":"[4]Equipamentos!C32","v":"Cortador a frio para tubos - Cortador Tubo Ferro Ferrari 1/8\" - 2\""}]
[null,null,"Cód.Comp.","Índice",{"$f":"C1190","v":"COT_CINT_3T"},null,"Cód.Comp.","Índice",{"$f":"G1190","v":"COT_CINT_20T"},null,"Cód.Comp.","Índice",{"$f":"K1190","v":"COT_CORT"},null,"1º.Pag.","ATUAL","Dif.","+ ou -"]
[null,null,{"$f":"[4]Equipamentos!B30","v":"COT_CINT_3T"},null,null,null,{"$f":"[4]Equipamentos!B31","v":"COT_CINT_20T"},"COTAÇÃO",null,null,{"$f":"[4]Equipamentos!B32","v":"COT_CORT"}]
[null,"Mês Ref."]
[null,"Valor de Aquisição",null,null,110.65,null,null,null,1315.95,null,null,null,1029.2]
[null,"taxa residual (%)",null,50,{"$f":"(D1193/100)*E1192","v":55.325000000000003},null,null,50,{"$f":"(H1193/100)*I1192","v":657.97500000000002},null,null,50,{"$f":"(L1193/100)*M1192","v":514.6}]
[null,"Vida útil (anos)",null,2,null,null,null,2,null,null,null,2]
[null,"Depreciação anual (R$)",null,null,{"$f":"(E1192-E1193)/D1194","v":27.662500000000001},null,null,null,{"$f":"(I1192-I1193)/H1194","v":328.98750000000001},null,null,null,{"$f":"(M1192-M1193)/L1194","v":257.3}]
[{"$nulls":14},"Observação: vida útil adaptada para dois anos, na talha manual, devido ao desgaste com a intensidade (uso severo) dos serviços propostos utilizando o mesmo"]
[]
[]
[]
[null,"Valor Mensal (R$)",null,null,{"$f":"E1195/12","v":2.3052083333333333},null,null,null,{"$f":"I1195/12","v":27.415625000000002},null,null,null,{"$f":"M1195/12","v":21.441666666666666}]
[]
[]
[]
[null,"CRITERIO RECEITA FEDERAL",null,"1.18",null,null,null,"1.21",null,null,null,"1.22"]
[null,"CHP e CHI:"]
[null,null,{"$f":"[4]Equipamentos!C33","v":"Curvador de tubos (Até 1”) - Curvador e Dobrador De Tubos Manual"},null,null,null,{"$f":"[4]Equipamentos!C36","v":"Escada metálica de 07 degraus "},null,null,null,{"$f":"[4]Equipamentos!C37","v":"Escada articulada multifuncional 4x4 16 degraus"}]
[null,null,"Cód.Comp.","Índice",{"$f":"C1208","v":"COT_CURV"},null,"Cód.Comp.","Índice",{"$f":"G1208","v":"COT_ESCA_07"},null,"Cód.Comp.","Índice",{"$f":"K1208","v":"COT_ESCA_16"},null,"1º.Pag.","ATUAL","Dif.","+ ou -"]
[null,null,{"$f":"[4]Equipamentos!B33","v":"COT_CURV"},null,null,null,{"$f":"[4]Equipamentos!B36","v":"COT_ESCA_07"},"COTAÇÃO",null,null,{"$f":"[4]Equipamentos!B37","v":"COT_ESCA_16"}]
[null,"Mês Ref."]
[null,"Valor de Aquisição",null,null,2235.58,null,null,null,365.29,null,null,null,906.92]
[null,"taxa residual (%)",null,50,{"$f":"(D1211/100)*E1210","v":1117.79},null,null,50,{"$f":"(H1211/100)*I1210","v":182.64500000000001},null,null,50,{"$f":"(L1211/100)*M1210","v":453.46}]
[null,"Vida útil (anos)",null,2,null,null,null,2,null,null,null,2]
[null,"Depreciação anual (R$)",null,null,{"$f":"(E1210-E1211)/D1212","v":558.89499999999998},null,null,null,{"$f":"(I1210-I1211)/H1212","v":91.322500000000005},null,null,null,{"$f":"(M1210-M1211)/L1212","v":226.73}]
[{"$nulls":14},"Observação: vida útil adaptada para dois anos, na talha manual, devido ao desgaste com a intensidade (uso severo) dos serviços propostos utilizando o mesmo"]
[]
[]
[]
[null,"Valor Mensal (R$)",null,null,{"$f":"E1213/12","v":46.574583333333329},null,null,null,{"$f":"I1213/12","v":7.6102083333333335},null,null,null,{"$f":"M1213/12","v":18.894166666666667}]
[]
[]
[]
[null,"CRITERIO RECEITA FEDERAL",null,"1.23",null,null,null,"1.26",null,null,null,"1.27"]
[null,"CHP e CHI:"]
[null,null,{"$f":"[4]Equipamentos!C38","v":"Esmerilhadeira angular de 4 ½” "},null,null,null,{"$f":"[4]Equipamentos!C41","v":"TORQUEADEIRA RT-50 ATLAS COPCO (ENCAIXE 2.1/2\") - DE 10.675NM A 71.169NM"},null,null,null,{"$f":"[4]Equipamentos!C42","v":"Indutor elétrico para aquecimento de rolamentos (JM 500) "}]
[null,null,"Cód.Comp.","Índice",{"$f":"C1226","v":"COT_ESME"},null,"Cód.Comp.","Índice",{"$f":"G1226","v":"COT_TORQ"},null,"Cód.Comp.","Índice",{"$f":"K1226","v":"COT_INDU"},null,"1º.Pag.","ATUAL","Dif.","+ ou -"]
[null,null,{"$f":"[4]Equipamentos!B38","v":"COT_ESME"},null,null,null,{"$f":"[4]Equipamentos!B41","v":"COT_TORQ"},"COTAÇÃO","VALOR DE LOCAÇÃO",null,{"$f":"[4]Equipamentos!B42","v":"COT_INDU"}]
[null,"Mês Ref."]
[null,"Valor de Aquisição",null,null,349.05,{"$nulls":7},17132.830000000002]
[null,"taxa residual (%)",null,50,{"$f":"(D1229/100)*E1228","v":174.52500000000001},{"$nulls":6},50,{"$f":"(L1229/100)*M1228","v":8566.4150000000009}]
[null,"Vida útil (anos)",null,2,{"$nulls":7},2]
[null,"Depreciação anual (R$)",null,null,{"$f":"(E1228-E1229)/D1230","v":87.262500000000003},{"$nulls":7},{"$f":"(M1228-M1229)/L1230","v":4283.2075000000004}]
[{"$nulls":14},"Observação: vida útil adaptada para dois anos, na talha manual, devido ao desgaste com a intensidade (uso severo) dos serviços propostos utilizando o mesmo"]
[]
[]
[]
[null,"Valor Mensal (R$)",null,null,{"$f":"E1231/12","v":7.2718750000000005},null,null,null,10733.82,null,null,null,{"$f":"M1231/12","v":356.93395833333335}]
[]
[]
[]
[null,"CRITERIO RECEITA FEDERAL",null,"1.28",null,null,null,"1.29",null,null,null,"1.30"]
[null,"CHP e CHI:"]
[null,null,{"$f":"[4]Equipamentos!C43","v":"Lixadeira 4 1/2\" "},null,null,null,{"$f":"[4]Equipamentos!C44","v":"Macaco de comando a distância 20 t - Macaco Hidráulico 20 Toneladas Tipo Garrafa"},null,null,null,{"$f":"[4]Equipamentos!C45","v":"Macaco de comando a distância 50 t - Macaco Hidráulico 50 Toneladas Tipo Garrafa"}]
[null,null,"Cód.Comp.","Índice",{"$f":"C1244","v":"COT_LIXA"},null,"Cód.Comp.","Índice",{"$f":"G1244","v":"COT_MACA_20T"},null,"Cód.Comp.","Índice",{"$f":"K1244","v":"COT_MACA_50T"},null,"1º.Pag.","ATUAL","Dif.","+ ou -"]
[null,null,{"$f":"[4]Equipamentos!B43","v":"COT_LIXA"},null,null,null,{"$f":"[4]Equipamentos!B44","v":"COT_MACA_20T"},"COTAÇÃO",null,null,{"$f":"[4]Equipamentos!B45","v":"COT_MACA_50T"}]
[null,"Mês Ref."]
[null,"Valor de Aquisição",null,null,433,null,null,null,807.64,null,null,null,1616.88]
[null,"taxa residual (%)",null,50,{"$f":"(D1247/100)*E1246","v":216.5},null,null,50,{"$f":"(H1247/100)*I1246","v":403.82},null,null,50,{"$f":"(L1247/100)*M1246","v":808.44}]
[null,"Vida útil (anos)",null,2,null,null,null,2,null,null,null,2]
[null,"Depreciação anual (R$)",null,null,{"$f":"(E1246-E1247)/D1248","v":108.25},null,null,null,{"$f":"(I1246-I1247)/H1248","v":201.91},null,null,null,{"$f":"(M1246-M1247)/L1248","v":404.22}]
[{"$nulls":14},"Observação: vida útil adaptada para dois anos, na talha manual, devido ao desgaste com a intensidade (uso severo) dos serviços propostos utilizando o mesmo"]
[]
[]
[]
[null,"Valor Mensal (R$)",null,null,{"$f":"E1249/12","v":9.0208333333333339},null,null,null,{"$f":"I1249/12","v":16.825833333333332},null,null,null,{"$f":"M1249/12","v":33.685000000000002}]
[]
[]
[]
[null,"CRITERIO RECEITA FEDERAL"]
[null,"CHP e CHI:",null,"1.31",null,null,null,"1.32",null,null,null,"1.34"]
[null,null,{"$f":"[4]Equipamentos!C46","v":"Macaco tipo elevador capacidade de 2 t - Macaco Hidráulico 2 Toneladas tipo Garrafa"},null,null,null,{"$f":"[4]Equipamentos!C47","v":"Macaco tipo girafa de 2 t - Guincho Hidráulico 2 Toneladas com Prolongador"},null,null,null,{"$f":"[4]Equipamentos!C49","v":"Morsa para bancada nº 08 "}]
[null,null,"Cód.Comp.","Índice",{"$f":"C1262","v":"COT_MACA_2T"},null,"Cód.Comp.","Índice",{"$f":"G1262","v":"COT_MACA_GIR"},null,"Cód.Comp.","Índice",{"$f":"K1262","v":"COT_MORS"},null,"1º.Pag.","ATUAL","Dif.","+ ou -"]
[null,null,{"$f":"[4]Equipamentos!B46","v":"COT_MACA_2T"},null,null,null,{"$f":"[4]Equipamentos!B47","v":"COT_MACA_GIR"},"COTAÇÃO",null,null,{"$f":"[4]Equipamentos!B49","v":"COT_MORS"}]
[null,"Mês Ref."]
[null,"Valor de Aquisição",null,null,196.04,null,null,null,4476.0600000000004,null,null,null,446.37]
[null,"taxa residual (%)",null,50,{"$f":"(D1265/100)*E1264","v":98.02},null,null,50,{"$f":"(H1265/100)*I1264","v":2238.0300000000002},null,null,50,{"$f":"(L1265/100)*M1264","v":223.185}]
[null,"Vida útil (anos)",null,2,null,null,null,2,null,null,null,2]
[null,"Depreciação anual (R$)",null,null,{"$f":"(E1264-E1265)/D1266","v":49.01},null,null,null,{"$f":"(I1264-I1265)/H1266","v":1119.0150000000001},null,null,null,{"$f":"(M1264-M1265)/L1266","v":111.5925}]
[{"$nulls":14},"Observação: vida útil adaptada para dois anos, na talha manual, devido ao desgaste com a intensidade (uso severo) dos serviços propostos utilizando o mesmo"]
[]
[]
[]
[null,"Valor Mensal (R$)",null,null,{"$f":"E1267/12","v":4.0841666666666665},null,null,null,{"$f":"I1267/12","v":93.251250000000013},null,null,null,{"$f":"M1267/12","v":9.2993749999999995}]
[]
[]
[]
[null,"CRITERIO RECEITA FEDERAL"]
[null,"CHP e CHI:",null,"1.35",null,null,null,"1.37",null,null,null,"1.38"]
[null,null,{"$f":"[4]Equipamentos!C51","v":"Bomba Submersível 5 Cv Trifásica 380V, Q=2 - 52 m3/h e H= 3-25 mca.(Poço de rebaixamento do Res. de areias (Estrutura de Controle)"},null,null,null,{"$f":"[4]Equipamentos!C52","v":"Motoesmeril de 1cv - 3.500 RPM "},null,null,null,{"$f":"[4]Equipamentos!C53","v":"Multiplicador de Torque Manual 2700 N.m/2000 lb.ft CDI GA190"}]
[null,null,"Cód.Comp.","Índice",{"$f":"C1280","v":"COT_BOMB_SUB"},null,"Cód.Comp.","Índice",{"$f":"G1280","v":"COT_MOTO_ESMER"},null,"Cód.Comp.","Índice",{"$f":"K1280","v":"COT_MULT"},null,"1º.Pag.","ATUAL","Dif.","+ ou -"]
[null,null,{"$f":"[4]Equipamentos!B51","v":"COT_BOMB_SUB"},null,null,null,{"$f":"[4]Equipamentos!B52","v":"COT_MOTO_ESMER"},"COTAÇÃO",null,null,{"$f":"[4]Equipamentos!B53","v":"COT_MULT"}]
[null,"Mês Ref."]
[null,"Valor de Aquisição",null,null,14152.55,null,null,null,1067.8699999999999,null,null,null,3203.56]
[null,"taxa residual (%)",null,50,{"$f":"(D1283/100)*E1282","v":7076.2749999999996},null,null,50,{"$f":"(H1283/100)*I1282","v":533.93499999999995},null,null,50,{"$f":"(L1283/100)*M1282","v":1601.78}]
[null,"Vida útil (anos)",null,2,null,null,null,2,null,null,null,2]
[null,"Depreciação anual (R$)",null,null,{"$f":"(E1282-E1283)/D1284","v":3538.1374999999998},null,null,null,{"$f":"(I1282-I1283)/H1284","v":266.96749999999997},null,null,null,{"$f":"(M1282-M1283)/L1284","v":800.89}]
[{"$nulls":14},"Observação: vida útil adaptada para dois anos, na talha manual, devido ao desgaste com a intensidade (uso severo) dos serviços propostos utilizando o mesmo"]
[]
[]
[]
[null,"Valor Mensal (R$)",null,null,{"$f":"E1285/12","v":294.84479166666665},null,null,null,{"$f":"I1285/12","v":22.247291666666666},null,null,null,{"$f":"M1285/12","v":66.740833333333327}]
[]
[]
[]
[null,"CRITERIO RECEITA FEDERAL"]
[null,"CHP e CHI:",null,"1.40",null,null,null,"1.41",null,null,null,"1.45"]
[null,null,{"$f":"[4]Equipamentos!C55","v":"Parafusadeira elétrica a bateria "},null,null,null,{"$f":"[4]Equipamentos!C56","v":"Prensa hidráulica de 10 ton "},null,null,null,{"$f":"[4]Equipamentos!C60","v":"Tifor 3t"}]
[null,null,"Cód.Comp.","Índice",{"$f":"C1298","v":"COT_PARA"},null,"Cód.Comp.","Índice",{"$f":"G1298","v":"COT_PREN"},null,"Cód.Comp.","Índice",{"$f":"K1298","v":"COT_TIFO"},null,"1º.Pag.","ATUAL","Dif.","+ ou -"]
[null,null,{"$f":"[4]Equipamentos!B55","v":"COT_PARA"},null,null,null,{"$f":"[4]Equipamentos!B56","v":"COT_PREN"},"COTAÇÃO",null,null,{"$f":"[4]Equipamentos!B60","v":"COT_TIFO"}]
[null,"Mês Ref."]
[null,"Valor de Aquisição",null,null,948.98,null,null,null,1466.85,null,null,null,4609.42]
[null,"taxa residual (%)",null,50,{"$f":"(D1301/100)*E1300","v":474.49},null,null,50,{"$f":"(H1301/100)*I1300","v":733.42499999999995},null,null,50,{"$f":"(L1301/100)*M1300","v":2304.71}]
[null,"Vida útil (anos)",null,2,null,null,null,2,null,null,null,2]
[null,"Depreciação anual (R$)",null,null,{"$f":"(E1300-E1301)/D1302","v":237.245},null,null,null,{"$f":"(I1300-I1301)/H1302","v":366.71249999999998},null,null,null,{"$f":"(M1300-M1301)/L1302","v":1152.355}]
[{"$nulls":14},"Observação: vida útil adaptada para dois anos, na talha manual, devido ao desgaste com a intensidade (uso severo) dos serviços propostos utilizando o mesmo"]
[]
[]
[]
[null,"Valor Mensal (R$)",null,null,{"$f":"E1303/12","v":19.770416666666666},null,null,null,{"$f":"I1303/12","v":30.559374999999999},null,null,null,{"$f":"M1303/12","v":96.029583333333335}]
[]
[]
[]
[null,"CRITERIO RECEITA FEDERAL"]
[null,"CHP e CHI:"]
[null,null,{"$f":"[4]Equipamentos!C19","v":"Andaime metálico tipo fachadeiro Dim: Largura= 1,20m / Altura por peça= 2,00m. (Altura Total=10m - 5 peças por conjunto)"}]
[null,null,"Cód.Comp.","Índice",{"$f":"C1316","v":"COT_ANDA"},null,"Cód.Comp.","Índice",null,null,"Cód.Comp.","Índice",null,null,"1º.Pag.","ATUAL","Dif.","+ ou -"]
[null,null,{"$f":"[4]Equipamentos!B19","v":"COT_ANDA"}]
[null,"Mês Ref."]
[null,"Valor de locação",null,null,25.93,null,null,null,{"$f":"[4]Equipamentos!AA374","v":0},null,null,null,{"$f":"[4]Equipamentos!AA375","v":0}]
[null,"taxa residual (%)",{"$nulls":5},50,{"$f":"(H1319/100)*I1318","v":0},null,null,50,{"$f":"(L1319/100)*M1318","v":0}]
[null,"Vida útil (anos)",{"$nulls":5},2,null,null,null,2]
[null,"Depreciação anual (R$)",{"$nulls":6},{"$f":"(I1318-I1319)/H1320","v":0},null,null,null,{"$f":"(M1318-M1319)/L1320","v":0}]
[]
[]
[]
[]
[null,"Valor Mensal (R$)",null,null,25.93,null,null,null,{"$f":"I1321/12","v":0},null,null,null,{"$f":"M1321/12","v":0}]
[]
[]
[]
["COMPOSIÇÕES - EQUIPAMENTOS - ELÉTRICA"]
[]
[]
[]
[null,"CRITERIO RECEITA FEDERAL",null,"2.6",{"$nulls":4},"2.8"]
[null,"CHP e CHI:"]
[null,null,"Fonte de alimentação com tensão variável (10236 - ORSE/SE)",null,null,null,"Furadeira Manual (I9376 - SEINFRA/CE)"]
[null,null,"Cód.Comp.","Índice","ORSE (SE)",null,"Cód.Comp.","Índice","SEINFRA/CE",null,"Cód.Comp.","Índice","SINAPI (PE)",null,"1º.Pag.","ATUAL","Dif.","+ ou -"]
[null,null,"ORSE (SE)",null,10236,null,"SEINFRA/CE",null,"I9376"]
[null,"Mês Ref.",null,null,"2022-03-01",null,null,null,"027"]
[null,"Valor de Aquisição",10236,1,193,null,"I9376",1,903]
[null,"taxa residual (%)",null,50,{"$f":"(D1341/100)*$E$1340","v":96.5},null,null,50,{"$f":"(H1341/100)*$I$1340","v":451.5}]
[null,"Vida útil (anos)",null,2,null,null,null,2]
[null,"Depreciação anual (R$)",null,null,{"$f":"(E1340-E1341)/D1342","v":48.25},null,null,null,{"$f":"(I1340-I1341)/H1342","v":225.75}]
[{"$nulls":14},"Observação: vida útil adaptada para dois anos, na talha manual, devido ao desgaste com a intensidade (uso severo) dos serviços propostos utilizando o mesmo"]
[]
[]
[]
[null,"Valor Mensal (R$)",null,null,{"$f":"E1343/12","v":4.020833333333333},null,null,null,{"$f":"I1343/12","v":18.8125}]
[]
[]
[]
[null,"CRITERIO RECEITA FEDERAL"]
[null,"CHP e CHI:"]
[null,null,{"$f":"[4]Equipamentos!C64","v":"Analisador de grandezas elétricas trifásico, display LCD colorido 5,6\", TRMS 1.000 V, corrente 3.000A "},null,null,null,{"$f":"[4]Equipamentos!C65","v":"Bancada de teste, amperimetro 150A, voltímetro 40V "},null,null,null,{"$f":"[4]Equipamentos!C66","v":"Bancada protegida contra eletricidade estática "}]
[null,null,"Cód.Comp.","Índice",{"$f":"C1356","v":"COT_ANAL"},null,"Cód.Comp.","Índice",{"$f":"G1356","v":"COT_BANC_TESTE"},null,"Cód.Comp.","Índice",{"$f":"K1356","v":"COT_BANC_PROT"},null,"1º.Pag.","ATUAL","Dif.","+ ou -"]
[null,null,{"$f":"[4]Equipamentos!B64","v":"COT_ANAL"},null,null,null,{"$f":"[4]Equipamentos!B65","v":"COT_BANC_TESTE"},"COTAÇÃO",null,null,{"$f":"[4]Equipamentos!B66","v":"COT_BANC_PROT"}]
[null,"Mês Ref."]
[null,"Valor de Aquisição",null,null,35072.980000000003,null,null,null,6021.78,null,null,null,3221.2]
[null,"taxa residual (%)",null,50,{"$f":"(D1359/100)*E1358","v":17536.490000000002},null,null,50,{"$f":"(H1359/100)*I1358","v":3010.89},null,null,50,{"$f":"(L1359/100)*M1358","v":1610.6}]
[null,"Vida útil (anos)",null,2,null,null,null,2,null,null,null,2]
[null,"Depreciação anual (R$)",null,null,{"$f":"(E1358-E1359)/D1360","v":8768.2450000000008},null,null,null,{"$f":"(I1358-I1359)/H1360","v":1505.4449999999999},null,null,null,{"$f":"(M1358-M1359)/L1360","v":805.3}]
[{"$nulls":14},"Observação: vida útil adaptada para dois anos, na talha manual, devido ao desgaste com a intensidade (uso severo) dos serviços propostos utilizando o mesmo"]
[]
[]
[]
[null,"Valor Mensal (R$)",null,null,{"$f":"E1361/12","v":730.68708333333336},null,null,null,{"$f":"I1361/12","v":125.45375},null,null,null,{"$f":"M1361/12","v":67.108333333333334}]
[]
[]
[]
[null,"CRITERIO RECEITA FEDERAL"]
[null,"CHP e CHI:"]
[null,null,{"$f":"[4]Equipamentos!C67","v":"Data Logger de 4 a 20 mA (verificação de intermitência em instrumentação) "},null,null,null,{"$f":"[4]Equipamentos!C70","v":"Fonte de bancada 12 V "},null,null,null,{"$f":"[4]Equipamentos!C72","v":"Gerador de corrente e tensão de 0 a 20 mA e 0 a 10V, precisão de 0,1% "}]
[null,null,"Cód.Comp.","Índice",{"$f":"C1374","v":"COT_DATA"},null,"Cód.Comp.","Índice",{"$f":"G1374","v":"COT_FONT"},null,"Cód.Comp.","Índice",{"$f":"K1374","v":"COT_GERA"},null,"1º.Pag.","ATUAL","Dif.","+ ou -"]
[null,null,{"$f":"[4]Equipamentos!B67","v":"COT_DATA"},null,null,null,{"$f":"[4]Equipamentos!B70","v":"COT_FONT"},"COTAÇÃO",null,null,{"$f":"[4]Equipamentos!B72","v":"COT_GERA"}]
[null,"Mês Ref."]
[null,"Valor de Aquisição",null,null,1104.53,null,null,null,733.94,null,null,null,166.31]
[null,"taxa residual (%)",null,50,{"$f":"(D1377/100)*E1376","v":552.26499999999999},null,null,50,{"$f":"(H1377/100)*I1376","v":366.97},null,null,50,{"$f":"(L1377/100)*M1376","v":83.155000000000001}]
[null,"Vida útil (anos)",null,2,null,null,null,2,null,null,null,2]
[null,"Depreciação anual (R$)",null,null,{"$f":"(E1376-E1377)/D1378","v":276.13249999999999},null,null,null,{"$f":"(I1376-I1377)/H1378","v":183.48500000000001},null,null,null,{"$f":"(M1376-M1377)/L1378","v":41.577500000000001}]
[{"$nulls":14},"Observação: vida útil adaptada para dois anos, na talha manual, devido ao desgaste com a intensidade (uso severo) dos serviços propostos utilizando o mesmo"]
[]
[]
[]
[null,"Valor Mensal (R$)",null,null,{"$f":"E1379/12","v":23.011041666666667},null,null,null,{"$f":"I1379/12","v":15.290416666666667},null,null,null,{"$f":"M1379/12","v":3.4647916666666667}]
[]
[]
[]
[null,"CRITERIO RECEITA FEDERAL"]
[null,"CHP e CHI:"]
[null,null,{"$f":"[4]Equipamentos!C73","v":"Kit para enchimento e complementação para gás SF6, composto de adaptador ,regulador, mangueira e manômetro padrão "},null,null,null,{"$f":"[4]Equipamentos!C74","v":"TTR - medidor digital de relação de espiras, escala de medição 0,8000:1 a 8.000,0: 1 "}]
[null,null,"Cód.Comp.","Índice",{"$f":"C1392","v":"COT_KIT "},null,"Cód.Comp.","Índice",{"$f":"G1392","v":"COT_TTR "},null,"Cód.Comp.","Índice",{"$f":"K1392","v":0},null,"1º.Pag.","ATUAL","Dif.","+ ou -"]
[null,null,{"$f":"[4]Equipamentos!B73","v":"COT_KIT "},null,null,null,{"$f":"[4]Equipamentos!B74","v":"COT_TTR "},"COTAÇÃO"]
[null,"Mês Ref."]
[null,"Valor de Aquisição",null,null,20949.419999999998,null,null,null,24441.08]
[null,"taxa residual (%)",null,50,{"$f":"(D1395/100)*E1394","v":10474.709999999999},null,null,50,{"$f":"(H1395/100)*I1394","v":12220.54},null,null,50,{"$f":"(L1395/100)*M1394","v":0}]
[null,"Vida útil (anos)",null,2,null,null,null,2,null,null,null,2]
[null,"Depreciação anual (R$)",null,null,{"$f":"(E1394-E1395)/D1396","v":5237.3549999999996},null,null,null,{"$f":"(I1394-I1395)/H1396","v":6110.27},null,null,null,{"$f":"(M1394-M1395)/L1396","v":0}]
[{"$nulls":14},"Observação: vida útil adaptada para dois anos, na talha manual, devido ao desgaste com a intensidade (uso severo) dos serviços propostos utilizando o mesmo"]
[]
[]
[]
[null,"Valor Mensal (R$)",null,null,{"$f":"E1397/12","v":436.44624999999996},null,null,null,{"$f":"I1397/12","v":509.18916666666672},null,null,null,{"$f":"M1397/12","v":0}]

{"sheet":"Ferramentas","index":28,"n_rows":253,"n_cols":13,"rows_kept":253,"cut":false,"hidden":false,"merged":[[242,0,242,6],[13,2,13,6],[98,2,98,6],[169,2,169,6],[0,2,0,6],[1,2,1,6],[2,2,2,6],[4,0,5,6],[7,0,7,6],[9,5,9,6],[9,4,10,4],[9,3,10,3],[9,2,10,2],[9,0,10,0],[9,1,10,1],[11,2,11,6],[234,0,234,4],[234,5,234,6],[229,0,229,6],[232,2,232,4],[233,2,233,4],[231,5,231,6],[232,5,232,6],[233,5,233,6],[231,2,231,4],[225,0,225,5],[230,5,230,6],[230,2,230,4],[167,0,167,5],[96,0,96,5],[227,0,227,5],[241,0,241,6],[237,5,237,6],[238,5,238,6],[239,5,239,6],[240,5,240,6],[237,0,237,4],[238,0,238,4],[239,0,239,4],[240,0,240,4]]}
[null,null,"Ministério do Desenvolvimento Regional  - MDR"]
[null,null,"Companhia de Desenvolvimento dos Vales do São Francisco e do Parnaíba"]
[null,null,"Gerência de Operação do PISF - Centro de Controle e Operação (AD / GOI / CCO)"]
[]
[{"$f":"Equipamentos!A5","v":"TERMO DE REFERÊNCIA PARA CONTRATAÇÃO DOS RECURSOS NECESSÁRIOS À OPERAÇÃO E MANUTENÇÃO DAS INFRAESTRUTURAS DO EIXO LESTE DO PISF - PROJETO DE INTEGRAÇÃO DO SÃO FRANCISCO COM AS BACIAS HIDROGRÁFICAS DO NORDESTE SETENTRIONAL"}]
[]
[]
["FERRAMENTAS"]
[]
["ITEM","CÓDIGO","DESCRIÇÃO","UNIDADE","QUANTIDADE","VALOR (R$)"]
[{"$nulls":5},"UNITARIO","TOTAL"]
[null,null,{"$f":"A8","v":"FERRAMENTAS"}]
[]
["1.",null,"FERRAMENTAS - MECÂNICA"]
["1.1",null,"Alavanca para mecânico 38,4 cm ","un",6,null,{"$f":"IF(F15=\"\",\"\",ROUND(E15*F15,2))","v":""},null,6,{"$f":"ROUNDDOWN((I15/2),0)","v":3}]
["1.2","11240 - ORSE","Alicate de bico com isolamento para 1000V","un",9,null,{"$f":"IF(F16=\"\",\"\",ROUND(E16*F16,2))","v":""},null,9,{"$f":"ROUNDDOWN((I16/2),0)","v":4}]
["1.3","38470 - SINAPI","Alicate de corte diagonal","um",9,null,"",null,9,{"$f":"ROUNDDOWN((I17/2),0)","v":4}]
["1.4","38471 - SINAPI","Alicate para anéis externo pontas retas","un",9,null,"",null,9,4]
["1.5","38471 - SINAPI","Alicate para anéis externos ponta curva 90°","un",9,null,"",null,9,4]
["1.6","38471 - SINAPI","Alicate para anéis internos","un",9,null,"",null,9,4]
["1.7",null,"Alicate de pressão modelo curvo reto, 10\", 250mm","un",9,null,"",null,9,4]
["1.8","11240 - ORSE","Alicate universal, 8\", com isolação 1000 V","un",9,null,"",null,9,4]
["1.9","10585 - ORSE","Arco de Serra manual (com serra)","un",6,null,"",null,6,3]
["1.10",null,"Cabo de força T com encaixe de ½”, ¾” e 1” para soquetes ","un",6,null,"",null,6,3]
["1.11","5090 - SINAPI","Cadeado 30mm","un",9,null,"",null,9,4]
["1.12","00425 - ORSE","Cadeado 40mm","un",9,null,"",null,9,4]
["1.13",null,"Calibrador de folgas de 0,03 mm - 0,50 mm 17 Lâminas (Jogo)","un",6,null,"",null,6,3]
["1.14",null,"Canivete sem ponta inox com lâmina larga","un",9,null,"",null,9,4]
["1.15",null,"Chave ajustável oxidada n.º 08","un",9,null,"",null,9,4]
["1.16",null,"Chave combinada 1\" x 5/16\"","un",9,null,"",null,9,4]
["1.17",null,"Chave combinada 22 mm","un",9,null,"",null,9,4]
["1.18",null,"Chave combinada n.º 5/16\"","un",9,null,"",null,9,4]
["1.19",null,"Chave cruzada 8 x 150","un",9,null,"",null,9,4]
["1.20",null,"Chave de boca 3/4\" x 25/32\"","un",9,null,"",null,9,4]
["1.21",null,"Chave de boca 5/16\" x 1/4\"","un",9,null,"",null,9,4]
["1.22",null,"Chave de fenda 1/4x10","un",9,null,"",null,9,4]
["1.23",null,"Chave de fenda 1/8x3","un",9,null,"",null,9,4]
["1.24",null,"Chave de fenda 3/16x6","un",9,null,"",null,9,4]
["1.25",null,"Chave de fenda 3/8x10","un",9,null,"",null,9,4]
["1.26",null,"Chave de fenda 8x150","un",9,null,"",null,9,4]
["1.27",null,"Chave de fenda cruzada (Philips) 1/4\" x 1. 1/2\"","un",9,null,"",null,9,4]
["1.28",null,"Chave de fenda tipo toco 1/4\" x 1. 1/2\"","un",9,null,"",null,9,4]
["1.29",null,"Chave grifo americana n.º 8 200mm","un",6,null,"",null,6,3]
["1.30",null,"Chave grifo americana n.º 18 450mm","un",6,null,"",null,6,3]
["1.31",null,"Chave Philips","un",9,null,"",null,9,4]
["1.32",null,"Chave soquete tipo canhão 1/2\"","un",3,null,"",null,3,1]
["1.33",null,"Chave soquete tipo canhão 1/4\"","un",3,null,"",null,3,1]
["1.34",null,"Chave soquete tipo canhão 11/32\"","un",3,null,"",null,3,1]
["1.35",null,"Chave soquete tipo canhão 3/8\"","un",3,null,"",null,3,1]
["1.36",null,"Chave soquete tipo canhão 7/16\"","un",3,null,"",null,3,1]
["1.37",null,"Chave soquete tipo canhão 9/16\"","un",3,null,"",null,3,1]
["1.38","12 - SINAPI","Escova de aço, com cabo, *4 X 15* fileiras de cerdas","un",3,null,"",null,3,1]
["1.39","04725 - ORSE","Espátula n.º 38A-23","un",9,null,"","ok",9,4]
["1.40","38380 - SINAPI","Esquadro Profissional 12\" (em aço)","un",6,null,"",null,6,3]
["1.41",null,"Extensão elétrica 20m 2x2,50mm com carretel","un",6,null,"",null,6,3]
["1.42",null,"Faca reta desencapadora com isolamento para 1000V","un",9,null,"",null,9,4]
["1.43",null,"Funil para troca de óleo","un",6,null,"",null,6,3]
["1.44",null,"Jogo de broca de aço de 6 a 19mm (concreto parede)","un",9,null,"",null,9,4]
["1.45",null,"Jogo de soquete Estriado de 1/2 Pol. Com 22 peças ","un",6,null,"",null,6,3]
["1.46",null,"Jogo de chave combinada de nº 6 a nº 50","un",9,null,"",null,9,4]
["1.47",null,"Jogo de chave hexagonal (Allen) em polegada","un",9,null,"",null,9,4]
["1.48",null,"Jogo de chave hexagonal (Allen) nº 03 a 17mm","un",9,null,"",null,9,4]
["1.49",null,"Jogo de chave Phillips com isolamento para 1000V","un",9,null,"",null,9,4]
["1.50",null,"Jogo de chave soquete 22 mm a 50 mm","un",6,null,"",null,6,3]
["1.51",null,"Jogo de chaves de fenda com isolamento para 1000V","un",9,null,"",null,9,4]
["1.52",null,"Jogo para Reparo de Rosca Postiça Master M5xM12","un",6,null,"",null,6,3]
["1.53","11400/ORSE","Lanterna grande - 10 Million","un",6,null,"","ok",6,3]
["1.54","10592/ORSE","Lima chata paralela murça 6\"","un",9,null,"","ok",9,4]
["1.55","J040001106/EMBASA","Lima paralela bastarda 6\"","un",9,null,"","ok",9,4]
["1.56",null,"Lima redonda murça 6\"","un",9,null,"",null,9,4]
["1.57",null,"Kit Estojo de Limas Murça 19 peças","un",9,null,"",null,9,4]
["1.58",null,"Mala de ferramenta com 05 gavetas","un",9,null,"",null,9,4]
["1.59","4729 - ORSE","Marreta 1kg","un",9,null,"",null,9,4]
["1.60","J02000073/EMBASA","Marreta 2 kg com cabo de fibra","un",6,null,"","ok",6,3]
["1.61","J020000076/EMBASA","Marreta de 5kg com cabo de madeira","un",6,null,"","ok",6,3]
["1.62","J030000145/EMBASA","Martelo bola  1kg cabo em madeira ","un",9,null,"","ok",9,4]
["1.63","11265/ORSE","Martelo de borracha 32 Cm","un",9,null,"","ok",9,4]
["1.64",null,"Nível a laser com base magnética e tripé","un",6,null,"",null,6,3]
["1.65",null,"Nível de mão – metálico e magnético","un",6,null,"",null,6,3]
["1.66",null,"Pe De Cabra, 900 Mm, Sextavado, Pintado","un",6,null,{"$f":"IF(F80=\"\",\"\",ROUND(E80*F80,2))","v":""},null,6,3]
["1.67","38377 - SINAPI","Prumo de centro","un",6,null,"",null,6,{"$f":"ROUNDDOWN((I81/2),0)","v":3}]
["1.68",null,"Punção de centro 100 x 4 mm","un",9,null,"",null,9,4]
["1.69",null,"Punção de centro 150 x 6 mm","un",9,null,"",null,9,4]
["1.70","J030000058/EMBASA","CONJUNTO DE SACA-PINOS","un",9,null,"","ok",9,4]
["1.71",null,"Saca pino 08mm","un",9,null,"",34.15,9,4]
["1.72",null,"Saca pino 17 mm","un",9,null,"",24.07,9,4]
["1.73",null,"Saca pino paralelo 150x4","un",9,null,"",23.9,9,4]
["1.74",null,"Saca pino paralelo 150x6","un",9,null,"",23.68,9,4]
["1.75",null,"Saca pino paralelo 150x8","un",9,null,"",26.89,9,4]
["1.76",null,"Saca polia 10\"","un",3,null,"",null,3,1]
["1.77",null,"Soquete Sextavado Quadra 1\" 65 mm","un",3,null,"",null,3,1]
["1.78",null,"Soquete Sextavado Quadra 1\" 70 mm","un",3,null,"",null,3,1]
["1.79",null,"Soquete Sextavado Quadra 1\" 75/55 mm","un",3,null,"",null,3,1]
["1.80","11271/ORSE","Talhadeira De Aço Com Empunhadura De Proteção 10''","un",9,null,"",null,9,4]
["1.81",null,"Torquímetro de estalo 50 - 400 N.m","un",3,null,"",null,3,1]
["1.82",null,"Trena Metálica 8 m","un",6,null,"",null,6,3]
[{"$f":"\"TOTAL - \"&C14&\" - (R$):\"","v":"TOTAL - FERRAMENTAS - MECÂNICA - (R$):"}]
[]
["2.",null,"FERRAMENTAS - ELÉTRICA"]
["2.1",null,"Adaptador universal de tomadas","un",46,null,{"$f":"IF(F100=\"\",\"\",ROUND(E100*F100,2))","v":""},null,46,{"$f":"ROUNDDOWN((I100/2),0)","v":23}]
["2.2",null,"Alavanca reta, 1,75 m","un",10,null,{"$f":"IF(F101=\"\",\"\",ROUND(E101*F101,2))","v":""},null,10,5]
["2.3",null,"Alicate bico chato/pato, 6\"","un",13,null,"",null,13,6]
["2.4","38470 - SINAPI","Alicate cortador de cabos diagonal, 6\"","un",23,null,"",null,23,11]
["2.5",null,"Alicate cortador de cabos frontal, 6\"","un",13,null,"",null,13,6]
["2.6",null,"Alicate/Tesoura cortador manual de cabos de até 300mm², 225mm","un",13,null,"",null,13,6]
["2.7","38547 - SINAPI","Alicate crimpador, RJ-11/RJ-45, 200mm","un",2,null,"",null,2,1]
["2.8","38547 - SINAPI","Alicate crimpador,  RG-59 e RG-6, 130mm","un",2,null,"",null,2,1]
["2.9","11272 - ORSE","Alicate crimpador para terminais 1,0 a 10mm², 220mm","un",13,null,"",null,13,6]
["2.10","11272 - ORSE","Alicate crimpador para terminais 10 a 120mm², 620mm","un",1,null,"",null,1,0]
["2.11","11272 - ORSE","Alicate crimpador 11\", 280mm","un",2,null,"",null,2,1]
["2.12",null,"Alicate crimpador, hidráulico, prensa terminal,  com matriz de 10 a 300mm²","un",1,null,"",null,1,0]
["2.13","11275 - ORSE","Alicate de pressão, 10\", 250mm","un",13,null,"",null,13,6]
["2.14","11240 - ORSE","Alicate profissional universal, 8\". Material: Cromo Vanadium","un",13,null,"",null,13,6]
["2.15","11240 - ORSE","Alicate universal, 8\", com isolação 1000 V","un",10,null,"",null,10,5]
["2.16","10585 - ORSE","Arco de Serra manual (com serra)","un",23,null,"",null,23,11]
["2.17",null,"Aspirador de Pó / Liquidos 2 Motores de 1200W 220V AA280 ","un",2,null,"","ok",2,1]
["2.18",null,"Bastão isolante universal Ø 38 mm, 6 m, com 2 cabeçotes","un",2,null,"",null,2,1]
["2.19",null,"Bastão de resgate - 35 kV, 220 mm","un",2,null,"",null,2,1]
["2.20",null,"Chave de boca ajustável 8\"","un",10,null,"",null,10,5]
["2.21",null,"Chave de boca ajustável 12\"","un",10,null,"",null,10,5]
["2.22",null,"Chave de boca ajustável 18\"","un",10,null,"",null,10,5]
["2.23","00425 - ORSE","Cadeado 40mm","un",27,null,"",null,27,13]
["2.24",null,"Caixa de ferramentas para eletricista NR10 com 34 peças - Equipes de Manutenção","un",6,null,"","ok",6,3]
["2.25",null,"Caixa de ferramentas para eletricista NR10 com 34 peças para operadores EB","un",6,null,"","ok",6,3]
["2.26",null,"Caixa de ferramentas com 40 peças (Para técnicos de automação e telecom)","un",2,null,"",null,2,1]
["2.27",null,"Caixa de ferramentas tipo sanfonada, confeccionada  em chapa de aço, com rodas e puxador","un",13,null,"",null,13,6]
["2.28",null,"Câmera fotográfica digital 20MP, 5x Zoom Óptico","un",2,null,"",null,2,1]
["2.29",null,"Chave com catraca 4 bocas 8x9x10x11 mm (Ref. 44637101 ou similar)","un",10,null,"",null,10,5]
["2.30",null,"Conjunto de aterramento rápido e temporário para cubículos até 35kV","un",2,null,"",null,2,1]
["2.31",null,"Conjunto de aterramento rápido e temporário para redes isoladas até 1kV","un",2,null,"",null,2,1]
["2.32",null,"Conjunto de aterramento temporário até 15 kV","un",2,null,"",null,2,1]
["2.33",null,"Conjunto de chaves básicas para eletricista com 06 peças","un",10,null,"",null,10,5]
["2.34",null,"Detector de Tensão por contato 1kV","un",15,null,"",null,23,11]
["2.35",null,"Detector unipolar de tensão por aproximação - 10 KV","un",5,null,"",null,13,6]
["2.36",null,"Encerado de lona (3x2 m)","un",5,null,"",null,10,5]
["2.37","38477/SINAPI","Escada perfil \"U\" de fibra de vidro extensiva - altura esticada 8,40 m - 15 kV","un",5,null,"","ok",10,5]
["2.38","Banco de Preços (Pregão Eletrônico - FUND.P/CONSERV.PROD.FLORESTAL DO EST.SP\nGOVERNO DO ESTADO DE SÃO PAULO), 04/2022","Escada de fibra de vidro tipo \"A\" - 10 degraus","un",2,null,"",null,2,1]
["2.39","12 - SINAPI","Escova com cerdas de aço para condutores","un",10,null,"",null,10,5]
["2.40",null,"Ferramenta universal para bastão de manobra - Cabeçote para grampo de aterramento","un",2,null,"",null,2,1]
["2.41",null,"Fumigador para apicultura","un",10,null,"",null,10,{"$f":"ROUNDDOWN((I140/2),0)","v":5}]
["2.42","11248/ORSE","Furadeira elétrica de impacto 1/2\" Ø 13mm, 800W, 1050 A, 2800 rpm e 220V","un",10,null,"","ok",10,5]
["2.43","Licitação - Banco de preços (SECRETARIA DA SEGURANCA PUBLICA\nSãO PAULO-06/2022)","Jogo de chave canhão com 12 unidades","un",10,null,"","ok",10,5]
["2.44",null,"Jogo de chave combinada com 16 unidades (sextavado/boca fixa) de 1/4\" a 1.1/4\" (6,35 mm a 31,75 mm)","un",10,null,"",null,10,5]
["2.45",null,"Jogo de soquetes estriado com encaixe 1/2\" com 38 soquetes - 10-32mmn","un",10,null,"",null,10,5]
["2.46",null,"Jogo de chaves biela 12 peças tipo L 8 a 19mm","un",10,null,"",null,10,5]
["2.47",null,"Jogo de chave de fenda e philips com haste protegida para eletricista com 07 peças","un",10,null,"",null,10,5]
["2.48",null,"Kit de reparo eletrônico (ferro de solda, sugador de placa de circuito impresso, componentes sobressalentes)","un",2,null,"",null,2,1]
["2.49",null,"Kit ferramenta fibra óptica (clivador +alicate decapador + alicate stripper + bolsa + 2 chaves allen + recipiente para álcool + guia) + Medidor de potência para fibra óptica (Power Meter Medidor Potência Fibra Óptica + Caneta Laser 10W)","un",2,null,"",null,2,1]
["2.50",null,"Kit ferramentas telecom ( tipo TRAMONTINA PRO 44970053 ou similar)","un",2,null,"",null,2,1]
["2.51","11396 - ORSE","Lanterna tática grande - 5.500.000 lumens","un",10,null,"",null,10,5]
["2.52","10592/ORSE","Lima chata murça 8\" com cabo","un",1,null,"",null,1,0]
["2.53","J040001106/EMBASA","Lima chata bastarda 10\"","un",1,null,"",null,1,0]
["2.54","036147/SINAPI","Luva isolante classe 00 - 2,5kV","un",13,null,"",null,13,6]
["2.55","\tB.07.000.049767/CPOS","Luva isolante classe 3 - 30kV","un",13,null,"",null,13,6]
["2.56","J020000076/EMBASA","Marreta de 5kg com cabo de madeira","un",10,null,"",null,10,5]
["2.57",null,"Martelete Perfurador/Rompedor Profissional 220V, 800W, 870 RPM","un",1,null,"",null,1,0]
["2.58","J030000145/EMBASA","Martelo-bola 1kg com cabo de madeira","un",10,null,"",null,10,5]
["2.59","11244/ORSE","Martelo universal (de unha) 25mm com cabo de madeira","un",10,null,"",null,10,5]
["2.60","31.41.36/SUDECAP","Pá-de-bico com cabo de madeira","un",10,null,"",null,10,5]
["2.61","11248/ORSE","Parafusadeira/Furadeira elétrica com fio - 220V, 400W","un",10,null,"",null,10,5]
["2.62",null,"Punho saca fusível NH tamanho 000 a 4, 1kV","un",10,null,"",null,10,5]
["2.63",null,"Soprador Costal 2T 59,2CC à Gasolina","un",2,null,"",null,2,1]
["2.64",null,"Soprador térmico 2000W, 220V","un",1,null,"",null,1,0]
["2.65","I2587/SEINFRA","Talha manual Tirfor 1.600kgf/cm² com alavanca","un",1,null,"",null,1,0]
["2.66",null,"Testador de bastão de manobra para isolador","un",1,null,{"$f":"IF(F165=\"\",\"\",ROUND(E165*F165,2))","v":""},"ok",1,0]
["2.67",null,"Teste de Bateria Digital com Impressora Térmica Embutida","un",6,null,"","ok",6,3]
["2.68",null,"Testador Teste Crimpagem Cabo Rede Lan Rj45 Rj11","un",2,null,"",null,2,1]
[{"$f":"\"TOTAL - \"&C99&\" - (R$):\"","v":"TOTAL - FERRAMENTAS - ELÉTRICA - (R$):"},{"$nulls":5},{"$f":"SUBTOTAL(9,G99:G167)","v":0}]
[]
["3.",null,"FERRAMENTAS - CIVIL"]
["3.1",null," Alavanca sextavada ponta pá curva para construção civil","un",29,null,{"$f":"IF(F171=\"\",\"\",ROUND(E171*F171,2))","v":""},null,59,{"$f":"ROUNDDOWN((I171/2),0)","v":29}]
["3.2",null," Ansinho curvo robusto 12 dentes com cabo de madeira","un",29,null,{"$f":"IF(F172=\"\",\"\",ROUND(E172*F172,2))","v":""},null,59,29]
["3.3","10585 - ORSE","Arco de Serra manual (com serra)","un",12,null,"",null,12,6]
["3.4","10 - SINAPI"," Balde 10 l ","un",57,null,"",null,118,59]
["3.5",null,"Binóculo Profissional Ampliação 8 à 24x 50mm","un",10,null,"",null,10,5]
["3.6",null,"Câmera fotográfica digital 20MP, 5x Zoom Óptico","un",6,null,"",null,6,3]
["3.7",null," Carrinho para transporte de motor de popa até 40 Hp","un",12,null,"",null,12,6]
["3.8","2711 - SINAPI"," Carro de mão ","un",114,null,"",null,236,118]
["3.9",null," Cavador articulado com cabo de madeira 110cm","un",29,null,"",null,59,29,null,{"$f":"32.7*0.8","v":26.160000000000004},{"$f":"2000*L179","v":52320.000000000007}]
["3.10",null," Chibanca metálica com cabo de madeira","un",100,null,"",null,207,103,null,{"$f":"L179*2500","v":65400.000000000007}]
["3.11","J040001052/EMBASA"," Colher de pedreiro nº 9 ","un",2,null,"",null,7,3]
["3.12",null," Conjunto de ferramentas básicas para encanador ","un",3,null,"",null,3,1]
["3.13",null," Conjunto de ferramentas básicas para pedreiro ","un",2,null,"",null,7,3,null,{"$f":"32000-27500","v":4500}]
["3.14","38200/COMPESA"," Corda de bombeiro 12mm em nylon trançado (rolo de 100 m) ","un",5,null,"",null,9,4,null,{"$f":"L183/32000","v":0.140625},{"$f":"66000*0.86","v":56760}]
["3.15",null," Desempenadeira de aço dentada ","un",5,null,"",null,9,4]
["3.16","4174/ORSE"," Desempenadeira de aço lisa ","un",5,null,"",null,9,4,null,{"$f":"8000/32000","v":0.25}]
["3.17","M0076/SICRO3"," Disco corte abrasivo 18\" para aço 178x1,6x22,2mm","un",3,null,"",null,6,3]
["3.18","38403 - SINAPI"," Enxada estreita de 240 x 230 mm, sem cabo ","un",100,null,"",null,207,103]
["3.19","38477 - SINAPI"," Escada articulada multifuncional 16 degraus ","un",7,null,"",null,12,6]
["3.20","12 - SINAPI","Escova de aco, com cabo, *4 x 15* fileiras de cerdas ","un",7,null,"",null,12,6]
["3.21","38367 - SINAPI","Espátula aço inox, 8cm - cabo de madeira ","un",7,null,"",null,12,6]
["3.22","38368 - SINAPI","Espátula de plástico lisa, largura 10 cm ","un",7,null,"",null,12,6]
["3.23","D249722458/EMBASA"," Esponja de limpeza ","un",60,null,"",null,105,52]
["3.24","38380 - SINAPI","Esquadro 90º x 30cm (12\") ","un",3,null,"",null,6,3]
["3.25","J020000046/EMBASA"," Estrovenga com cabo de madeira","un",100,null,"",null,207,103]
["3.26",null,"Facão para mato, 18 pol","un",102,null,"",null,211,105]
["3.27","J020000052/EMBASA","Foice 33mm com cabo de madeira","un",102,null,"",null,211,105]
["3.28",null," Fumigador para apicultura ","un",14,null,"",null,30,15]
["3.29","11400/ORSE"," Lanterna grande - 10 Million ","un",12,null,"",null,12,6]
["3.30","J020000061/EMBASA"," Machado lâmica 3,5 cabo de madeira 90 cm","un",43,null,"",null,89,44]
["3.31","M2462/SICRO"," Mangueira de ¾ 50 MTS ","un",9,null,"",null,15,7]
["3.32","00037458/SINAPI"," Mangueira de nível 5/16x1,3mm","un",10,null,"",null,18,9]
["3.33","11269 - ORSE"," Marreta de 1/2 kg com cabo ","un",11,null,"",null,24,12]
["3.34","J020000073/EMBASA"," Marreta oitavada de 2kg com cabo de madeira","un",11,null,"",null,24,12]
["3.35","J020000076/EMBASA","Marreta de 5kg com cabo de madeira","un",11,null,"",null,24,12]
["3.36","11244/ORSE"," Martelo com unha 25mm","un",11,null,"",null,24,12]
["3.37","11265/ORSE"," Martelo de borracha 32 Cm","un",3,null,"",null,5,2]
["3.38",null," Nível c/ bolha ajustável de inclinação, bolha fixa e prumo – 250mm ","un",3,null,"",null,5,2]
["3.39","10789/ORSE"," Nível de bolha de madeira ","un",3,null,"",null,5,2]
["3.40","10788/ORSE"," Pá quadrada com cabo de madeira","un",100,null,"",null,207,103]
["3.41",null," Pé-de-cabra 3/4x60cm","un",29,null,"",null,59,29]
["3.42","830101/IOPES"," Picareta 4 libras com cabo 90 cm","un",100,null,"",null,207,103]
["3.43","038394/SINAPI"," Pistola para pintura pulverizadora 1L","un",3,null,"",null,5,2]
["3.44","4720/ORSE"," Ponteiro de aço liso 3/4","un",29,null,"",null,59,29]
["3.45","38377 - SINAPI"," Prumo de centro ","un",3,null,"",null,5,2]
["3.46","38376 - SINAPI"," Prumo de parede ","un",3,null,"",null,5,2]
["3.47","31.42.17/SUDECAP"," Rastelo (ASG) de plástico com cabo","un",29,null,"",null,59,29]
["3.48","8606/ORSE","Refletor redondo em alumínio anodizado para lâmpada vapor de mercúrio/sódio, corpo em aluminio com pintura epoxi, para lâmpada E-27 de 300 W, com suporte redondo e alça regulável para fixação. ","un",30,null,"",null,30,15]
["3.49",null," Régua de alumínio - 2,00m ","un",3,null,"",null,5,2]
["3.50","10577/ORSE"," Serrote madeira 40cm ","un",11,null,"",null,24,12]
["3.51","4728/ORSE"," Talhadeira de aço chato 10\" ","un",29,null,"",null,59,29]
["3.52",null," Torqueza 8\"","un",15,null,"",null,15,7]
["3.53","078296/SBC","Trena Metálica 8 m","un",20,null,"",null,20,10]
["3.54","83.25.53/SUDECAP"," Trena de Fita 20m ","un",3,null,"",null,3,1]
["3.55","F099703003/EMBASA"," Trena de Fita 50m ","un",3,null,"",null,3,1]
[{"$f":"\"TOTAL - \"&C170&\" - (R$):\"","v":"TOTAL - FERRAMENTAS - CIVIL - (R$):"}]
[]
[{"$f":"\"TOTAL - \"&C12&\" - (R$):\"","v":"TOTAL - FERRAMENTAS - (R$):"},{"$nulls":6},1158938.3999999999]
[]
[{"$f":"\"RESUMO - \"&A$8","v":"RESUMO - FERRAMENTAS"}]
["ITEM",null,"DESCRIÇÃO",null,null,"VALOR TOTAL (R$)"]
["01",null,{"$f":"C14","v":"FERRAMENTAS - MECÂNICA"}]
["02",null,{"$f":"C99","v":"FERRAMENTAS - ELÉTRICA"}]
["03",null,{"$f":"C170","v":"FERRAMENTAS - CIVIL"}]
[{"$f":"\"TOTAL GERAL - \"&A230&\" -  (R$):\"","v":"TOTAL GERAL - RESUMO - FERRAMENTAS -  (R$):"},{"$nulls":7},{"$f":"Ferramentas/1202493.25","v":0}]
[]
[]
["NOME DO INFORMANTE:",{"$nulls":4},"QUALIFICAÇÃO:"]
[]
["ASSINATURA:",{"$nulls":4},"DATA:"]
[]
["OBSERVAÇÃO:"]
["TABELAS DE REFERÊNCIA"]
["SINAPI 04/2022"]
["ORSE 03/2022"]
["COMPESA 01/2022"]
["EMBASA 01/2022"]
["SUDECAP 02/2022"]
["IOPES 04/2022"]
["SBC 07/2022"]
["SICRO 01/2022"]
["SEINFRA"]
["CPOS 05/2022"]

{"sheet":"Instrumentos","index":29,"n_rows":74,"n_cols":11,"rows_kept":74,"cut":false,"hidden":false,"merged":[[14,2,14,6],[30,2,30,6],[52,2,52,6],[0,2,0,6],[1,2,1,6],[2,2,2,6],[4,0,5,6],[7,0,7,6],[28,0,28,5],[10,0,11,0],[10,2,11,2],[10,3,11,3],[10,4,11,4],[10,5,10,6],[10,1,11,1],[12,2,12,6],[50,0,50,5],[69,0,69,4],[61,0,61,6],[65,5,65,6],[66,5,66,6],[68,0,68,4],[62,2,62,4],[62,5,62,6],[63,2,63,4],[63,5,63,6],[66,0,66,4],[64,2,64,4],[64,5,64,6],[65,2,65,4],[68,5,68,6],[69,5,69,6],[76,0,76,6],[73,0,74,6],[59,0,59,5],[75,0,75,6],[57,0,57,5],[72,0,72,6],[70,0,70,4],[71,0,71,4],[70,5,70,6],[71,5,71,6]]}
[null,null,"Ministério do Desenvolvimento Regional  - MDR"]
[null,null,"Companhia de Desenvolvimento dos Vales do São Francisco e do Parnaíba"]
[null,null,"Gerência de Operação do PISF - Centro de Controle e Operação (AD / GOI / CCO)"]
[]
[{"$f":"Ferramentas!A5","v":"TERMO DE REFERÊNCIA PARA CONTRATAÇÃO DOS RECURSOS NECESSÁRIOS À OPERAÇÃO E MANUTENÇÃO DAS INFRAESTRUTURAS DO EIXO LESTE DO PISF - PROJETO DE INTEGRAÇÃO DO SÃO FRANCISCO COM AS BACIAS HIDROGRÁFICAS DO NORDESTE SETENTRIONAL"}]
[]
[]
["INSTRUMENTOS"]
[]
[]
["ITEM","CÓDIGO","DESCRIÇÃO","UNIDADE","QUANTIDADE","VALOR (R$)"]
[{"$nulls":5},"UNITARIO","TOTAL"]
[null,null,{"$f":"A8","v":"INSTRUMENTOS"}]
[]
["1.",null,"INSTRUMENTOS - MECÂNICA",{"$nulls":6},12,{"$f":"'ORCAMENTO_CONSOLIDADO (2)'!$K$1","v":6}]
["1.1",null,"Analisador de vibração VIB 496FFY VIBOTRON","un x mês",{"$f":"K16","v":6},{"$f":"CPU_Instrumentos!H15","v":""},{"$f":"IF(F16=\"\",\"\",ROUND(E16*F16,2))","v":""},null,12,{"$f":"I16/$J$15","v":1},{"$f":"J16*$K$15","v":6}]
["1.2",{"$f":"CPU_Instrumentos!B16","v":"Banco de preços (NºPregão:102022 / UASG:153029, MINISTÉRIO DA EDUCAÇÃO\nUniversidade Tecnológica Federal do Paraná\nUTFPR - Campus Medianeira - Pregão Eletrônico, 06/2022)"},"Base magnética para relógio comparador","un x mês",{"$f":"K17","v":24},{"$f":"CPU_Instrumentos!H16","v":""},{"$f":"IF(F17=\"\",\"\",ROUND(E17*F17,2))","v":""},null,48,{"$f":"I17/$J$15","v":4},{"$f":"J17*$K$15","v":24}]
["1.3",{"$f":"CPU_Instrumentos!B17","v":"Banco de preços (NºPregão:282022 / UASG:984723, PREFEITURA MUNICIPAL DE JOÃO MONLEVADE/MG - Pregão Eletrônico, 07/2022)"},"Estetoscópio Kent","un x mês",12,{"$f":"CPU_Instrumentos!H17","v":""},"",null,24,{"$f":"I18/$J$15","v":2},12]
["1.4",null,"Micrômetro 100 à 200 externo","un x mês",12,{"$f":"CPU_Instrumentos!H18","v":""},"",null,24,2,12]
["1.5",{"$f":"CPU_Instrumentos!B19","v":"Banco de preços (NºPregão:752021 / UASG:168008, MINISTÉRIO DA DEFESA\nComando do Exército\nIndustria de Material Belico do Brasil/FE/RJ - Pregão Eletrônico, 01/2022)"},"Micrômetro externo 0 – 100mm","un x mês",12,{"$f":"CPU_Instrumentos!H19","v":""},"",null,24,2,12]
["1.6",{"$f":"CPU_Instrumentos!B20","v":"Banco de preços (NºPregão:222022 / UASG:153178 - MINISTÉRIO DA EDUCAÇÃO\nUniversidade Tecnológica Federal do Paraná\nUTFPR - Campus Ponta Grossa, Pregão Eletrônico - 07/2022)"},"Micrômetro interno 50 – 800mm","un x mês",12,{"$f":"CPU_Instrumentos!H20","v":""},"",null,24,2,12]
["1.7",{"$f":"CPU_Instrumentos!B21","v":"Banco de preços (NºPregão:102022 / UASG:160353, MINISTÉRIO DA DEFESA\nComando do Exército\nComando Militar da Amazônia\n2ºGrupamento de Engenharia de Construção\n6ºBatalhão de Engenharia de Construção - Pregão eletrônico, 05/2022)"},"Nível ótico (Topcon AT-B2) ou similar","un x mês",6,{"$f":"CPU_Instrumentos!H21","v":""},"",null,12,1,6]
["1.8",{"$f":"CPU_Instrumentos!B22","v":"Banco de preços (NºPregão:252022 / UASG:154043, MINISTÉRIO DA EDUCAÇÃO\nUniversidade Federal de Uberlândia - Pregão Eletrônico, 06/2022)"},"Paquímetro digital 0 – 150mm/0,01mm","un x mês",12,{"$f":"CPU_Instrumentos!H22","v":""},"",null,24,2,12]
["1.9",null,"Paquímetro universal 0 - 650mm/0,02mm","un x mês",12,{"$f":"CPU_Instrumentos!H23","v":""},"",null,24,2,12]
["1.10",{"$f":"CPU_Instrumentos!B24","v":"Banco de preços (NºPregão:832021 / UASG:742050, MINISTÉRIO DA DEFESA\nCOMANDO DA MARINHA\nCentro de Intendência Tecnológico da Marinha em São Paulo - Pregão Eletrônico, 01/2022)"},"Relógio comparador 0 – 10/0,01mm digital","un x mês",24,{"$f":"CPU_Instrumentos!H24","v":""},"",null,48,4,24]
["1.11",{"$f":"CPU_Instrumentos!B25","v":"Banco de preços (NºPregão:62022 / UASG:158445, MINISTÉRIO DA EDUCAÇÃO\nSECRETARIA DE EDUCAÇÃO PROFISSIONAL E TECNOLÓGICA\nInstituto Federal de Educação, Ciência e Tecnologia do Amazonas\nCampus Manaus Centro - Pregão Eletrônico, 07/2022)"},"Tacômetro digital 0,1 - 1,0 RPM DT - 2234 A","un x mês",6,{"$f":"CPU_Instrumentos!H25","v":""},"",null,12,1,6]
["1.12",{"$f":"CPU_Instrumentos!B26","v":"Banco de preços (NºPregão:7982021 / UASG:925373 - GOVERNO DO ESTADO DE RONDONIA\nSuperintendência Estadual de Compras e Licitações, Pregão Eletrônico - 01/2022)"},"Termômetro mira laser escala de -20 a 500ºC","un x mês",6,{"$f":"CPU_Instrumentos!H26","v":""},"",null,12,1,6]
["1.13",null,"Termovisor, com resolução Infravermelha de 120 x 90, Sensibilidade Térmica menor que 0,10 ºC, frequência da imagem de 9 Hz e faixa de temperatura –20 a 250 °C. ","un x mês",18,{"$f":"CPU_Instrumentos!H27","v":""},"",null,36,3,18]
[{"$f":"\"TOTAL - \"&C15&\" - (R$):\"","v":"TOTAL - INSTRUMENTOS - MECÂNICA - (R$):"},{"$nulls":5},{"$f":"SUBTOTAL(9,G15:G28)","v":0},null,0,0,0]
[{"$nulls":8},0,0,0]
["2.",null,"INSTRUMENTOS - ELÉTRICA",{"$nulls":5},0,0,0]
["2.1",null,"Alicate Amperímetro (mod. 381 CA/CC True-rms 1000V CAT III (ou similar)","un x mês",{"$f":"K32","v":78},{"$f":"CPU_Instrumentos!H29","v":""},{"$f":"IF(F32=\"\",\"\",ROUND(E32*F32,2))","v":""},null,156,13,78]
["2.2",{"$f":"CPU_Instrumentos!B30","v":"Banco de preços (UNIVERSIDADE ESTADUAL DE CAMPINAS\nSECR. DESENV. ECONOMICO\nCAMPINAS - Dispensa de Licitação, 01/2022)"},"Alicate amperímetro CA/CC de 600V, digital, CAT III FLUKE 305","un x mês",60,{"$f":"CPU_Instrumentos!H30","v":""},{"$f":"IF(F33=\"\",\"\",ROUND(E33*F33,2))","v":""},null,120,10,60]
["2.3",null,"Alicate Medidor de qualidade de energia (mod. Fluke 345 ou  similar) ","un x mês",12,{"$f":"CPU_Instrumentos!H31","v":""},"",null,24,2,12]
["2.4",null,"Boroscópio Digital Tela LCD 2,7 Pol. com Câmera de Inspeção e Saída USB ","un x mês",12,{"$f":"CPU_Instrumentos!H32","v":""},"",null,24,2,12]
["2.5",null,"Calibrador de processos multifunção digital (mod. Fluke 725 ou  similar) ","un x mês",12,{"$f":"CPU_Instrumentos!H33","v":""},"",null,24,2,12]
["2.6",null,"Fasímetro, digital, categoria IV, 40~700Vca, 600V ","un x mês",60,{"$f":"CPU_Instrumentos!H34","v":""},"",null,120,10,60]
["2.7",null,"Freqüencímetro gitital de bancada , 1GHz de 8 dígitos ","un x mês",6,{"$f":"CPU_Instrumentos!H35","v":""},"",null,12,1,6]
["2.8",null,"Medidor de distância, laser, amplitude de medição 1mm a 80m ","un x mês",6,{"$f":"CPU_Instrumentos!H36","v":""},"",null,12,1,6]
["2.9",null,"Medidor de resistência de aterramento e resistividade do solo (Faixa de medição de 0,02Ω a 300KΩ; Alcance de até 2 K Ω) com 02 pinças ","un x mês",6,{"$f":"CPU_Instrumentos!H37","v":""},"",null,12,1,6]
["2.10",null,"Medidor de vazão portátil tipo Clamp-on ","un x mês",6,{"$f":"CPU_Instrumentos!H38","v":""},"",null,12,1,6]
["2.11",null,"Megôhmetro digital de 15 kV, alcance de até 1 TΩ, Interface USB, IP54 ","un x mês",12,{"$f":"CPU_Instrumentos!H39","v":""},"",null,24,2,12]
["2.12",null,"Multímetro digital, tensão DC/AC 50,000 mV a 1000V, 0,4% (True/RMS), frequencia 99,999Hz a 999,99KHz  \"FLUKE-87-V\" com pontas prova TWIST GUARD","un x mês",78,{"$f":"CPU_Instrumentos!H40","v":""},"",null,156,13,78]
["2.13",null,"Multímetro digital para teste de equipotencialização (medições de baixas resistências), 100V, 10A, 0,1 Ω a 50 Ω ","un x mês",78,{"$f":"CPU_Instrumentos!H41","v":""},"",null,156,13,78]
["2.14",{"$f":"CPU_Instrumentos!B42","v":"Banco de preços (NºPregão:42022 / UASG:784810, MINISTÉRIO DA DEFESA\nCOMANDO DA MARINHA\nCentro de Intendencia da Marinha em Belem - Pregão Eletrônico, 03/2022)"},"Osciloscópio portátil com frequência de trabalho de 100Mhz, LCD Colorido 7”,  CAT II 600V ","un x mês",6,{"$f":"CPU_Instrumentos!H42","v":""},"",null,12,1,6]
["2.15",null,"Power Meter (Medidor Potência Fibra Óptica) potência 1310 nm, 1490 nm e 1550 nm  + Caneta Laser 10w ","un x mês",12,{"$f":"CPU_Instrumentos!H43","v":""},"",null,24,2,12]
["2.16",{"$f":"CPU_Instrumentos!B44","v":"Banco de preços (NºPregão:7982021 / UASG:925373, GOVERNO DO ESTADO DE RONDONIA\nSuperintendência Estadual de Compras e Licitações - Pregão Eletrônico, 01/2022)"},"Termômetro mira laser escala de -30ºC a 500ºc ","un x mês",78,{"$f":"CPU_Instrumentos!H44","v":""},"",null,156,13,78]
["2.17",{"$f":"CPU_Instrumentos!B45","v":"Banco de preços (NºPregão:22022 / UASG:156654, HOSPITAL DAS CLÍNICAS DA UNIVERSIDADE FEDERAL DE UBERLÂNDIA - Pregão Eletrônico, 01/2022)"},"Termovisor -20ºC a 350ºC, com camera de 5 megapixels, visor LCD de 3,5 polegadas ","un x mês",18,{"$f":"CPU_Instrumentos!H45","v":""},"",null,36,3,18]
["2.18",null,"Testador de cabos RJ45 / 11, frequencia 200kHz, display LCD 3 ½ digitos, 600V ","un x mês",12,{"$f":"CPU_Instrumentos!H46","v":""},"",null,24,2,12]
["2.19",null,"Verificador elétrico de tensão 1000V, sem contato com cabo (mod. T6-1000 Fluke ou similar) ","un x mês",78,{"$f":"CPU_Instrumentos!H47","v":""},"",null,156,13,78]
[{"$f":"\"TOTAL - \"&C31&\" - (R$):\"","v":"TOTAL - INSTRUMENTOS - ELÉTRICA - (R$):"},{"$nulls":5},{"$f":"SUBTOTAL(9,G31:G50)","v":0},null,0,0,0]
[{"$nulls":8},0,0,0]
["3.",null,"INSTRUMENTOS - CIVIL",{"$nulls":5},0,0,0]
["3.1",{"$f":"CPU_Instrumentos!B49","v":"H019701007/EMBASA"},"GPS Geodésico portátil com visor 65K de cores legível sob luz solar, à prova d'água, geocaching informatizado e recurso de mapeamento ampliados.","un x mês",{"$f":"K54","v":6},{"$f":"CPU_Instrumentos!H49","v":""},{"$f":"IF(F54=\"\",\"\",TRUNC(E54*F54,2))","v":""},null,12,1,6]
["3.2",{"$f":"CPU_Instrumentos!B50","v":"Banco de preços - NºPregão:12021 / UASG:154849 - 01/2022 (MINISTÉRIO DA EDUCAÇÃO\nSecretaria Executiva\nSubsecretaria de Planejamento e Orçamento\nInstituto Federal de Educação, Ciência e Tecnologia de Pernambuco\n/Campus Cabo de Santo Agostinho)"},"Estação Total com leitura direta de 1 segundo e precisão de 2\". Prumo óptico na alidade. Interface com principais softwares do mercado, à prova d'água e poeira conforme norma internacional: IEC529. Com kit completo, inclusive tripé com pernas extensíveis.","un x mês",6,{"$f":"CPU_Instrumentos!H50","v":""},{"$f":"IF(F55=\"\",\"\",TRUNC(E55*F55,2))","v":""},null,12,1,6]
["3.3",null,"Nível automático com precisão de ± 1,0 mm/km duplo de nivelamento, aumento de imagem 32 vezes, limbo horizontal com escala de 1º, abertura da objetiva 45 mm, foco mínimo 1,60 m. Com tripé e mira.","un x mês",6,{"$f":"CPU_Instrumentos!H51","v":""},"",null,12,1,6]
["3.4",null,"(GNSS GPS Geodésico modo RTK Precisão horizontal 8mm + 1ppm e Precisão Vertical 15mm + 1ppm modelo CHC X91+)","un x mês",6,null,"",null,12,1,6]
[{"$f":"\"TOTAL - \"&C53&\" - (R$):\"","v":"TOTAL - INSTRUMENTOS - CIVIL - (R$):"}]
[]
[{"$f":"\"TOTAL - \"&C13&\" - (R$):\"","v":"TOTAL - INSTRUMENTOS - (R$):"}]
[]
[{"$f":"\"RESUMO - \"&A$8","v":"RESUMO - INSTRUMENTOS"}]
["ITEM",null,"DESCRIÇÃO",null,null,"VALOR TOTAL (R$)"]
["01",null,{"$f":"C15","v":"INSTRUMENTOS - MECÂNICA"}]
["02",null,{"$f":"C31","v":"INSTRUMENTOS - ELÉTRICA"}]
["03",null,{"$f":"C53","v":"INSTRUMENTOS - CIVIL"}]
[{"$f":"\"TOTAL GERAL - \"&A62&\" - (R$):\"","v":"TOTAL GERAL - RESUMO - INSTRUMENTOS - (R$):"}]
[]
["NOME DO INFORMANTE:",{"$nulls":4},"QUALIFICAÇÃO:"]
[]
["ASSINATURA:",{"$nulls":4},"DATA:"]
[]
["OBSERVAÇÃO:"]
["1. A unidade adotada na planilha (un x mês) foi de acordo com o cronograma de alocação de recursos materiais, onde foi feita a divisão de uso mensalmente de cada equipamento, por canteiro. Dessa forma, é possivel diluir o custo durante todo o período do contrato."]

{"sheet":"CPU_Instrumentos","index":30,"n_rows":72,"n_cols":9,"rows_kept":72,"cut":false,"hidden":false,"merged":[[9,0,10,5],[9,6,10,7],[0,2,0,7],[1,2,1,7],[2,2,2,7],[4,0,5,7],[7,0,7,7],[75,0,75,6],[70,0,70,7],[65,0,65,2],[65,3,65,5],[11,0,12,0],[11,1,12,1],[11,2,12,2],[11,3,12,3],[11,4,12,4],[54,0,57,5],[59,0,59,5],[60,2,63,5],[11,6,12,6]]}
[null,null,"Ministério do Desenvolvimento Regional -MDR"]
[null,null,"Companhia de Desenvolvimento dos Vales do São Francisco e do Parnaíba"]
[null,null,"Gerência de Operação do PISF-Centro de Controle e Operação (AD / GOI / CCO)"]
[]
[{"$f":"Instrumentos!A5","v":"TERMO DE REFERÊNCIA PARA CONTRATAÇÃO DOS RECURSOS NECESSÁRIOS À OPERAÇÃO E MANUTENÇÃO DAS INFRAESTRUTURAS DO EIXO LESTE DO PISF - PROJETO DE INTEGRAÇÃO DO SÃO FRANCISCO COM AS BACIAS HIDROGRÁFICAS DO NORDESTE SETENTRIONAL"}]
[]
[]
["COMPOSIÇÃO DE PREÇO - INSTRUMENTOS"]
[]
["VALOR DE AQUISIÇÃO ",{"$nulls":5},"VALOR DE LOCAÇÃO "]
[]
["ITEM","CÓDIGO","DESCRIÇÃO","UNIDADE","QUANTIDADE","VALOR (R$)","UNIDADE","VALOR (R$)"]
[{"$nulls":5},"UNITARIO",null,"UNITARIO"]
["1.",null,"INSTRUMENTOS - MECÂNICA"]
["1.1",null,"Analisador de vibração VIB 496FFY VIBOTRON","un",1,null,"un x mês",{"$f":"IF(F15=\"\",\"\",((CPU_Instrumentos!F15*CPU_Instrumentos!$C$67))/'MC - VALORES ADICIONAIS'!$B$170)","v":""},"ok"]
["1.2","Banco de preços (NºPregão:102022 / UASG:153029, MINISTÉRIO DA EDUCAÇÃO\nUniversidade Tecnológica Federal do Paraná\nUTFPR - Campus Medianeira - Pregão Eletrônico, 06/2022)","Base magnética para relógio comparador","un",4,null,"un x mês",{"$f":"IF(F16=\"\",\"\",((CPU_Instrumentos!F16*CPU_Instrumentos!$C$67))/'MC - VALORES ADICIONAIS'!$B$170)","v":""}]
["1.3","Banco de preços (NºPregão:282022 / UASG:984723, PREFEITURA MUNICIPAL DE JOÃO MONLEVADE/MG - Pregão Eletrônico, 07/2022)","Estetoscópio Kent","un",2,null,"un x mês",{"$f":"IF(F17=\"\",\"\",((CPU_Instrumentos!F17*CPU_Instrumentos!$C$67))/'MC - VALORES ADICIONAIS'!$B$170)","v":""}]
["1.4",null,"Micrômetro 100 à 200 externo","un",2,null,"un x mês",{"$f":"IF(F18=\"\",\"\",((CPU_Instrumentos!F18*CPU_Instrumentos!$C$67))/'MC - VALORES ADICIONAIS'!$B$170)","v":""}]
["1.5","Banco de preços (NºPregão:752021 / UASG:168008, MINISTÉRIO DA DEFESA\nComando do Exército\nIndustria de Material Belico do Brasil/FE/RJ - Pregão Eletrônico, 01/2022)","Micrômetro externo 0 – 100mm","un",2,null,"un x mês",{"$f":"IF(F19=\"\",\"\",((CPU_Instrumentos!F19*CPU_Instrumentos!$C$67))/'MC - VALORES ADICIONAIS'!$B$170)","v":""}]
["1.6","Banco de preços (NºPregão:222022 / UASG:153178 - MINISTÉRIO DA EDUCAÇÃO\nUniversidade Tecnológica Federal do Paraná\nUTFPR - Campus Ponta Grossa, Pregão Eletrônico - 07/2022)","Micrômetro interno 50 – 800mm","un",2,null,"un x mês",{"$f":"IF(F20=\"\",\"\",((CPU_Instrumentos!F20*CPU_Instrumentos!$C$67))/'MC - VALORES ADICIONAIS'!$B$170)","v":""}]
["1.7","Banco de preços (NºPregão:102022 / UASG:160353, MINISTÉRIO DA DEFESA\nComando do Exército\nComando Militar da Amazônia\n2ºGrupamento de Engenharia de Construção\n6ºBatalhão de Engenharia de Construção - Pregão eletrônico, 05/2022)","Nível ótico (Topcon AT-B2) ou similar","un",1,null,"un x mês",{"$f":"IF(F21=\"\",\"\",((CPU_Instrumentos!F21*CPU_Instrumentos!$C$67))/'MC - VALORES ADICIONAIS'!$B$170)","v":""}]
["1.8","Banco de preços (NºPregão:252022 / UASG:154043, MINISTÉRIO DA EDUCAÇÃO\nUniversidade Federal de Uberlândia - Pregão Eletrônico, 06/2022)","Paquímetro digital 0 – 150mm/0,01mm","un",2,null,"un x mês",{"$f":"IF(F22=\"\",\"\",((CPU_Instrumentos!F22*CPU_Instrumentos!$C$67))/'MC - VALORES ADICIONAIS'!$B$170)","v":""}]
["1.9",null,"Paquímetro universal 0 - 650mm/0,02mm","un",2,null,"un x mês",{"$f":"IF(F23=\"\",\"\",((CPU_Instrumentos!F23*CPU_Instrumentos!$C$67))/'MC - VALORES ADICIONAIS'!$B$170)","v":""}]
["1.10","Banco de preços (NºPregão:832021 / UASG:742050, MINISTÉRIO DA DEFESA\nCOMANDO DA MARINHA\nCentro de Intendência Tecnológico da Marinha em São Paulo - Pregão Eletrônico, 01/2022)","Relógio comparador 0 – 10/0,01mm digital","un",4,null,"un x mês",{"$f":"IF(F24=\"\",\"\",((CPU_Instrumentos!F24*CPU_Instrumentos!$C$67))/'MC - VALORES ADICIONAIS'!$B$170)","v":""}]
["1.11","Banco de preços (NºPregão:62022 / UASG:158445, MINISTÉRIO DA EDUCAÇÃO\nSECRETARIA DE EDUCAÇÃO PROFISSIONAL E TECNOLÓGICA\nInstituto Federal de Educação, Ciência e Tecnologia do Amazonas\nCampus Manaus Centro - Pregão Eletrônico, 07/2022)","Tacômetro digital 0,1 - 1,0 RPM DT - 2234 A","un",1,null,"un x mês",{"$f":"IF(F25=\"\",\"\",((CPU_Instrumentos!F25*CPU_Instrumentos!$C$67))/'MC - VALORES ADICIONAIS'!$B$170)","v":""}]
["1.12","Banco de preços (NºPregão:7982021 / UASG:925373 - GOVERNO DO ESTADO DE RONDONIA\nSuperintendência Estadual de Compras e Licitações, Pregão Eletrônico - 01/2022)","Termômetro mira laser escala de -20 a 500ºC","un",1,null,"un x mês",{"$f":"IF(F26=\"\",\"\",((CPU_Instrumentos!F26*CPU_Instrumentos!$C$67))/'MC - VALORES ADICIONAIS'!$B$170)","v":""}]
["1.13",null,"Termovisor, com resolução Infravermelha de 120 x 90, Sensibilidade Térmica menor que 0,10 ºC, frequência da imagem de 9 Hz e faixa de temperatura –20 a 250 °C. ","un",3,null,"un x mês",{"$f":"IF(F27=\"\",\"\",((CPU_Instrumentos!F27*CPU_Instrumentos!$C$67))/'MC - VALORES ADICIONAIS'!$B$170)","v":""}]
["2.",null,"INSTRUMENTOS - ELÉTRICA"]
["2.1",null,"Alicate Amperímetro (mod. 381 CA/CC True-rms 1000V CAT III (ou similar)","un",13,null,"un x mês",{"$f":"IF(F29=\"\",\"\",((CPU_Instrumentos!F29*CPU_Instrumentos!$C$67))/'MC - VALORES ADICIONAIS'!$B$170)","v":""}]
["2.2","Banco de preços (UNIVERSIDADE ESTADUAL DE CAMPINAS\nSECR. DESENV. ECONOMICO\nCAMPINAS - Dispensa de Licitação, 01/2022)","Alicate amperímetro CA/CC de 600V, digital, CAT III FLUKE 305","un",10,null,"un x mês",{"$f":"IF(F30=\"\",\"\",((CPU_Instrumentos!F30*CPU_Instrumentos!$C$67))/'MC - VALORES ADICIONAIS'!$B$170)","v":""}]
["2.3",null,"Alicate Medidor de qualidade de energia (mod. Fluke 345 ou  similar) ","un",2,null,"un x mês",{"$f":"IF(F31=\"\",\"\",((CPU_Instrumentos!F31*CPU_Instrumentos!$C$67))/'MC - VALORES ADICIONAIS'!$B$170)","v":""}]
["2.4",null,"Boroscópio Digital Tela LCD 2,7 Pol. com Câmera de Inspeção e Saída USB ","un",2,null,"un x mês",{"$f":"IF(F32=\"\",\"\",((CPU_Instrumentos!F32*CPU_Instrumentos!$C$67))/'MC - VALORES ADICIONAIS'!$B$170)","v":""}]
["2.5",null,"Calibrador de processos multifunção digital (mod. Fluke 725 ou  similar) ","un",2,null,"un x mês",{"$f":"IF(F33=\"\",\"\",((CPU_Instrumentos!F33*CPU_Instrumentos!$C$67))/'MC - VALORES ADICIONAIS'!$B$170)","v":""},"ok"]
["2.6",null,"Fasímetro, digital, categoria IV, 40~700Vca, 600V ","un",10,null,"un x mês",{"$f":"IF(F34=\"\",\"\",((CPU_Instrumentos!F34*CPU_Instrumentos!$C$67))/'MC - VALORES ADICIONAIS'!$B$170)","v":""}]
["2.7",null,"Freqüencímetro ditital de bancada , 1GHz de 8 dígitos ","un",1,null,"un x mês",{"$f":"IF(F35=\"\",\"\",((CPU_Instrumentos!F35*CPU_Instrumentos!$C$67))/'MC - VALORES ADICIONAIS'!$B$170)","v":""}]
["2.8",null,"Medidor de distância, laser, amplitude de medição 1mm a 80m ","un",1,null,"un x mês",{"$f":"IF(F36=\"\",\"\",((CPU_Instrumentos!F36*CPU_Instrumentos!$C$67))/'MC - VALORES ADICIONAIS'!$B$170)","v":""},"ok"]
["2.9",null,"Medidor de resistência de aterramento e resistividade do solo (Faixa de medição de 0,02Ω a 300KΩ; Alcance de até 2 K Ω) com 02 pinças ","un",1,null,"un x mês",{"$f":"IF(F37=\"\",\"\",((CPU_Instrumentos!F37*CPU_Instrumentos!$C$67))/'MC - VALORES ADICIONAIS'!$B$170)","v":""}]
["2.10",null,"Medidor de vazão portátil tipo Clamp-on ","un",1,null,"un x mês",{"$f":"IF(F38=\"\",\"\",((CPU_Instrumentos!F38*CPU_Instrumentos!$C$67))/'MC - VALORES ADICIONAIS'!$B$170)","v":""},"ok"]
["2.11",null,"Megôhmetro digital de 15 kV, alcance de até 1 TΩ, Interface USB, IP54 ","un",2,null,"un x mês",{"$f":"IF(F39=\"\",\"\",((CPU_Instrumentos!F39*CPU_Instrumentos!$C$67))/'MC - VALORES ADICIONAIS'!$B$170)","v":""},"ok"]
["2.12",null,"Multímetro digital, tensão DC/AC 50,000 mV a 1000V, 0,4% (True/RMS), frequencia 99,999Hz a 999,99KHz  \"FLUKE-87-V\" com pontas prova TWIST GUARD","kg",13,null,"un x mês",{"$f":"IF(F40=\"\",\"\",((CPU_Instrumentos!F40*CPU_Instrumentos!$C$67))/'MC - VALORES ADICIONAIS'!$B$170)","v":""},"ok"]
["2.13",null,"Multímetro digital para teste de equipotencialização (medições de baixas resistências), 100V, 10A, 0,1 Ω a 50 Ω ","un",13,null,"un x mês",{"$f":"IF(F41=\"\",\"\",((CPU_Instrumentos!F41*CPU_Instrumentos!$C$67))/'MC - VALORES ADICIONAIS'!$B$170)","v":""}]
["2.14","Banco de preços (NºPregão:42022 / UASG:784810, MINISTÉRIO DA DEFESA\nCOMANDO DA MARINHA\nCentro de Intendencia da Marinha em Belem - Pregão Eletrônico, 03/2022)","Osciloscópio portátil com frequência de trabalho de 100Mhz, LCD Colorido 7”,  CAT II 600V ","un",1,null,"un x mês",{"$f":"IF(F42=\"\",\"\",((CPU_Instrumentos!F42*CPU_Instrumentos!$C$67))/'MC - VALORES ADICIONAIS'!$B$170)","v":""}]
["2.15",null,"Power Meter (Medidor Potência Fibra Óptica) potência 1310 nm, 1490 nm e 1550 nm  + Caneta Laser 10w ","un",2,null,"un x mês",{"$f":"IF(F43=\"\",\"\",((CPU_Instrumentos!F43*CPU_Instrumentos!$C$67))/'MC - VALORES ADICIONAIS'!$B$170)","v":""}]
["2.16","Banco de preços (NºPregão:7982021 / UASG:925373, GOVERNO DO ESTADO DE RONDONIA\nSuperintendência Estadual de Compras e Licitações - Pregão Eletrônico, 01/2022)","Termômetro mira laser escala de -30ºC a 500ºc ","un",13,null,"un x mês",{"$f":"IF(F44=\"\",\"\",((CPU_Instrumentos!F44*CPU_Instrumentos!$C$67))/'MC - VALORES ADICIONAIS'!$B$170)","v":""}]
["2.17","Banco de preços (NºPregão:22022 / UASG:156654, HOSPITAL DAS CLÍNICAS DA UNIVERSIDADE FEDERAL DE UBERLÂNDIA - Pregão Eletrônico, 01/2022)","Termovisor -20ºC a 350ºC, com camera de 5 megapixels, visor LCD de 3,5 polegadas ","un",3,null,"un x mês",{"$f":"IF(F45=\"\",\"\",((CPU_Instrumentos!F45*CPU_Instrumentos!$C$67))/'MC - VALORES ADICIONAIS'!$B$170)","v":""}]
["2.18",null,"Testador de cabos RJ45 / 11, frequencia 200kHz, display LCD 3 ½ digitos, 600V ","un",2,null,"un x mês",{"$f":"IF(F46=\"\",\"\",((CPU_Instrumentos!F46*CPU_Instrumentos!$C$67))/'MC - VALORES ADICIONAIS'!$B$170)","v":""}]
["2.19",null,"Verificador elétrico de tensão 1000V, sem contato com cabo (mod. T6-1000 Fluke ou similar) ","un",13,null,"un x mês",{"$f":"IF(F47=\"\",\"\",((CPU_Instrumentos!F47*CPU_Instrumentos!$C$67))/'MC - VALORES ADICIONAIS'!$B$170)","v":""}]
["3.",null,"INSTRUMENTOS - CIVIL"]
["3.1","H019701007/EMBASA","GPS Geodésico portátil com visor 65K de cores legível sob luz solar, à prova d'água, geocaching informatizado e recurso de mapeamento ampliados.","un",1,null,"un x mês",{"$f":"IF(F49=\"\",\"\",((CPU_Instrumentos!F49*CPU_Instrumentos!$C$67))/'MC - VALORES ADICIONAIS'!$B$170)","v":""}]
["3.2","Banco de preços - NºPregão:12021 / UASG:154849 - 01/2022 (MINISTÉRIO DA EDUCAÇÃO\nSecretaria Executiva\nSubsecretaria de Planejamento e Orçamento\nInstituto Federal de Educação, Ciência e Tecnologia de Pernambuco\n/Campus Cabo de Santo Agostinho)","Estação Total com leitura direta de 1 segundo e precisão de 2\". Prumo óptico na alidade. Interface com principais softwares do mercado, à prova d'água e poeira conforme norma internacional: IEC529. Com kit completo, inclusive tripé com pernas extensíveis.","un",1,null,"un x mês",{"$f":"IF(F50=\"\",\"\",((CPU_Instrumentos!F50*CPU_Instrumentos!$C$67))/'MC - VALORES ADICIONAIS'!$B$170)","v":""}]
["3.3",null,"Nível automático com precisão de ± 1,0 mm/km duplo de nivelamento, aumento de imagem 32 vezes, limbo horizontal com escala de 1º, abertura da objetiva 45 mm, foco mínimo 1,60 m. Com tripé e mira.","un",1,null,"un x mês",{"$f":"IF(F51=\"\",\"\",((CPU_Instrumentos!F51*CPU_Instrumentos!$C$67))/'MC - VALORES ADICIONAIS'!$B$170)","v":""}]
[]
["Observações"]
[]
[" art. 305 do RIR/1999 esclarece que:\n\n\"Art. 305. Poderá ser computada, como custo ou encargo, em cada período de apuração, a importância correspondente à diminuição do valor dos bens do ativo resultante do desgaste pelo uso, ação da natureza e obsolescência normal (Lei nº 4.506, de 1964, art. 57).\""]
[]
[]
[]
[]
[" Instrução Normativa da Secretaria da Receita Federal (SRF)"]
["Da","Depreciação","Da = (VN - VR) / N"]
["VN","Valor Novo"]
["VR","Valor Residual"]
["N","Vída útil (anos)"]
[]
["DADOS - Instrumentos",null,null,"CONSIDERAÇÕES"]
["Depreciação anual (%)",null,0.4]
["Vida últil (anos)",null,2.5]
[]
["1. Valor unitário final = (Depreciação anual) / (Tempo de contrato)"]
["2. A vida útil adotada, leva em consideração o uso serevero dos itens listados, visto que são utilizados em canteiros de obras e frequentemente são deslocados entre canteiros e postos de serviço em campo."]
["3. Adotou-se tempo de contrato igual a 12 meses"]

{"sheet":"CPU_MANUTENCAO_CANTEIRO","index":31,"n_rows":98,"n_cols":11,"rows_kept":98,"cut":false,"hidden":false,"merged":[[99,0,99,6],[97,0,97,6],[93,5,93,6],[94,5,94,6],[95,0,96,4],[95,5,95,6],[96,5,96,6],[89,2,89,4],[90,0,90,4],[90,5,90,6],[89,5,89,6],[94,0,94,4],[88,2,88,4],[88,5,88,6],[82,0,82,5],[86,2,86,4],[86,5,86,6],[87,2,87,4],[87,5,87,6],[14,2,14,6],[71,0,71,5],[85,0,85,6],[12,2,12,6],[10,5,10,6],[10,0,11,0],[10,1,11,1],[10,2,11,2],[10,3,11,3],[10,4,11,4],[73,2,73,6],[80,0,80,5],[0,2,0,6],[1,2,1,6],[2,2,2,6],[4,0,5,6],[7,0,7,6]]}
[null,null,"Ministério do Desenvolvimento Regional  - MDR"]
[null,null,"Companhia de Desenvolvimento dos Vales do São Francisco e do Parnaíba"]
[null,null,"Gerência de Operação do PISF - Centro de Controle e Operação (AD / GOI / CCO)"]
[]
[{"$f":"Instrumentos!A5","v":"TERMO DE REFERÊNCIA PARA CONTRATAÇÃO DOS RECURSOS NECESSÁRIOS À OPERAÇÃO E MANUTENÇÃO DAS INFRAESTRUTURAS DO EIXO LESTE DO PISF - PROJETO DE INTEGRAÇÃO DO SÃO FRANCISCO COM AS BACIAS HIDROGRÁFICAS DO NORDESTE SETENTRIONAL"}]
[]
[]
["MANUTENÇÃO DE CANTEIRO - ESCRITÓRIO"]
[]
[]
["ITEM","CÓDIGO","DESCRIÇÃO","UNIDADE","QUANTIDADE","VALOR (R$)"]
[{"$nulls":5},"UNITARIO","TOTAL"]
[null,null,{"$f":"A8","v":"MANUTENÇÃO DE CANTEIRO - ESCRITÓRIO"}]
[]
["1.",null,"MATERIAL DE CONSUMO - ESCRITÓRIO"]
["1.1",null,"Açúcar ","kg",94,null,"",{"$f":"ROUND(E16*3/4,0)","v":71}]
["1.2",null,"Água Mineral (20 l) ","un",467,null,"",{"$f":"ROUND(E17*3/4,0)","v":350}]
["1.3",null,"Água Sanitária 1000 ml ","un",39,null,"",29]
["1.4",null,"Alcool Comum 90º GL","l",39,null,"",29]
["1.5",null,"Bobina papel para ploter A0 ","un",2,null,"",2]
["1.6",null,"Café torrado e moído ","un",117,null,"",88]
["1.7",null,"Caneta esfereográfica Azul ","un",47,null,"",35]
["1.8",null,"Capa para encadernação Azul ","un",94,null,"",71]
["1.9",null,"Capa para encadernação Transparente ","un",187,null,"",140]
["1.10","E200300240/EMBASA","Cartucho colorido para impressora ","un",187,null,"",140]
["1.11","3117/ORSE","Cartucho preto para impressora ","un",32,null,"",24]
["1.12",null,"Classificador elástico ","un",24,null,"",18]
["1.13",null,"Clips nº 02 (caixa com 100 unidades)","cx",21,null,"",16]
["1.14",null,"Clips nº 04 (caixa com 100 unidades)","cx",21,null,"",16]
["1.15",null,"Clips nº 06 (caixa com 100 unidades)","cx",21,null,"",16]
["1.16",null,"Clips nº 08 (caixa com 100 unidades)","cx",21,null,"",16]
["1.17","D00065/SEDOP","Cola branca PVA","kg",4,null,"",3]
["1.18","2856/AGETOP CIVIL","Copo descartável 200 ml  (pacote c/ 50 und)","un",77,null,"",58]
["1.19",null,"Copo descartável 50 ml  (pacote c/ 50 und)","un",77,null,"",58]
["1.20",null,"Corretivo à base d'agua 18 ml ","un",35,null,"",26]
["1.21","00044330/SINAPI","Desinfetante  5L","un",197,null,"",148]
["1.22","D240000010/EMBASA","Detergente 5L","l",41,null,"",31]
["1.23","31.42.75/SUDECAP","DVD Regravável ","un",245,null,"",184]
["1.24",null,"Envelope de papel tamanho A3","un",98,null,"",74]
["1.25",null,"Envelope de papel tamanho A4","un",245,null,"",184]
["1.26",null,"Envelope de papel tamanho A5 - 200 x 280 mm","un",245,null,"",184]
["1.27",null,"Espiral 7mm ","un",78,null,"",59]
["1.28",null,"Espiral 9mm ","un",78,null,"",59]
["1.29",null,"Esponja de prato ","un",78,null,"",59]
["1.30","F099800054/EMBASA","Estilete 18mm","un",8,null,"",6]
["1.31",null,"Fita adesiva 48/100","un",32,null,"",24]
["1.32",null,"Fita adesiva transparente ","un",32,null,"",24]
["1.33","011173/SBC","Fita crepe branca 45 x 50m ","un",16,null,"",12]
["1.34","J040001151/EMBASA","Flanela ","un",12,null,"",9]
["1.35","005189/SBC","Grampeador grande de mesa P/40F","un",47,null,"",35]
["1.36","005187/SBC","Grampo 26/6 ","un",10,null,"",8]
["1.37",null,"Grampo tipo trilho ","un",5,null,"",4]
["1.38",null,"Lápis grafite ","un",56,null,"",42]
["1.39",null,"Livro de ata com 100 páginas numeradas ","un",14,null,"",11]
["1.40",null,"Marca texto ","un",59,null,"",44]
["1.41",null,"Pacote de lã de aço 60 g ","un",24,null,"",18]
["1.42",null,"Pano de chão ","un",32,null,"",24]
["1.43",null,"Pano de prato ","un",10,null,"",8]
["1.44","J049722508/EMBASA","Papel A4-resma de 500 folhas","un",39,null,"",29]
["1.45","2854/AGETOP CIVIL","Papel higiênico","un",357,null,"",268]
["1.46","F039722481/EMBASA","Papel Toalha ","un",98,null,"",74]
["1.47",null,"Pasta arquivo de A a Z Ofício","un",78,null,"",59]
["1.48",null,"Pasta suspensa ","un",78,null,"",59]
["1.49",null,"Perfurador de papel 2 furos até 30 fls","un",16,null,"",12]
["1.50",null,"Régua 30cm Acrílico Cristal","un",16,null,"",12]
["1.51","00038401/SINAPI","Rodo de borracha ","un",21,null,"",16]
["1.52","1997/ORSE","Sabão em pó 500g ","un",32,null,"",24]
["1.53","2862/AGETOP CIVIL","Sabonetes líquido ","l",197,null,"",148]
["1.54",null,"Tinta para carimbo ","un",4,null,"",3]
["1.55","00038400/SINAPI","Vassoura ","un",21,null,"",16]
[]
["TOTAL - MATERIAL DE CONSUMO - ESCRITÓRIO - (R$):",{"$nulls":5},0]
[]
["2.",null,"OUTRAS DESPESAS DE MANUTENÇÃO",{"$nulls":6},12,{"$f":"'ORCAMENTO_CONSOLIDADO (2)'!$K$1","v":6}]
["2.1","Média dos últimos meses de consumo histórico","Internet - banda larga - adequação - CANTEIRO LOTE 09 - FLORESTA/PE","mês",6,null,"",null,12,{"$f":"I75/$J$74","v":1},{"$f":"J75*$K$74","v":6}]
["2.2","Média dos últimos meses de consumo histórico","Energia Elétrica - dispêndio mensal - ocupação plena adicional - CANTEIRO LOTE 09 - FLORESTA/PE","mês",6,null,"",null,12,{"$f":"I76/$J$74","v":1},{"$f":"J76*$K$74","v":6}]
["2.3","Média dos últimos meses de consumo histórico","Internet - banda larga - adequação - SERTÂNIA/PE","mês",6,null,"",null,12,1,6]
["2.4","Média dos últimos meses de consumo histórico","Energia Elétrica - dispêndio mensal - ocupação plena adicional - SERTÂNIA/PE","mês",6,null,"",null,12,1,6]
["2.5","Média dos últimos meses de consumo histórico","Água - dispêndio mensal","mês",6,null,"",null,12,1,6]
[]
["TOTAL - OUTRAS DESPESAS DE MANUTENÇÃO - (R$):",{"$nulls":5},0]
[]
["TOTAL - MANUTENÇÃO DE CANTEIRO - ESCRITÓRIO - (R$):",{"$nulls":5},0]
[]
[]
["COMPOSIÇÃO MENSAL - MANUTENÇÃO DE CANTEIRO - ESCRITÓRIO"]
["ITEM",null,"DESCRIÇÃO",null,null,"VALOR"]
[1,null,"TOTAL - MATERIAL DE CONSUMO - ESCRITÓRIO - (R$)"]
[2,null,"TOTAL - OUTRAS DESPESAS DE MANUTENÇÃO - (R$)"]
[4,null,"PRAZO PREVISTO PARA EXECUÇÃO CONTRATUAL - (MÊS)"]
["TAXA MÉDIA - MANUTENÇÃO DE CANTEIRO - ESCRITÓRIO -  (R$ / MÊS):"]
[]
[]
["NOME DO INFORMANTE:",{"$nulls":4},"QUALIFICAÇÃO:"]
[]
["ASSINATURA:",{"$nulls":4},"DATA:"]
[]
["OBSERVAÇÃO: Os valores unitários referentes ao item 2 \"Outras Despesas de Manutenção\" foi encontrado usando a média dos últimos dispêndios mensais pagos."]

{"sheet":"Sobressalentes ","index":32,"n_rows":108,"n_cols":13,"rows_kept":108,"cut":false,"hidden":false,"merged":[[108,0,108,4],[108,5,108,6],[109,0,109,6],[110,0,110,6],[105,0,105,4],[105,5,105,6],[106,0,106,4],[106,5,106,6],[107,0,107,4],[107,5,107,6],[0,2,0,6],[1,2,1,6],[2,2,2,6],[4,0,5,6],[102,0,102,4],[102,5,102,6],[94,0,94,5],[96,0,96,6],[97,2,97,4],[97,5,97,6],[98,2,98,4],[98,5,98,6],[101,2,101,4],[101,5,101,6],[78,0,78,5],[100,2,100,4],[100,5,100,6],[7,0,7,6],[60,0,60,5],[10,0,11,0],[10,1,11,1],[10,2,11,2],[10,3,11,3],[10,4,11,4],[99,2,99,4],[99,5,99,6],[92,0,92,5],[10,5,10,6]]}
[null,null,"Ministério do Desenvolvimento Regional  - MDR"]
[null,null,"Companhia de Desenvolvimento dos Vales do São Francisco e do Parnaíba"]
[null,null,"Gerência de Operação do PISF - Centro de Controle e Operação (AD / GOI / CCO)"]
[]
[{"$f":"Equipamentos!A5","v":"TERMO DE REFERÊNCIA PARA CONTRATAÇÃO DOS RECURSOS NECESSÁRIOS À OPERAÇÃO E MANUTENÇÃO DAS INFRAESTRUTURAS DO EIXO LESTE DO PISF - PROJETO DE INTEGRAÇÃO DO SÃO FRANCISCO COM AS BACIAS HIDROGRÁFICAS DO NORDESTE SETENTRIONAL"}]
[]
[]
["AQUISIÇÃO DE PEÇAS SOBRESSALENTES PISF - EIXOS LESTE"]
[]
[]
["ITEM","CÓDIGO","DESCRIÇÃO","UNIDADE","QUANTIDADE","VALOR (R$)"]
[{"$nulls":5},"UNITARIO","TOTAL"]
[null,null,{"$f":"A8","v":"AQUISIÇÃO DE PEÇAS SOBRESSALENTES PISF - EIXOS LESTE"}]
["1.",null,"SOBRESSALENTES - MECÂNICA"]
["1.1",null,"Barra Roscada M-16 _ plicação: Vedação das juntas Dresser. Especificação: Aço inox A304","mt",80,null,"",{"$nulls":5},{"$f":"IF(G15<10000,\"X\",\"\")","v":""}]
["1.2",null,"Borracha de vedação _ Especificação: Vedante trapezidal 50x25x20x6 - EPDM Shore A70","mt",50,null,"",{"$nulls":5},{"$f":"IF(G16<10000,\"X\",\"\")","v":""}]
["1.3",null,"Borracha Neoprene 5mm _ Especificação: 2,5m x 20m (Junta de válvulas)","mtr",20,null,"",{"$nulls":5},""]
["1.4",null,"Cavalete porta escova (mola)","pç",10,null,"",{"$nulls":5},""]
["1.5",null,"Escova de aterramento do eixo _ Dimensões 10x25x40mm (AxLxC) - (Ref.: J12 item WEG 10169828) (Metal Grafite)","pç",12,null,"",{"$nulls":5},""]
["1.6",null,"Escova para o motor 6,9kV _ Escova Carvão J12  dimen.32x25x64mm (Ref. Felca FCE-100A)","pç",96,null,"",{"$nulls":5},""]
["1.7",null,"Filtro de ar do motor (entrada de ar) EBV-1, 2, 3 _  Especificação: Filtro de ar 345x925x25mm.Modelo Aeroglass FMT-C","pç",16,null,"",{"$nulls":5},""]
["1.8",null,"Filtro de ar do motor (entrada de ar) EBV-5 _  Especificação: Filtro de ar 670x280x25mm.Modelo Aeroglass FMT-C","pç",16,null,"",{"$nulls":5},""]
["1.9",null,"Filtro de ar do motor (entrada de ar) EBV-6 _  Especificação: Filtro de ar 750x225x25mm.Modelo Aeroglass FMT-C","pç",16,null,"",{"$nulls":5},""]
["1.10",null,"Filtro de ar para caixa coletora (porta escovas) _ Especificação: Filtro de ar 330x185x50mm.Modelo Aeroglass PD-U GALV","pç",36,null,"",{"$nulls":5},""]
["1.11",null,"Filtro de ar para caixa coletora (porta escovas) _ Especificação: Filtro de ar 450x400x50mm.Modelo Aeroglass PD-U GALV","pç",24,null,"",{"$nulls":5},""]
["1.12",null,"Gaxeta grafitada ¾” Quadrada.","mt",60,null,"",{"$nulls":5},""]
["1.13",null,"Gaxeta grafitada 1” Quadrada","mt",396,null,"",{"$nulls":5},""]
["1.14",null,"Óleo lubrificante ISO VG-46","lt",200,null,"",{"$nulls":5},""]
["1.15",null,"Óleo lubrificante ISO VG-68","lt",1400,null,"",{"$nulls":5},""]
["1.16",null,"O'ring Ø10 - Especificação: O'ring Ø10 x 370 - Shore 70A SBR","mt",40,null,"",{"$nulls":5},""]
["1.17",null,"O'ring Ø8 - Especificação: O'ring Ø8 x 370 - Shore 70A SBR","mt",20,null,"",{"$nulls":5},""]
["1.18","421/COMPESA","Pòrca M-16 _ Especificação: Aço inox A304","pç",240,null,"",{"$nulls":5},""]
["1.19",null,"PT 100 _ Especificação: Modelo T 01628 531166","pç",12,null,"",{"$nulls":5},""]
["1.20",null,"PT 100 _ Especificação: Modelo TR10-D CC22 2RØ11QD","pç",16,null,"",{"$nulls":5},""]
["1.21",null,"Sensor de fluxo _ Especificação: Modelo FC10B02","pç",24,null,"","ok",{"$nulls":4},""]
["1.22",null,"Sensor de nível do óleo mancal -  Especificação: Modelo HNS 3228-5-0410-000","pç",12,null,"",{"$nulls":5},""]
["1.23",null,"Sensor de nível do óleo mancal - Especificação: Modelo VB400-12GM+V1","pç",12,null,"",{"$nulls":5},""]
["1.24",null,"Sensor de vibração (acelerômetro) - Especificação: Modelo ST5484E-152-412-00 (Metrix)","pç",12,null,"","ok",{"$nulls":4},""]
["1.25",null,"Termômetro - Especificação: Modelo BIE-IN 114 69M 100MM 0/150 C XGV XNH CD1 XN6 (ASHCROFT WILLY)","pç",12,null,"",{"$nulls":5},""]
["1.26","11586/SETOP","Tubo em aço galvanizado - Especificação: Tubo A/C galvanizado Ø 2\" SCH 40","mt",72,null,"",{"$nulls":5},""]
["TOTAL - SOBRESSALENTES - MECÂNICA - (R$):",{"$nulls":11},"X"]
[{"$nulls":12},"X"]
["2.",null,"SOBRESSALENTES - ELÉTRICA",{"$nulls":9},"X"]
["2.1",null,"CARREGADOR RETIFICADOR MODULAR 380Vca/ 125Vcc, 5x20A. ESPECIFICAÇÃO TECNICA: PISF-000-92000. 1635-DEF-2810-60-08-071-R00","pç",2,null,"","ok",1,null,null,null,""]
["2.2",null,"CARREGADOR  RETIFICADOR  MODULAR  380Vca/  125Vcc,  2x25A,  CONFORME  ESPECIFICAÇÃO  TÉCNICA  nº 1600‐EST‐2811‐ 60‐08‐003  (ET  PARA  CARREGADOR  RETIFICADOR MODULAR) DESENHO DE FABRICAÇÃO: 1637‐DEF‐2819‐60‐08‐012-R02","pç",4,null,"",null,4,null,null,null,""]
["2.3",null,"Contator Tripolar de Barra 300A, 1NF + 2N, 125VCC (CV1-BH2H1HKD22)","pç",2,null,"",null,2,null,null,null,""]
["2.4",null,"Mufla, terminal, 6,9/10kV, monofásica, uso interno, cabo condutor cobre/alumínio, isolamento sólido, material termocontrátil.","pç",6,null,"",null,6,null,null,null,""]
["2.5",null,"RETIFICADOR FSE 380VCA/125VCC 10,8KVA/8,44KW 18,2A/60A (uma unidade será substituida por completo para a retirada servir de sobressalente)","pç",1,null,"",null,1,null,null,null,{"$f":"IF(G48<10000,\"X\",\"\")","v":""}]
["2.6",null,"SENSOR DE TEMPERATURA PT100 IOPE","pç",12,null,"",null,12,null,null,null,""]
["2.7",null,"SENSOR DE VIBRAÇÃO METRIX Modelo ST5484E-152-412-00","pç",12,null,"","ok",12,null,null,null,""]
["2.8",null,"Terminação contrátil à frio para cabos de 120mm²,  15kV, Fab. Prysmian","pç",13,null,"",null,13,null,null,null,""]
["2.9",null,"Terminação contrátil à frio para cabos de 240mm²,  15kV, Fab. Prysmian","pç",13,null,"",null,13,null,null,null,""]
["2.10",null,"Terminação contrátil à frio para cabos de 400mm²,  15kV, Fab. Prysmian","pç",7,null,"",null,7,null,null,null,""]
["2.11",null,"Terminação contrátil à frio para cabos de 70mm²,  15kV, Fab. Prysmian","pç",13,null,"",null,13,null,null,null,""]
["2.12",null,"Terminação contrátil à frio para cabos de 95mm²,  15kV, Fab. Prysmian","pç",13,null,"",null,13,null,null,null,""]
["2.13","001425/SBC","Terminal à compressão dois furos e duas compressões para cabos de 120mm². Cod.637400, Fab. Magnet","pç",7,null,"",null,7,null,null,null,""]
["2.14",null,"Terminal à compressão dois furos e duas compressões para cabos de 400mm². Cod.637900, Fab. Magnet","pç",7,null,"",null,7,null,null,null,""]
["2.15","008331/SBC","Terminal à compressão dois furos e duas compressões para cabos de 95mm². Cod.637303, Fab. Magnet","pç",13,null,"",null,13,null,null,null,""]
["2.16",null,"Terminal à compressão um furo e uma compressão para cabos de 120mm². Cod.631103, Fab. Magnet","pç",7,null,"",null,7,null,null,null,""]
["2.17",null,"Terminal à compressão um furo e uma compressão para cabos de 70mm². Cod.631000, Fab. Magnet","pç",13,null,"",null,13,null,null,null,""]
["TOTAL - SOBRESSALENTES - ELÉTRICA - (R$):"]
[]
[]
["3.",null,"Peças para reposições nas manutenções preventivas e corretivas dos condicionadores de ar"]
["3.1",null,"Vareta de solda foscoper 2,5 mm com banho","un.",20,null,""]
["3.2",null,"gás inflamável para maçarico portátil","kg",2,null,""]
["3.3",null,"placa universal de 30.000 BTUs","un.",5,null,""]
["3.4",null,"placa universal de 18.000 BTUs","un.",5,null,""]
["3.5",null,"placa universal de 12.000 BTUs","un.",5,null,""]
["3.6",null,"Capacitor duplo de 30 HF 440 Vac","un.",10,null,""]
["3.7",null,"Capacitor duplo de 35 HF 440 Vac","un.",24,null,""]
["3.8",null,"Capacitor  duplo de 40 HF 440 Vac","un.",46,null,""]
["3.9",null,"Capacitor duplo de 50 HF","un.",40,null,""]
["3.10","12440/ORSE","Gás refrigerante R-22a","kg",27.2,null,""]
["3.11",null,"Gás refrigerante R-410a","kg",22.6,null,""]
["3.12",null,"Motor de ventilador de condensadora redonda (Midea) de 30.000 BTUs","un.",10,null,""]
["3.13",null,"Motor de ventilador de condensadora redonda (Midea) de 18.000 BTUs","un.",10,null,""]
["3.14",null,"Motor de ventilador de condensadora redonda (Midea) de 12.000 BTUs","un.",10,null,""]
["TOTAL - Peças para reposições nas manutenções preventivas e corretivas dos condicionadores de ar - (R$):"]
[]
["4.",null,"PEÇAS PARA MANUTENÇÃO GERADOR - MECÂNICA"]
["4.1",null,"FILTRO ÓLEO COMB PERKINS/MWM D3152/T4236/P4001/410/410T/D6 - PN 423651E / RC-253-A","pç",6,null,""]
["4.2",null,"Filtro de óleo lub perkins 404D-22G - pn 140517050\nMarca: PERKINS","pç",6,null,""]
["4.3",null,"Arruela do bujão do carter perkins 1104 - pn 2415715eMarca: PERKIN","pç",6,null,""]
["4.4",null,"Filtro de óleo comb perkins 1104a/1104c - pn 4816636Marca: PERKINS","pç",5,null,""]
["4.5",null,"Solenoide de parada bomba perkins 404D-22G - pn U85206452Marca: PERKINS","pç",3,null,""]
["4.6",null,"Correia alter/vent perkins 1104C-44TAG2 - pn 2614B653Marca: PERKINS","pç",1,null,""]
["4.7",null,"BOMBA D'ÁGUA","pç",2,null,""]
["4.8",null,"VALVULA TERMOSTÁTICA","pç",2,null,""]
["4.9",null,"BOMBA ELÉTRICA+FILTRO","pç",2,null,""]
["4.10",null,"BICOS INJETORES","pç",2,null,""]
["4.11",null,"CABEÇOTE E RECUPERAÇÃO","pç",2,null,""]
["TOTAL - PEÇAS PARA MANUTENÇÃO GERADOR - MECÂNICA - (R$):"]
[]
["TOTAL - AQUISIÇÃO DE PEÇAS SOBRESSALENTES PISF - EIXOS LESTE - (R$):"]
[]
["RESUMO - AQUISIÇÃO DE PEÇAS SOBRESSALENTES PISF - EIXOS LESTE"]
["ITEM",null,"DESCRIÇÃO",null,null,"VALOR TOTAL (R$)"]
["01",null,"SOBRESSALENTES - MECÂNICA"]
["02",null,"SOBRESSALENTES - ELÉTRICA"]
["03",null,"Peças para reposições nas manutenções preventivas e corretivas dos condicionadores de ar"]
["04",null,"PEÇAS PARA MANUTENÇÃO GERADOR - MECÂNICA"]
["TOTAL GERAL - RESUMO - AQUISIÇÃO DE PEÇAS SOBRESSALENTES PISF - EIXOS LESTE -  (R$):"]
[]
[]
["NOME DO INFORMANTE:",{"$nulls":4},"QUALIFICAÇÃO:"]
[]
["ASSINATURA:",{"$nulls":4},"DATA:"]

{"sheet":"Serviços Especializados","index":33,"n_rows":41,"n_cols":8,"rows_kept":41,"cut":false,"hidden":false,"merged":[[10,5,10,6],[0,2,0,6],[1,2,1,6],[2,2,2,6],[4,0,5,6],[7,0,7,6],[10,0,11,0],[10,1,11,1],[10,2,11,2],[10,3,11,3],[10,4,11,4],[22,0,22,5],[24,0,24,5],[28,5,28,6],[29,0,29,4],[29,5,29,6],[26,0,26,6],[27,2,27,4],[27,5,27,6],[28,2,28,4],[35,0,35,4],[35,5,35,6],[36,0,36,6],[37,0,37,6],[32,0,32,4],[32,5,32,6],[33,0,33,4],[33,5,33,6],[34,0,34,4],[34,5,34,6]]}
[null,null,"Ministério do Desenvolvimento Regional  - MDR"]
[null,null,"Companhia de Desenvolvimento dos Vales do São Francisco e do Parnaíba"]
[null,null,"Gerência de Operação do PISF - Centro de Controle e Operação (AD / GOI / CCO)"]
[]
[{"$f":"Equipamentos!A5","v":"TERMO DE REFERÊNCIA PARA CONTRATAÇÃO DOS RECURSOS NECESSÁRIOS À OPERAÇÃO E MANUTENÇÃO DAS INFRAESTRUTURAS DO EIXO LESTE DO PISF - PROJETO DE INTEGRAÇÃO DO SÃO FRANCISCO COM AS BACIAS HIDROGRÁFICAS DO NORDESTE SETENTRIONAL"}]
[]
[]
["SERVIÇOS ESPECIALIZADOS (EIXO LESTE)"]
[]
[]
["ITEM","CÓDIGO","DESCRIÇÃO","UNIDADE","QUANTIDADE","VALOR (R$)"]
[{"$nulls":5},"UNITARIO","TOTAL"]
[null,null,{"$f":"A8","v":"SERVIÇOS ESPECIALIZADOS (EIXO LESTE)"}]
[]
["1.",null,"Serviços de recarga de extintores de incêndio (EB / SE / Canteiros)"]
["1.1","2.04.39/FDE","Recarga Extintor AP 10 L BC","Unid.",8,null,{"$f":"IF(F16=\"\",\"\",TRUNC(E16*F16,2))","v":""},"ok"]
["1.2","05554/EMOP","Recarga Extintor CO2 06 Kg BC","Unid.",47,null,{"$f":"IF(F17=\"\",\"\",TRUNC(E17*F17,2))","v":""},"ok"]
["1.3","07066/EMOP","Recarga Extintor PQS 04 Kg BC","Unid.",13,null,"","ok"]
["1.4","05563/EMOP","Recarga Extintor PQS 06 Kg BC","Unid.",28,null,"","ok"]
["1.5","Banco de preços -  MINISTÉRIO DA DEFESA\nCOMANDO DA MARINHA\nCentro de Intendencia da Marinha em Salvador (NºPregão:132022 / UASG:782802 - 07/2022)","Recarga Extintor PQS 08 Kg BC","Unid.",2,null,"","ok"]
["1.6","Banco de preços -  MINISTÉRIO DA DEFESA\nCOMANDO DA MARINHA\nCentro de Intendencia da Marinha em Salvador (NºPregão:132022 / UASG:782802 - 07/2022)","Recarga Extintor PQS 12 Kg BC","Unid.",50,null,"","ok"]
["1.7","Banco de preços - MINISTÉRIO DA DEFESA\nComando da Aeronáutica\nBASE AÉREA DE ANAPOLIS (NºPregão:672021 / UASG:120624 - 10/2021)","Recarga Extintor PQS 50 Kg BC","Unid.",36,null,"","ok"]
[{"$f":"\"TOTAL - \"&C15&\" - (R$):\"","v":"TOTAL - Serviços de recarga de extintores de incêndio (EB / SE / Canteiros) - (R$):"}]
[]
[{"$f":"\"TOTAL - \"&C13&\" - (R$):\"","v":"TOTAL - SERVIÇOS ESPECIALIZADOS (EIXO LESTE) - (R$):"}]
[]
[{"$f":"\"RESUMO - \"&A$8","v":"RESUMO - SERVIÇOS ESPECIALIZADOS (EIXO LESTE)"}]
["ITEM",null,"DESCRIÇÃO",null,null,"VALOR TOTAL (R$)"]
["01",null,{"$f":"C15","v":"Serviços de recarga de extintores de incêndio (EB / SE / Canteiros)"}]
[{"$f":"\"TOTAL GERAL - \"&A27&\" -  (R$):\"","v":"TOTAL GERAL - RESUMO - SERVIÇOS ESPECIALIZADOS (EIXO LESTE) -  (R$):"}]
[]
[]
["NOME DO INFORMANTE:",{"$nulls":4},"QUALIFICAÇÃO:"]
[]
["ASSINATURA:",{"$nulls":4},"DATA:"]
[]
["OBSERVAÇÃO:"]
["TABELAS DE REFERÊNCIA"]
["Banco de Preços"]
["EMOP 04/2022"]
["FDE 04/2022"]

{"sheet":"SERVIÇOS ADICIONAIS","index":34,"n_rows":100,"n_cols":11,"rows_kept":100,"cut":false,"hidden":false,"merged":[[99,3,99,5],[57,0,57,6],[95,3,96,3],[95,4,96,4],[95,5,96,5],[95,6,96,6],[32,0,32,4],[32,5,32,6],[53,0,53,2],[33,0,33,4],[33,5,33,6],[34,0,34,4],[34,5,34,6],[35,0,35,4],[35,5,35,6],[38,0,41,5],[43,0,43,5],[44,2,47,5],[49,0,49,2],[49,3,49,5],[25,0,25,6],[27,2,27,4],[27,5,27,6],[29,0,29,4],[29,5,29,6],[26,2,26,4],[26,5,26,6],[28,2,28,4],[28,5,28,6],[0,2,0,6],[1,2,1,6],[2,2,2,6],[4,0,5,6],[8,0,8,6],[10,5,10,6],[12,2,12,6],[17,0,17,5],[23,0,23,5],[10,0,11,0],[10,1,11,1],[10,2,11,2],[10,3,11,3],[10,4,11,4],[21,0,21,5]]}
[null,null,"Ministério do Desenvolvimento Regional  - MDR"]
[null,null,"Companhia de Desenvolvimento dos Vales do São Francisco e do Parnaíba"]
[null,null,"Gerência de Operação do PISF - Centro de Controle e Operação (AD / GOI / CCO)"]
[]
[{"$f":"[1]ORCAMENTO_RESUMO!A5","v":"TERMO DE REFERÊNCIA PARA CONTRATAÇÃO DOS RECURSOS NECESSÁRIOS À OPERAÇÃO E MANUTENÇÃO DAS INFRAESTRUTURAS DO EIXO LESTE DO PISF - PROJETO DE INTEGRAÇÃO DO SÃO FRANCISCO COM AS BACIAS HIDROGRÁFICAS DO NORDESTE SETENTRIONAL"}]
[]
["Referência","05/2022 - SEDOP (PA)"]
[null,"03/2021 - SEINFRA (CE)"]
["SERVIÇOS ADICIONAIS"]
[]
["ITEM","CÓDIGO","DESCRIÇÃO","UNIDADE","QUANTIDADE","VALOR (R$)"]
[{"$nulls":5},"UNITARIO","TOTAL"]
[null,null,"SERVIÇOS ADICIONAIS"]
[]
["1.",null,"FORNECIMENTO DE ÁGUA POTÁVEL PARA CANTEIRO",{"$nulls":6},12,{"$f":"'ORCAMENTO_CONSOLIDADO (2)'!$K$1","v":6}]
["1.1",{"$f":"B55","v":"I8949/SEINFRA"},{"$f":"C55","v":"Estação de tratamento de água"},"un x mês",{"$f":"K16","v":12},{"$f":"E55","v":""},{"$f":"IF(F16=\"\",\"\",ROUND(E16*F16,2))","v":""},null,24,{"$f":"I16/$J$15","v":2},{"$f":"J16*$K$15","v":12}]
["1.2",{"$f":"B56","v":"220497/SEDOP"},{"$f":"C56","v":"Poço Tubular"},"un x mês",{"$f":"K17","v":12},{"$f":"E56","v":""},{"$f":"IF(F17=\"\",\"\",ROUND(E17*F17,2))","v":""},null,24,{"$f":"I17/$J$15","v":2},{"$f":"J17*$K$15","v":12}]
["TOTAL - ESTAÇÃO DE TRATAMENTO DE ÁGUA - (R$):"]
[]
["2.",null,"ANÁLISES DE EFLUENTES"]
["2.1","COT - AQA","Análise de Efluentes - Conama nº 357 e Resolução ANA nº 85/18 ","un x mês",{"$f":"K21","v":6},null,null,null,12,1,6]
["TOTAL - ESTAÇÃO DE TRATAMENTO DE ÁGUA - (R$):"]
[]
["TOTAL - SERVIÇOS ADICIONAIS - (R$):"]
[]
["RESUMO - SERVIÇOS ADICIONAIS"]
["ITEM",null,"DESCRIÇÃO",null,null,"VALOR TOTAL (R$)"]
["01",null,{"$f":"C15","v":"FORNECIMENTO DE ÁGUA POTÁVEL PARA CANTEIRO"}]
["02",null,{"$f":"C20","v":"ANÁLISES DE EFLUENTES"}]
["TOTAL GERAL - RESUMO - SERVIÇOS ADICIONAIS -  (R$):"]
[]
[]
["NOME DO INFORMANTE:",{"$nulls":4},"QUALIFICAÇÃO:"]
[]
["ASSINATURA:",{"$nulls":4},"DATA:"]
[]
["Observações"]
[]
[" art. 305 do RIR/1999 esclarece que:\n\n\"Art. 305. Poderá ser computada, como custo ou encargo, em cada período de apuração, a importância correspondente à diminuição do valor dos bens do ativo resultante do desgaste pelo uso, ação da natureza e obsolescência normal (Lei nº 4.506, de 1964, art. 57).\""]
[]
[]
[]
[]
[" Instrução Normativa da Secretaria da Receita Federal (SRF)"]
["Da","Depreciação","Da = (VN - VR) / N"]
["VN","Valor Novo"]
["VR","Valor Residual"]
["N","Vída útil (anos)"]
[]
["DADOS - ETA e Poço",null,null,"CONSIDERAÇÕES"]
["Depreciação anual (%)",null,0.1]
["Vida últil (anos)",null,10]
[]
["DESCRIÇÃO",null,null,"Valor de aquisição (R$)","Valor com depreciação (R$)"]
["und","I8949/SEINFRA","Estação de tratamento de água",{"$f":"IF(G98=\"\",\"\",SUM(G98:G99))","v":""},{"$f":"IF(D55=\"\",\"\",C51*D55/12)","v":""}]
["und","220497/SEDOP","Poço Tubular",null,{"$f":"IF(D56=\"\",\"\",C51*D56/12)","v":""}]
["1. Valor unitário final = (Depreciação anual) / (Tempo de contrato)"]
[]
[]
[]
[null,"Poço Tubular","Código - 220497/SEDOP - 05/2022"]
{"$rows_empty":33}
[null,"Estação de Tratamento de Água  - Código I8949 e I7995/ SEINFRA "]
[null,"ITEM","DESCRIÇÃO","UND","QUANTID","CÓDIGO","UNITÁRIO"]
[null,1,"COMPOSIÇÃO - ESTAÇÃO DE TRATAMENTO DE ÁGUA"]
[null,"1.1","Filtro de fluxo descendente fabricado em fibra de vidro completo com tampa, barrilete, escada e material filtrante, com Ø 2,50m, com capacidade para tratar uma vazão de 42,04 m³ com uma taxa de filtração de 51,39 m³/m³ x d, constituido por leito filtrante, camada suporte, flanges e barrilete imediato e dispositivo piezometrico","un",1,"SEINFRA-I8949"]
[null,"1.2","Kit de armazenamento preparação e dosagem de soluções químicas constituido por reservatório em fibra de vidro com volume útil de 500l, misturador pneumatico e bomba dosadora com vazão até 40 l/h.","un",1,"SEINFRA-I7995"]
[null,null,"VALORES PUBLICADOS EM 31/03/2021","TOTAL - ESTAÇÃO DE TRATAMENTO DE ÁGUA - (R$):",null,null,{"$f":"SUM(G98:G99)","v":0}]

{"sheet":"Custos Administração","index":35,"n_rows":32,"n_cols":4,"rows_kept":32,"cut":false,"hidden":false,"merged":[[0,1,0,2],[1,1,1,2],[2,1,2,2],[4,0,5,2],[7,0,7,2],[24,0,24,1],[27,0,27,1],[28,0,28,1],[34,0,34,2],[11,1,11,2],[29,0,29,1],[30,0,30,1],[31,0,31,2],[32,0,32,2],[33,0,33,2],[15,0,15,1],[18,0,18,2]]}
[null,"Ministério do Desenvolvimento Regional  - MDR"]
[null,"Companhia de Desenvolvimento dos Vales do São Francisco e do Parnaíba"]
[null,"Gerência de Operação do PISF - Centro de Controle e Operação (AD / GOI / CCO)"]
[]
[{"$f":"ORCAMENTO_RESUMO!A5","v":"TERMO DE REFERÊNCIA PARA CONTRATAÇÃO DOS RECURSOS NECESSÁRIOS À OPERAÇÃO E MANUTENÇÃO DAS INFRAESTRUTURAS DO EIXO LESTE DO PISF - PROJETO DE INTEGRAÇÃO DO SÃO FRANCISCO COM AS BACIAS HIDROGRÁFICAS DO NORDESTE SETENTRIONAL"}]
[]
[]
["CUSTOS ADMINISTRAÇÃO - DETALHAMENTO"]
[]
[]
["ITEM","DESCRIÇÃO","%"]
["1.","CUSTO DE ADMINISTRAÇÃO"]
["1.1","Custos da equipe da administração central da empresa contratada ( diretoria, pessoal técnico de apoio e pessoal administrativo não diretamente vinculado à prestação dos serviços)",0.03]
["1.2","Outras despesas que afetam o custo de produção como treinamento, biblioteca, programa de qualidade, auditoria interna e externa",2.5000000000000001E-3]
["1.3","Despesas com aluguéis, água, energia, comunicação, manutenção e transporte não diretamente relacionados com o custo direto dos serviços",2E-3]
[{"$f":"\"Total - \"&B12&\" - (R$):\"","v":"Total - CUSTO DE ADMINISTRAÇÃO - (R$):"},null,{"$f":"SUBTOTAL(9,C12:C15)","v":3.4500000000000003E-2},"ok"]
[]
[]
[{"$f":"\"RESUMO - \"&A$8","v":"RESUMO - CUSTOS ADMINISTRAÇÃO - DETALHAMENTO"}]
["ITEM","DESCRIÇÃO","% TOTAL"]
[1,{"$f":"B12","v":"CUSTO DE ADMINISTRAÇÃO"},{"$f":"C16","v":3.4500000000000003E-2},"ok"]
[2,"Seguros e Garantias",5.7000000000000002E-3,0.8]
[3,"Riscos (MATRIZ DE RISCO)",0.01]
[4,"Despesas Financeiras",9.1000000000000004E-3,1.23]
[{"$f":"\"TOTAL GERAL - \"&A$8&\" - (R$):\"","v":"TOTAL GERAL - CUSTOS ADMINISTRAÇÃO - DETALHAMENTO - (R$):"},null,{"$f":"SUM(C21:C24)","v":5.9300000000000005E-2}]
[]
[]
["NOME DO INFORMANTE:",null,"QUALIFICAÇÃO:"]
[]
["ASSINATURA:",null,"DATA:"]
[]
["OBSERVAÇAO:"]

{"sheet":"CPU_MATRIZ DE RISCO","index":36,"n_rows":28,"n_cols":8,"rows_kept":28,"cut":false,"hidden":true,"merged":[[24,0,24,4],[23,0,23,4],[25,0,25,4],[26,0,26,5],[27,0,32,5],[0,1,0,5],[1,1,1,5],[2,1,2,5],[15,1,15,5],[16,1,16,4],[10,1,10,2],[9,1,9,5],[7,0,7,5],[4,0,5,5],[22,0,22,4],[17,1,17,4],[18,1,18,4],[19,0,19,4],[11,1,11,2],[13,0,13,5]]}
[null,"Ministério do Desenvolvimento Regional  - MDR"]
[null,"Companhia de Desenvolvimento dos Vales do São Francisco e do Parnaíba"]
[null,"Gerência de Operação do PISF - Centro de Controle e Operação (AD / GOI / CCO)"]
[]
[{"$f":"ORCAMENTO_RESUMO!A5","v":"TERMO DE REFERÊNCIA PARA CONTRATAÇÃO DOS RECURSOS NECESSÁRIOS À OPERAÇÃO E MANUTENÇÃO DAS INFRAESTRUTURAS DO EIXO LESTE DO PISF - PROJETO DE INTEGRAÇÃO DO SÃO FRANCISCO COM AS BACIAS HIDROGRÁFICAS DO NORDESTE SETENTRIONAL"}]
[]
[]
["DETALHAMENTO - MATRIZ DE RISCO"]
[]
["ITEM","DESCRIÇÃO"]
["1.","DISCRIMINAÇÃO DE VALORES ADOTADOS",null,"VALOR BASE (OUTUBRO DE 2019)","REAJUSTE IGP-M, FGV, DEZEMBRO DE 2021 (1,4851)","VALOR ADOTADO (R$)","out/19-dez/21",{"$f":"(1100.998-741.333)/741.333","v":0.48515984044956867}]
["1.1","xxx",null,205163545.59,{"$f":"D12*(1+H11)","v":304700658.63451225},300000000]
["1.2","Valor deste objeto:",null,null,null,{"$f":"'ORCAMENTO_CONSOLIDADO (2)'!G7","v":0},null,"'ORCAMENTO_CONSOLIDADO (2)'!G7"]
[]
[]
["ITEM","DESCRIÇÃO"]
["1.","RISCO TOTAL ( [A]/[B] )",null,null,null,"VALOR"]
["1.1","VALOR DE [A]  - Índice de risco (0,35%)"]
["1.2","VALOR DE [B]",null,null,null,{"$f":"F13","v":0}]
[{"$f":"\"Total - \"&B17&\" - (%):\"","v":"Total - RISCO TOTAL ( [A]/[B] ) - (%):"},{"$nulls":4},{"$f":"F18/F19","v":{"$error":"#DIV/0!"}}]
[]
[]
["NOME DO INFORMANTE:",{"$nulls":4},"QUALIFICAÇÃO:"]
[]
["ASSINATURA:",{"$nulls":4},"DATA:"]
[]
["OBSERVAÇAO:"]
["A matriz de risco considera uma base ampla de obras e serviços que necessitam ser executados, concluídos ou reparados:\nEsta base foi levantada pelo MDR e licitada pelo MDR e licitada com planilha orçamentária no valor de R$ 205.163.545,59 (base: outubro de 2019). A licitação foi fracassada e estes serviços não foram executados até o momento, gerando necessidades da realização de paliativos para manter o sistema do PISF – Eixo Leste funcionando. \nDessa forma, a MATRIZ DE RISCO considera que a empresa vencedora da licitação conviverá com esse problema até que o MDR reedite a licitação e execute os referidos serviços nela contidos. De maneira que a empresa contratada para Operação, Manutenção, Reforma e Melhoria do PISF – Eixo Leste, terá que executar alguns serviços imprevisíveis que acabaram sendo necessários para dar continuidade ao serviço de fornecimento de água do PISF – EIXO LESTE. \n"]

{"sheet":"Despesas Fiscais","index":37,"n_rows":50,"n_cols":4,"rows_kept":50,"cut":false,"hidden":false,"merged":[[4,0,5,3],[7,0,7,3],[0,1,0,3],[1,1,1,3],[2,1,2,3],[11,1,11,3],[15,0,15,1],[26,0,26,1],[18,0,18,3],[25,2,25,3],[25,0,25,1],[27,0,27,1],[26,2,26,3],[27,2,27,3],[21,0,21,1],[19,2,19,3],[20,2,20,3],[21,2,21,3],[49,0,51,3],[52,0,52,3],[36,0,36,1],[28,0,28,3],[29,0,30,3],[31,0,32,3],[33,0,34,3],[35,0,35,3],[37,0,38,3],[39,0,40,3],[41,0,43,3],[45,0,47,3]]}
[null,"Ministério do Desenvolvimento Regional  - MDR"]
[null,"Companhia de Desenvolvimento dos Vales do São Francisco e do Parnaíba"]
[null,"Gerência de Operação do PISF - Centro de Controle e Operação (AD / GOI / CCO)"]
[]
[{"$f":"'Custos Administração'!A5","v":"TERMO DE REFERÊNCIA PARA CONTRATAÇÃO DOS RECURSOS NECESSÁRIOS À OPERAÇÃO E MANUTENÇÃO DAS INFRAESTRUTURAS DO EIXO LESTE DO PISF - PROJETO DE INTEGRAÇÃO DO SÃO FRANCISCO COM AS BACIAS HIDROGRÁFICAS DO NORDESTE SETENTRIONAL"}]
[]
[]
["DESPESAS FISCAIS - DETALHAMENTO"]
[]
[]
["ITEM","DESCRIÇÃO","DF %","DF' %"]
["1.","DESPESAS FISCAIS"]
["1.1","ISS",0.05,{"$f":"ROUND((1/(1-$C$16))*C13,4)","v":5.4699999999999999E-2}]
["1.2","PIS",6.4999999999999997E-3,{"$f":"ROUND((1/(1-$C$16))*C14,4)","v":7.1000000000000004E-3}]
["1.3","COFINS",0.03,{"$f":"ROUND((1/(1-$C$16))*C15,4)","v":3.2800000000000003E-2}]
[{"$f":"\"TOTAL - \"&B12&\" - (R$):\"","v":"TOTAL - DESPESAS FISCAIS - (R$):"},null,{"$f":"SUM(C13:C15)","v":8.6499999999999994E-2},{"$f":"SUM(D13:D15)","v":9.4600000000000004E-2}]
[]
[]
[{"$f":"\"RESUMO - \"&A$8","v":"RESUMO - DESPESAS FISCAIS - DETALHAMENTO"}]
["ITEM","DESCRIÇÃO","% TOTAL"]
[1,{"$f":"B12","v":"DESPESAS FISCAIS"},{"$f":"D16","v":9.4600000000000004E-2}]
[{"$f":"\"TOTAL GERAL - \"&A$8&\" - (R$):\"","v":"TOTAL GERAL - DESPESAS FISCAIS - DETALHAMENTO - (R$):"},null,{"$f":"SUM(C21:C21)","v":9.4600000000000004E-2}]
[]
[]
["NOME DO INFORMANTE:",null,"QUALIFICAÇÃO:"]
[]
["ASSINATURA:",null,"DATA:"]
[]
["OBSERVAÇAO:"]
["1 - DISCRIMINAR OS TRIBUTOS QUE INCIDEM SOBRE OS CUSTOS DA PRESTAÇÃO DOS SERVIÇOS"]
[]
["2 - DF = INDICAR O % DE CADA TRIBUTO E A SOMA DOS MESMOS (ex: ISS 5% + PIS 0,65% + COFINS 3,00% = 8,65%)]"]
[]
["3 - AS DESPESAS FISCAIS (DF) INCIDEM SOBRE O TOTAL DA FATURA E NÃO SOBRE OS CUSTOS INCORRIDOS, DEVENDO SER CALCULADO O DF' APLICANDO-SE A SEGUINTE FÓRMULA:"]
[]
["     DF' = { [ 1 / ( 1 - DF) ] - 1 } x 100"]
["     DF' = { [ 1 / ( 1 - 0,0865 ) ] - 1 } x 100                        DF'=",null,9.4600000000000004E-2]
["     DF' = 0,0946 ou  9,46%.  APLICAR O %  P/ CALCULAR AS DESPESAS FISCAIS"]
[]
[]
[]
["A Secretaria de Controle Interno do STF, por meio da Nota Técnica 3/2009 - SCI (Evidência 8), exige que as empresas eventualmente tributadas pelo regime de incidência não-cumulativa apresentem, nas licitações de contratações de serviços, os percentuais cotados para o PIS e a COFINS de acordo com o aproveitamento de créditos tributários dos últimos dozes meses, conforme transcrição a seguir:"]
[]
[]
[]
["1. Por essa razão, caso se tenha utilizado, na definição do percentual máximo de BDI para o regime de incidência não-cumulativa, os percentuais máximos de 7,60% para a COFINS e de 1,65% para o PIS, a Secretaria de Controle Interno entende que a empresa não deve cotar esses percentuais máximos, mas aqueles que representem a média das alíquotas efetivamente recolhidas nos últimos doze meses."]
[]
[]
[]
["2. Assim, as empresas sujeitas ao regime de tributação de incidência não-cumulativa devem apresentar o Demonstrativo de Apuração de Contribuições Sociais - DACON utilizado para elaborar a declaração de que os percentuais de PIS c de COFINS cotados correspondem à média dos recolhimentos dos últimos doze meses."]