{"text_format":"2","workbook":"xlsx","n_sheets":4,"sheets":["ORÇAMENTO","CPU","BDI SERV","CRONOGRAMA"],"not_rendered":{"charts":0,"images":2,"macros":0,"external_links":0,"defined_names":4,"comments":1,"pivot_tables":0},"unopened":[],"bounds":{"document_bytes":16777216,"sheet_cells":100000,"run_cost":"one","rows_first":2000,"rows_last":500,"rows_between":2000,"halvings":0,"cell_chars":16384,"cell_head_chars":4096},"cells_cut":0,"cells_raw":0,"read":"whole","date_system":"1900"}

{"sheet":"ORÇAMENTO","index":0,"n_rows":27,"n_cols":9,"rows_kept":27,"cut":false,"hidden":false,"merged":[[6,6,6,7],[26,1,26,2],[0,0,7,0],[0,2,0,8],[1,2,1,8],[2,2,2,8],[4,2,4,8],[5,6,5,7],[18,6,18,7]]}
["<---- NUMERAR SERVIÇOS PARA CPU",null,"Ministério do Desenvolvimento Regional"]
[null,null,"Companhia de Desenvolvimento dos Vales do São Francisco e do Parnaíba"]
[null,null,"1ª Superintendência Regional"]
[]
[null,"OBRA: ","PAVIMENTAÇÃO EM POLIÉDRICO - COMUNIDADE DOS PEROBAS - PERDIGÃO / MG"]
[null,"DATA:","OUTUBRO/2022",null,null,null,"BDI Serviços:",null,{"$f":"'BDI SERV'!D31/100","v":0.18510000000000001}]
[null,"PRAZO DE EXECUÇÃO:     90 DIAS"]
[null,"ITEM","DISCRIMINAÇÃO","REFER.","UNID.","QUANT.","P. UNITÁRIO","P.UNIT.C/ BDI","P. TOTAL"]
["A",1,"SERVIÇOS PRELIMINARES ",{"$nulls":5},{"$f":"SUM(I10:I14)","v":27378.93}]
[1,"1.1","MOBILIZAÇÃO E DESMOBILIZAÇÃO","CPU","GL",1,{"$f":"VLOOKUP(A10,CPU!$A$1:$N$4382,9)","v":2163.84},{"$f":"VLOOKUP(A10,CPU!$A$1:$N$4382,10)","v":2564.3667840000003},{"$f":"ROUND(F10*H10,2)","v":2564.37}]
[2,"1.2","ADMINISTRAÇÃO LOCAL","CPU","GL",1,{"$f":"VLOOKUP(A11,CPU!$A$1:$N$4382,9)","v":16356.763567635675},{"$f":"VLOOKUP(A11,CPU!$A$1:$N$4382,10)","v":19384.410504005038},{"$f":"ROUND(F11*H11,2)","v":19384.41}]
[3,"1.3","CANTEIRO DE OBRAS","CPU","GL",1,{"$f":"VLOOKUP(A12,CPU!$A$1:$N$4382,9)","v":2758.5},{"$f":"VLOOKUP(A12,CPU!$A$1:$N$4382,10)","v":3269.0983500000002},{"$f":"ROUND(F12*H12,2)","v":3269.1}]
[4,"1.4","PLACA DE OBRA EM CHAPA DE AÇO GALVANIZADO","74209/001","M2",2,{"$f":"VLOOKUP(A13,CPU!$A$1:$N$4382,9)","v":594},{"$f":"VLOOKUP(A13,CPU!$A$1:$N$4382,10)","v":703.94939999999997},{"$f":"ROUND(F13*H13,2)","v":1407.9}]
[5,"1.5","LOCAÇÃO DE PAVIMENTAÇÃO",99064,"M",992.99999999999989,{"$f":"VLOOKUP(A14,CPU!$A$1:$N$4382,9)","v":0.64},{"$f":"VLOOKUP(A14,CPU!$A$1:$N$4382,10)","v":0.75846400000000003},{"$f":"ROUND(F14*H14,2)","v":753.15}]
["B",2,"PAVIMENTAÇÃO",{"$nulls":5},{"$f":"SUM(I16:I21)","v":381612.62}]
[6,"2.1","ESCAVAÇÃO HORIZONTAL EM SOLO DE 1A CATEGORIA ",101116,"M3",2090.0039999999999,{"$f":"VLOOKUP(A16,CPU!$A$1:$N$4382,9)","v":2.14},{"$f":"VLOOKUP(A16,CPU!$A$1:$N$4382,10)","v":2.5361140000000004},{"$f":"ROUND(F16*H16,2)","v":5300.49}]
[7,"2.2","CARGA, MANOBRA E DESCARGA DE SOLOS E MATERIAIS GRANULARES EM CAMINHÃO BASCULANTE - DESCARGA LIVRE",100976,"M3",2090.0039999999999,{"$f":"VLOOKUP(A17,CPU!$A$1:$N$4382,9)","v":3.83},{"$f":"VLOOKUP(A17,CPU!$A$1:$N$4382,10)","v":4.5389330000000001},{"$f":"ROUND(F17*H17,2)","v":9486.39}]
[8,"2.3","REGULARIZAÇÃO E COMPACTAÇÃO DE SUBLEITO",100576,"M2",6949.9999999999991,{"$f":"VLOOKUP(A18,CPU!$A$1:$N$4382,9)","v":2.2200000000000002},{"$f":"VLOOKUP(A18,CPU!$A$1:$N$4382,10)","v":2.6309220000000004},{"$f":"ROUND(F18*H18,2)","v":18284.91}]
[null,"2.4","AQUISIÇÃO DE CASCALHO PARA EXECUÇÃO DA BASE","-","M3",1049.9969999999998,"A CARGO DA PREFEITURA",null,0]
[9,"2.5","EXECUÇÃO E COMPACTAÇÃO DE BASE E OU SUB BASE PARA PAVIMENTAÇÃO DE CASCALHO - EXCLUSIVE SOLO, ESCAVAÇÃO, CARGA E TRANSPORTE. ",96388,"M3",1049.9969999999998,{"$f":"VLOOKUP(A20,CPU!$A$1:$N$4382,9)","v":10.57},{"$f":"VLOOKUP(A20,CPU!$A$1:$N$4382,10)","v":12.526507000000001},{"$f":"ROUND(F20*H20,2)","v":13152.79}]
[10,"2.6","EXECUÇÃO DE PAVIMENTO EM PEDRAS POLIÉDRICAS, REJUNTAMENTO COM PÓ DE PEDRA",101170,"M2",6949.9999999999991,{"$f":"VLOOKUP(A21,CPU!$A$1:$N$4382,9)","v":40.72},{"$f":"VLOOKUP(A21,CPU!$A$1:$N$4382,10)","v":48.257272},335388.03999999998]
["C",3,"TRANSPORTE DE MATERIAIS",{"$nulls":5},{"$f":"SUM(I23:I24)","v":57173.72}]
[11,"3.1","TRANSPORTE COM CAMINHÃO BASCULANTE, EM VIA EM REVESTIMENTO PRIMÁRIO",95426,"M3XKM",3140.0009999999997,{"$f":"VLOOKUP(A23,CPU!$A$1:$N$4382,9)","v":1.02},{"$f":"VLOOKUP(A23,CPU!$A$1:$N$4382,10)","v":1.2088020000000002},{"$f":"ROUND(F23*H23,2)","v":3795.64}]
[12,"3.2","TRANSPORTE COM CAMINHÃO BASCULANTE, EM VIA PAVIMENTADA",95427,"M3XKM",61699.995019046393,{"$f":"VLOOKUP(A24,CPU!$A$1:$N$4382,9)","v":0.73000000000000009},{"$f":"VLOOKUP(A24,CPU!$A$1:$N$4382,10)","v":0.86512300000000009},{"$f":"ROUND(F24*H24,2)","v":53378.080000000002}]
["D",4,"DRENAGEM E OBRAS COMPLEMENTARES",{"$nulls":5},{"$f":"SUM(I26:I26)","v":112879.07}]
[13,"4.1","GUIA (MEIO-FIO) E SARJETA CONJUGADOS DE CONCRETO, MOLDADA  IN LOCO COM EXTRUSORA, 45 CM BASE (15 CM DA GUIA + 30 CM DA SARJETA) X 22 CM ALTURA",94267,"M",1985.9999999999998,{"$f":"VLOOKUP(A26,CPU!$A$1:$N$4382,9)","v":47.96},{"$f":"VLOOKUP(A26,CPU!$A$1:$N$4382,10)","v":56.837396000000005},{"$f":"ROUND(F26*H26,2)","v":112879.07}]
[null,"TOTAL GERAL DA OBRA COM BDI ",{"$nulls":6},{"$f":"SUM(I9,I15,I22,I25)","v":579044.34000000008}]

{"sheet":"CPU","index":1,"n_rows":191,"n_cols":13,"rows_kept":191,"cut":false,"hidden":false,"merged":[[26,1,26,6],[27,1,27,6],[28,1,28,6],[30,1,30,3],[30,4,30,7],[41,1,41,3],[41,4,41,7],[77,5,77,6],[78,1,78,6],[42,2,42,5],[43,2,43,3],[44,1,44,7],[53,1,53,3],[53,5,53,6],[41,10,41,11],[96,0,111,0],[113,0,130,0],[162,1,162,3],[162,4,162,7],[163,2,163,5],[164,2,164,3],[165,1,165,7],[113,1,113,3],[113,4,113,7],[114,2,114,5],[115,2,115,3],[116,1,116,7],[97,2,97,5],[98,2,98,3],[99,1,99,7],[108,1,108,3],[108,5,108,6],[109,1,109,6],[110,1,110,6],[111,1,111,6],[96,1,96,3],[96,4,96,7],[79,1,79,6],[30,10,30,11],[31,2,31,5],[32,2,32,3],[33,1,33,7],[36,1,36,3],[36,5,36,6],[37,1,37,6],[38,1,38,6],[39,1,39,6],[174,0,191,0],[169,1,169,3],[169,5,169,6],[149,0,161,0],[162,0,172,0],[127,5,127,6],[128,1,128,6],[129,1,129,6],[130,1,130,6],[135,1,135,7],[144,1,144,3],[144,5,144,6],[145,1,145,6],[127,1,127,3],[133,2,133,5],[134,2,134,3],[151,2,151,3],[152,1,152,7],[157,5,157,6],[158,1,158,6],[159,1,159,6],[160,1,160,6],[174,1,174,3],[174,4,174,7],[64,1,64,3],[64,5,64,6],[65,1,65,6],[66,1,66,6],[67,1,67,6],[69,1,69,3],[69,4,69,7],[0,10,0,11],[1,2,1,5],[2,2,2,3],[3,1,3,7],[8,1,8,3],[8,5,8,6],[9,1,9,6],[10,1,10,6],[11,1,11,6],[13,1,13,3],[13,4,13,7],[13,10,13,11],[14,2,14,5],[15,2,15,3],[16,1,16,7],[25,1,25,3],[25,5,25,6],[54,1,54,6],[55,1,55,6],[56,1,56,6],[58,1,58,3],[58,4,58,7],[58,10,58,11],[59,2,59,5],[60,2,60,3],[61,1,61,7],[190,1,190,6],[149,10,149,11],[150,2,150,5],[0,0,12,0],[13,0,29,0],[30,0,40,0],[41,0,57,0],[58,0,68,0],[132,0,148,0],[157,1,157,3],[146,1,146,6],[147,1,147,6],[149,1,149,3],[149,4,149,7],[132,1,132,3],[132,4,132,7],[71,2,71,3],[72,1,72,7],[77,1,77,3],[0,1,0,3],[0,4,0,7],[132,10,132,11],[96,10,96,11],[69,10,69,11],[137,8,137,9],[94,1,94,6],[69,0,80,0],[82,0,94,0],[82,1,82,3],[82,4,82,7],[83,2,83,5],[84,2,84,3],[85,1,85,7],[91,1,91,3],[91,5,91,6],[92,1,92,6],[93,1,93,6],[70,2,70,5],[80,1,80,6],[174,10,174,11],[175,2,175,5],[176,2,176,3],[177,1,177,7],[187,1,187,3],[187,5,187,6],[188,1,188,6],[189,1,189,6],[138,8,138,9],[141,8,141,9],[141,10,141,14],[170,1,170,6],[171,1,171,6],[172,1,172,6]]}
[1,"CODEVASF",null,null," COMPOSIÇÃO DE PREÇO UNITÁRIO",null,null,null,{"$f":"H10","v":2163.84},{"$f":"H12","v":2564.3667840000003},"BDI CALCULADO:",null,{"$f":"ORÇAMENTO!I6","v":0.18510000000000001}]
[null,"OBRA:  ",{"$f":"ORÇAMENTO!C5","v":"PAVIMENTAÇÃO EM POLIÉDRICO - COMUNIDADE DOS PEROBAS - PERDIGÃO / MG"},null,null,null,"DATA: ",{"$f":"ORÇAMENTO!C6","v":"OUTUBRO/2022"}]
[null,"SERVIÇO:  ",{"$f":"VLOOKUP(A1,ORÇAMENTO!A10:I26,3)","v":"MOBILIZAÇÃO E DESMOBILIZAÇÃO"},null,"Referência:",{"$f":"VLOOKUP(A1,ORÇAMENTO!A10:I26,4)","v":"CPU"},"UNIDADE: ",{"$f":"VLOOKUP(A1,ORÇAMENTO!A10:I26,5)","v":"GL"}]
[]
[null,"TIPO ITEM","CODIGO ITEM","DESCRIÇÃO ITEM","UNIDADE ITEM","COEFICIENTE","PRECO UNITARIO","CUSTO TOTAL"]
[null,"COMPOSICAO","5824","CAMINHÃO TOCO, PBT 16.000 KG, CARGA ÚTIL MÁX. 10.685 KG, DIST. ENTRE EIXOS 4,8 M, POTÊNCIA 189 CV, INCLUSIVE CARROCERIA FIXA ABERTA DE MADEIRA P/ TRANSPORTE GERAL DE CARGA SECA ","CHP",8,215.9,{"$f":"ROUNDDOWN(F6*G6,2)","v":1727.2}]
[null,"COMPOSICAO","5826","CAMINHÃO TOCO, PBT 16.000 KG, CARGA ÚTIL MÁX. 10.685 KG, DIST. ENTRE EIXOS 4,8 M, POTÊNCIA 189 CV, INCLUSIVE CARROCERIA FIXA ABERTA DE MADEIRA P/ TRANSPORTE GERAL DE CARGA SECA ","CHI",8,45.57,{"$f":"ROUNDDOWN(F7*G7,2)","v":364.56}]
[null,"COMPOSIÇÃO",88316,"SERVENTE COM ENCARGOS COMPLEMENTARES","H",4,18.02,72.08]
[null,"PRODUÇÃO DA EQUIPE",null,null,1,"CUSTO ",null,{"$f":"SUM(H6:H8)","v":2163.84}]
[null,"TOTAL",{"$nulls":5},{"$f":"H9/E9","v":2163.84}]
[null,"BDI                %",{"$nulls":5},{"$f":"1+$M$1","v":1.1851}]
[null,"TOTAL DO SERVIÇO - R$",{"$nulls":5},{"$f":"H10*H11","v":2564.3667840000003}]
[]
[{"$f":"A1+1","v":2},"CODEVASF",null,null," COMPOSIÇÃO DE PREÇO UNITÁRIO",null,null,null,{"$f":"H27","v":16356.763567635675},{"$f":"H29","v":19384.410504005038}]
[null,"OBRA:  ",{"$f":"$C$2","v":"PAVIMENTAÇÃO EM POLIÉDRICO - COMUNIDADE DOS PEROBAS - PERDIGÃO / MG"},null,null,null,"DATA: ",{"$f":"$H$2","v":"OUTUBRO/2022"}]
[null,"SERVIÇO:  ",{"$f":"VLOOKUP(A14,ORÇAMENTO!$A$10:$I$26,3)","v":"ADMINISTRAÇÃO LOCAL"},null,"SINAPI","CPU","UNIDADE: ",{"$f":"VLOOKUP(A14,ORÇAMENTO!$A$10:$I$26,5)","v":"GL"}]
[]
[null,"TIPO ITEM","CODIGO ITEM","DESCRIÇÃO ITEM","UNIDADE ITEM","COEFICIENTE","PRECO UNITARIO","CUSTO TOTAL"]
[null,"INSUMO",14250,"ENERGIA ELÉTRICA","kwh",72,0.74875000000000003,{"$f":"ROUNDDOWN(F19*G19,2)","v":53.91}]
[null,"INSUMO",14583,"ÁGUA/ESGOTO ","m³",4,21.999500000000001,{"$f":"ROUNDDOWN(F20*G20,2)","v":87.99}]
[null,"COTAÇÃO","MERC.","TELEFONE (PLANO CONTROLE)","UNID",1,60,60]
[null,"COMPOSICAO",90777,"Engenheiro Civil Júnior com encargos complementares","H",22,100.51,2211.2199999999998]
[null,"COMPOSICAO",90776,"Encarregado Geral com encargos complementares","H",55,39.799999999999997,2189]
[null,"COMPOSICAO",88321,"Tecnico de Laboratório com encargos complementares","H",22,38.64,850.08]
[]
[null,"PRODUÇÃO DA EQUIPE",null,null,0.33333000000000002,"CUSTO ",null,{"$f":"SUM(H19:H25)","v":5452.2}]
[null,"TOTAL",{"$nulls":5},{"$f":"H26/E26","v":16356.763567635675}]
[null,"BDI                %",{"$nulls":5},{"$f":"1+$M$1","v":1.1851}]
[null,"TOTAL DO SERVIÇO - R$",{"$nulls":5},{"$f":"H27*H28+0.01","v":19384.410504005038}]
[]
[{"$f":"A14+1","v":3},"CODEVASF",null,null," COMPOSIÇÃO DE PREÇO UNITÁRIO",null,null,null,{"$f":"H38","v":2758.5},{"$f":"H40","v":3269.0983500000002}]
[null,"OBRA:  ",{"$f":"$C$2","v":"PAVIMENTAÇÃO EM POLIÉDRICO - COMUNIDADE DOS PEROBAS - PERDIGÃO / MG"},null,null,null,"DATA: ",{"$f":"$H$2","v":"OUTUBRO/2022"}]
[null,"SERVIÇO:  ",{"$f":"VLOOKUP(A31,ORÇAMENTO!$A$10:$I$26,3)","v":"CANTEIRO DE OBRAS"},null,"SINAPI",{"$f":"VLOOKUP(A31,ORÇAMENTO!$A$10:$I$26,4)","v":"CPU"},"UNIDADE: ",{"$f":"VLOOKUP(A31,ORÇAMENTO!$A$10:$I$26,5)","v":"GL"}]
[]
[null,"TIPO ITEM","CODIGO ITEM","DESCRIÇÃO ITEM","UNIDADE ITEM","COEFICIENTE","PRECO UNITARIO","CUSTO TOTAL"]
[null,"COTAÇÃO",10775,"ALUGUEL DE IMÓVEL OU CONTEINER QUE ATENDA AOS REQUISITOS MÍNIMOS PARA INSTALAÇÃO DO CANTEIRO DE OBRAS ","MÊS",3,919.5,{"$f":"ROUNDDOWN(F36*G36,2)","v":2758.5}]
[null,"PRODUÇÃO DA EQUIPE",null,null,1,"CUSTO ",null,{"$f":"SUM(H36:H36)","v":2758.5}]
[null,"TOTAL",{"$nulls":5},{"$f":"H37/E37","v":2758.5}]
[null,"BDI                %",{"$nulls":5},{"$f":"1+$M$1","v":1.1851}]
[null,"TOTAL DO SERVIÇO - R$",{"$nulls":5},{"$f":"H38*H39","v":3269.0983500000002}]
[]
[{"$f":"A31+1","v":4},"CODEVASF",null,null," COMPOSIÇÃO DE PREÇO UNITÁRIO",null,null,null,{"$f":"H55","v":594},{"$f":"H57","v":703.94939999999997}]
[null,"OBRA:  ",{"$f":"$C$2","v":"PAVIMENTAÇÃO EM POLIÉDRICO - COMUNIDADE DOS PEROBAS - PERDIGÃO / MG"},null,null,null,"DATA: ",{"$f":"$H$2","v":"OUTUBRO/2022"}]
[null,"SERVIÇO:  ",{"$f":"VLOOKUP(A42,ORÇAMENTO!$A$10:$I$26,3)","v":"PLACA DE OBRA EM CHAPA DE AÇO GALVANIZADO"},null,"SINAPI",{"$f":"VLOOKUP(A42,ORÇAMENTO!$A$10:$I$26,4)","v":"74209/001"},"UNIDADE: ",{"$f":"VLOOKUP(A42,ORÇAMENTO!$A$10:$I$26,5)","v":"M2"}]
[]
[null,"TIPO ITEM","CODIGO ITEM","DESCRIÇÃO ITEM","UNIDADE ITEM","COEFICIENTE","PRECO UNITARIO","CUSTO TOTAL"]
[null,"INSUMO","4417","SARRAFO DE MADEIRA NAO APARELHADA *2,5 X 7* CM, MACARANDUBA, ANGELIM OU EQUIVALENTE DA REGIAO","M","1,0000000",12.458,{"$f":"ROUNDDOWN(F47*G47,2)","v":12.45}]
[null,"INSUMO","4491","PONTALETE DE MADEIRA NAO APARELHADA *7,5 X 7,5* CM (3 X 3 \") PINUS, MISTA OU EQUIVALENTE DA REGIAO","M","4,0000000",8.57,{"$f":"ROUNDDOWN(F48*G48,2)","v":34.28}]
[null,"INSUMO","4813","PLACA DE OBRA (PARA CONSTRUCAO CIVIL) EM CHAPA GALVANIZADA *N. 22*, ADESIVADA, DE *2,4 X 1,2* M","M2","1,0000000",480,480]
[null,"INSUMO","5075","PREGO DE ACO POLIDO COM CABECA 18 X 30 (2 3/4 X 10)","KG","0,1100000",23.4,2.57]
[null,"COMPOSICAO","88262","CARPINTEIRO DE FORMAS COM ENCARGOS COMPLEMENTARES","H","1,0000000",24.86,24.86]
[null,"COMPOSICAO","88316","SERVENTE COM ENCARGOS COMPLEMENTARES","H","2,0000000",18.02,36.04]
[null,"COMPOSICAO","94962","CONCRETO MAGRO PARA LASTRO, TRAÇO 1:4,5:4,5 (CIMENTO/ AREIA MÉDIA/ BRITA 1)  - PREPARO MECÂNICO COM BETONEIRA 400 L","M3","0,0100000",380.33,3.8]
[null,"PRODUÇÃO DA EQUIPE",null,null,1,"CUSTO ",null,{"$f":"SUM(H47:H53)","v":594}]
[null,"TOTAL",{"$nulls":5},{"$f":"H54/E54","v":594}]
[null,"BDI                %",{"$nulls":5},{"$f":"1+$M$1","v":1.1851}]
[null,"TOTAL DO SERVIÇO - R$",{"$nulls":5},{"$f":"H55*H56","v":703.94939999999997}]
[]
[{"$f":"A42+1","v":5},"CODEVASF",null,null," COMPOSIÇÃO DE PREÇO UNITÁRIO",null,null,null,{"$f":"H66","v":0.64},{"$f":"H68","v":0.75846400000000003}]
[null,"OBRA:  ",{"$f":"$C$2","v":"PAVIMENTAÇÃO EM POLIÉDRICO - COMUNIDADE DOS PEROBAS - PERDIGÃO / MG"},null,null,null,"DATA: ",{"$f":"$H$2","v":"OUTUBRO/2022"}]
[null,"SERVIÇO:  ",{"$f":"VLOOKUP(A59,ORÇAMENTO!$A$10:$I$26,3)","v":"LOCAÇÃO DE PAVIMENTAÇÃO"},null,"SINAPI",{"$f":"VLOOKUP(A59,ORÇAMENTO!$A$10:$I$26,4)","v":99064},"UNIDADE: ",{"$f":"VLOOKUP(A59,ORÇAMENTO!$A$10:$I$26,5)","v":"M"}]
[]
[null,"TIPO ITEM","CODIGO ITEM","DESCRIÇÃO ITEM","UNIDADE ITEM","COEFICIENTE","PRECO UNITARIO","CUSTO TOTAL"]
[null,"COMPOSICAO","99058","LOCAÇÃO DE PONTO PARA REFERÊNCIA TOPOGRÁFICA","UN","0,0500000",12.96,{"$f":"ROUNDDOWN(F64*G64,2)","v":0.64}]
[null,"PRODUÇÃO DA EQUIPE",null,null,1,"CUSTO ",null,{"$f":"SUM(H64:H64)","v":0.64}]
[null,"TOTAL",{"$nulls":5},{"$f":"H65/E65","v":0.64}]
[null,"BDI                %",{"$nulls":5},{"$f":"1+$M$1","v":1.1851}]
[null,"TOTAL DO SERVIÇO - R$",{"$nulls":5},{"$f":"H66*H67","v":0.75846400000000003}]
[]
[{"$f":"A59+1","v":6},"CODEVASF",null,null," COMPOSIÇÃO DE PREÇO UNITÁRIO",null,null,null,{"$f":"H79","v":2.14},{"$f":"H81","v":2.5361140000000004}]
[null,"OBRA:  ",{"$f":"$C$2","v":"PAVIMENTAÇÃO EM POLIÉDRICO - COMUNIDADE DOS PEROBAS - PERDIGÃO / MG"},null,null,null,"DATA: ",{"$f":"$H$2","v":"OUTUBRO/2022"}]
[null,"SERVIÇO:  ",{"$f":"VLOOKUP(A70,ORÇAMENTO!$A$10:$I$26,3)","v":"ESCAVAÇÃO HORIZONTAL EM SOLO DE 1A CATEGORIA "},null,"SINAPI",{"$f":"VLOOKUP(A70,ORÇAMENTO!$A$10:$I$26,4)","v":101116},"UNIDADE: ",{"$f":"VLOOKUP(A70,ORÇAMENTO!$A$10:$I$26,5)","v":"M3"}]
[]
[null,"TIPO ITEM","CODIGO ITEM","DESCRIÇÃO ITEM","UNIDADE ITEM","COEFICIENTE","PRECO UNITARIO","CUSTO TOTAL"]
[null,"COMPOSICAO","5847","TRATOR DE ESTEIRAS, POTÊNCIA 170 HP, PESO OPERACIONAL 19 T, CAÇAMBA 5,2 M3 - CHP DIURNO","CHP","0,0048000","274,81",{"$f":"ROUNDDOWN(F75*G75,2)","v":1.31}]
[null,"COMPOSICAO","5849","TRATOR DE ESTEIRAS, POTÊNCIA 170 HP, PESO OPERACIONAL 19 T, CAÇAMBA 5,2 M3 - CHI DIURNO","CHI","0,0082000","74,36",0.6]
[null,"COMPOSICAO","88316","SERVENTE COM ENCARGOS COMPLEMENTARES","H","0,0131000","18,02",0.23]
[null,"PRODUÇÃO DA EQUIPE",null,null,1,"CUSTO ",null,{"$f":"SUM(H75:H77)","v":2.14}]
[null,"TOTAL",{"$nulls":5},{"$f":"H78/E78","v":2.14}]
[null,"BDI                %",{"$nulls":5},{"$f":"1+$M$1","v":1.1851}]
[null,"TOTAL DO SERVIÇO - R$",{"$nulls":5},{"$f":"H79*H80","v":2.5361140000000004}]
[]
[7,"CODEVASF",null,null," COMPOSIÇÃO DE PREÇO UNITÁRIO",null,null,null,{"$f":"H93","v":3.83},{"$f":"H95","v":4.5389330000000001}]
[null,"OBRA:  ",{"$f":"$C$2","v":"PAVIMENTAÇÃO EM POLIÉDRICO - COMUNIDADE DOS PEROBAS - PERDIGÃO / MG"},null,null,null,"DATA: ",{"$f":"$H$2","v":"OUTUBRO/2022"}]
[null,"SERVIÇO:  ",{"$f":"VLOOKUP(A83,ORÇAMENTO!$A$10:$I$26,3)","v":"CARGA, MANOBRA E DESCARGA DE SOLOS E MATERIAIS GRANULARES EM CAMINHÃO BASCULANTE - DESCARGA LIVRE"},null,"SINAPI",{"$f":"VLOOKUP(A83,ORÇAMENTO!$A$10:$I$26,4)","v":100976},"UNIDADE: ",{"$f":"VLOOKUP(A83,ORÇAMENTO!$A$10:$I$26,5)","v":"M3"}]
[]
[null,"TIPO ITEM","CODIGO ITEM","DESCRIÇÃO ITEM","UNIDADE ITEM","COEFICIENTE","PRECO UNITARIO","CUSTO TOTAL"]
[null,"COMPOSICAO","5940","PÁ CARREGADEIRA SOBRE RODAS, POTÊNCIA LÍQUIDA 128 HP, CAPACIDADE DA CAÇAMBA 1,7 A 2,8 M3, PESO OPERACIONAL 11632 KG - CHP DIURNO","CHP",4.3E-3,"211,10",{"$f":"ROUNDDOWN(F88*G88,2)","v":0.9}]
[null,"COMPOSICAO","5942","PÁ CARREGADEIRA SOBRE RODAS, POTÊNCIA LÍQUIDA 128 HP, CAPACIDADE DA CAÇAMBA 1,7 A 2,8 M3, PESO OPERACIONAL 11632 KG - CHI DIURNO","CHI",3.3999999999999998E-3,"77,00",0.26]
[null,"COMPOSICAO","89883","CAMINHÃO BASCULANTE 18 M3, COM CAVALO MECÂNICO DE CAPACIDADE MÁXIMA DE TRAÇÃO COMBINADO DE 45000 KG, POTÊNCIA 330 CV, INCLUSIVE SEMIREBOQUE COM CAÇAMBA METÁLICA - CHP DIURNO","CHP",5.3E-3,"378,01",2]
[null,"COMPOSICAO","89884","CAMINHÃO BASCULANTE 18 M3, COM CAVALO MECÂNICO DE CAPACIDADE MÁXIMA DE TRAÇÃO COMBINADO DE 45000 KG, POTÊNCIA 330 CV, INCLUSIVE SEMIREBOQUE COM CAÇAMBA METÁLICA - CHI DIURNO","CHI","0,0095000","70,93",0.67]
[null,"PRODUÇÃO DA EQUIPE",null,null,1,"CUSTO ",null,{"$f":"SUM(H88:H91)","v":3.83}]
[null,"TOTAL",{"$nulls":5},{"$f":"H92/E92","v":3.83}]
[null,"BDI                %",{"$nulls":5},{"$f":"1+$M$1","v":1.1851}]
[null,"TOTAL DO SERVIÇO - R$",{"$nulls":5},{"$f":"H93*H94","v":4.5389330000000001}]
[]
[8,"CODEVASF",null,null," COMPOSIÇÃO DE PREÇO UNITÁRIO",null,null,null,{"$f":"H110","v":2.2200000000000002},{"$f":"H112","v":2.6309220000000004}]
[null,"OBRA:  ",{"$f":"$C$2","v":"PAVIMENTAÇÃO EM POLIÉDRICO - COMUNIDADE DOS PEROBAS - PERDIGÃO / MG"},null,null,null,"DATA: ",{"$f":"$H$2","v":"OUTUBRO/2022"}]
[null,"SERVIÇO:  ",{"$f":"VLOOKUP(A97,ORÇAMENTO!$A$10:$I$26,3)","v":"REGULARIZAÇÃO E COMPACTAÇÃO DE SUBLEITO"},null,"SINAPI",{"$f":"VLOOKUP(A97,ORÇAMENTO!$A$10:$I$26,4)","v":100576},"UNIDADE: ",{"$f":"VLOOKUP(A97,ORÇAMENTO!$A$10:$I$26,5)","v":"M2"}]
[]
[null,"TIPO ITEM","CODIGO ITEM","DESCRIÇÃO ITEM","UNIDADE ITEM","COEFICIENTE","PRECO UNITARIO","CUSTO TOTAL"]
[null,"COMPOSICAO","5901","CAMINHÃO PIPA 10.000 L TRUCADO, PESO BRUTO TOTAL 23.000 KG, CARGA ÚTIL MÁXIMA 15.935 KG, DISTÂNCIA ENTRE EIXOS 4,8 M, POTÊNCIA 230 CV, INCLUSIVE TANQUE DE AÇO PARA TRANSPORTE DE ÁGUA - CHP DIURNO","CHP","0,0010000","326,66",{"$f":"ROUNDDOWN(F102*G102,2)","v":0.32}]
[null,"COMPOSICAO","5903","CAMINHÃO PIPA 10.000 L TRUCADO, PESO BRUTO TOTAL 23.000 KG, CARGA ÚTIL MÁXIMA 15.935 KG, DISTÂNCIA ENTRE EIXOS 4,8 M, POTÊNCIA 230 CV, INCLUSIVE TANQUE DE AÇO PARA TRANSPORTE DE ÁGUA - CHI DIURNO","CHI","0,0070000","54,39",0.38]
[null,"COMPOSICAO","5932","MOTONIVELADORA POTÊNCIA BÁSICA LÍQUIDA (PRIMEIRA MARCHA) 125 HP, PESO BRUTO 13032 KG, LARGURA DA LÂMINA DE 3,7 M - CHP DIURNO","CHP","0,0001000","256,86",0.02]
[null,"COMPOSICAO","5934","MOTONIVELADORA POTÊNCIA BÁSICA LÍQUIDA (PRIMEIRA MARCHA) 125 HP, PESO BRUTO 13032 KG, LARGURA DA LÂMINA DE 3,7 M - CHI DIURNO","CHI","0,0080000","83,44",0.66]
[null,"COMPOSICAO","73436","ROLO COMPACTADOR VIBRATÓRIO PÉ DE CARNEIRO PARA SOLOS, POTÊNCIA 80 HP, PESO OPERACIONAL SEM/COM LASTRO 7,4 / 8,8 T, LARGURA DE TRABALHO 1,68 M - CHP DIURNO","CHP","0,0020000","196,72",0.39]
[null,"COMPOSICAO","88316","SERVENTE COM ENCARGOS COMPLEMENTARES","H","0,0080000","18,02",0.14000000000000001]
[null,"COMPOSICAO","93244","ROLO COMPACTADOR VIBRATÓRIO PÉ DE CARNEIRO PARA SOLOS, POTÊNCIA 80 HP, PESO OPERACIONAL SEM/COM LASTRO 7,4 / 8,8 T, LARGURA DE TRABALHO 1,68 M - CHI DIURNO","CHI","0,0060000","52,17",0.31]
[null,"PRODUÇÃO DA EQUIPE",null,null,1,"CUSTO ",null,{"$f":"SUM(H102:H108)","v":2.2200000000000002}]
[null,"TOTAL",{"$nulls":5},{"$f":"H109/E109","v":2.2200000000000002}]
[null,"BDI                %",{"$nulls":5},{"$f":"1+$M$1","v":1.1851}]
[null,"TOTAL DO SERVIÇO - R$",{"$nulls":5},{"$f":"H110*H111","v":2.6309220000000004}]
[]
[9,"CODEVASF",null,null," COMPOSIÇÃO DE PREÇO UNITÁRIO",null,null,null,{"$f":"H129","v":10.57},{"$f":"H131","v":12.526507000000001}]
[null,"OBRA:  ",{"$f":"$C$2","v":"PAVIMENTAÇÃO EM POLIÉDRICO - COMUNIDADE DOS PEROBAS - PERDIGÃO / MG"},null,null,null,"DATA: ",{"$f":"$H$2","v":"OUTUBRO/2022"}]
[null,"SERVIÇO:  ",{"$f":"VLOOKUP(A114,ORÇAMENTO!$A$10:$I$26,3)","v":"EXECUÇÃO E COMPACTAÇÃO DE BASE E OU SUB BASE PARA PAVIMENTAÇÃO DE CASCALHO - EXCLUSIVE SOLO, ESCAVAÇÃO, CARGA E TRANSPORTE. "},null,"SINAPI",{"$f":"VLOOKUP(A114,ORÇAMENTO!$A$10:$I$26,4)","v":96388},"UNIDADE: ",{"$f":"VLOOKUP(A114,ORÇAMENTO!$A$10:$I$26,5)","v":"M3"}]
[]
[null,"TIPO ITEM","CODIGO ITEM","DESCRIÇÃO ITEM","UNIDADE ITEM","COEFICIENTE","PRECO UNITARIO","CUSTO TOTAL"]
[null,"COMPOSICAO","5684","ROLO COMPACTADOR VIBRATÓRIO DE UM CILINDRO AÇO LISO, POTÊNCIA 80 HP, PESO OPERACIONAL MÁXIMO 8,1 T, IMPACTO DINÂMICO 16,15 / 9,5 T, LARGURA DE TRABALHO 1,68 M - CHP DIURNO","CHP","0,0030000","152,82",{"$f":"ROUNDDOWN(F119*G119,2)","v":0.45}]
[null,"COMPOSICAO","5685","ROLO COMPACTADOR VIBRATÓRIO DE UM CILINDRO AÇO LISO, POTÊNCIA 80 HP, PESO OPERACIONAL MÁXIMO 8,1 T, IMPACTO DINÂMICO 16,15 / 9,5 T, LARGURA DE TRABALHO 1,68 M - CHI DIURNO","CHI","0,0230000","50,98",1.17]
{"$rows_left_out":72}
{"sheet":"BDI SERV","index":2,"n_rows":37,"n_cols":5,"rows_kept":37,"cut":false,"hidden":false,"merged":[[7,7,18,12],[36,0,36,5],[3,1,4,1],[3,2,4,2],[0,1,2,4],[32,0,34,5],[28,0,28,5],[30,1,30,2],[31,1,31,2]]}
[null,"DETALHAMENTO DO BDI - SERVIÇOS"]
[]
[]
[null,"Item","Descrição dos Serviços","%","%"]
[null,null,null,"PV","CD"]
[]
[null,1,"ADMINISTRAÇÃO CENTRAL"," ",3.8]
[null,"1.1","ESCRITÓRIO CENTRAL"," "," "]
[null,"1.2","VIAGENS"," "," "]
[null,"1.3","OUTROS"," "," "]
[null," "," "," "," "]
[null,2,"IMPOSTOS E TAXAS",{"$f":"SUM(D13:D16)","v":4.6500000000000004},{"$f":"SUM(E13:E16)","v":5.8100000000000005}]
[null,"2.1","ISS (*)",{"$f":"2*0.5","v":1},{"$f":"ROUND(D13*1.2515,2)","v":1.25}]
[null,"2.2","PIS",0.65,0.81]
[null,"2.3","Cofins",3,3.75]
[null,"2.4","CONTRIBUIÇÃO PREVIDENCIÁRIA SOBRE A RENDA BRUTA",0,0]
[]
[null,3,"TAXA DE RISCO"," ",{"$f":"SUM(E19:E22)","v":0.82000000000000006}]
[null,"3.1","SEGURO",null,0.16]
[null,"3.2","RISCO",null,0.5]
[null,"3.3","GARANTIA",null,0.16]
[]
[null,4,"DESPESAS FINANCEIRAS"," ",0.94]
[]
[null,5,"LUCRO",null,7]
[]
[null," ","BDI - CALCULADO"," ",{"$f":"ROUND((((1+(E7+E18)/100)*(1+E23/100)*(1+E25/100)/(1-D12/100)-1)*100),2)","v":18.510000000000002}]
[]
["BDI = ((1+((AC+S+R+G)/100))x(1+DF/100)x(1+L/100)/(1-I/100)-1)*100"]
[]
[null,"BDI (CALCULADO):",null,{"$f":"ROUND((((1+((E7+E18)/100))*(1+E23/100)*(1+E25/100))/(1-D12/100)-1)*100,2)","v":18.510000000000002},"%"]
[null," "]
["(*) ISS CONFORME DECLARAÇÃO DO MUNICÍPIO (EM ANEXO) - \nALÍQUOTA DE 2% SOBRE 50% DO VALOR DA NOTA"]
[]
[]
[" "]
["BDI EM CONFORMIDADE COM OS ACÓRDÃOS Nº 2369/2011 e ACÓRDÃO Nº 2.622/2013 - TCU - PLENÁRIO"]

{"sheet":"CRONOGRAMA","index":3,"n_rows":17,"n_cols":9,"rows_kept":17,"cut":false,"hidden":false,"merged":[[7,0,8,0],[9,0,10,0],[11,0,12,0],[0,1,0,8],[1,6,1,8],[2,6,2,8],[3,1,3,6],[5,0,6,0],[5,2,6,2],[1,1,2,1],[5,1,6,1],[1,2,2,4],[13,1,14,2],[16,1,20,8],[7,2,8,2],[9,2,10,2],[11,2,12,2],[7,1,8,1],[9,1,10,1],[11,1,12,1]]}
[null,"CRONOGRAMA FÍSICO-FINANCEIRO"]
[null,"OBRA: ",{"$f":"ORÇAMENTO!C5","v":"PAVIMENTAÇÃO EM POLIÉDRICO - COMUNIDADE DOS PEROBAS - PERDIGÃO / MG"},null,null,"VALOR:",{"$f":"ORÇAMENTO!I27","v":579044.34000000008}]
[{"$nulls":5},"PRAZO: ","90 DIAS "]
[]
[null,"ITEM","ETAPAS/DESCRIÇAO","FISICO/  FINANCEIRO","TOTAL    ETAPAS","MÊS 1","MÊS 2","MÊS 3","TOTAL"]
["A",{"$f":"VLOOKUP(A6,ORÇAMENTO!$A$9:$I$27,2)","v":1},{"$f":"VLOOKUP(A6,ORÇAMENTO!$A$9:$I$27,3)","v":"SERVIÇOS PRELIMINARES "},"FISICO ",{"$f":"ROUND(E7/$G$2,4)","v":4.7300000000000002E-2},0.4,0.3,0.3,{"$f":"SUM(F6:H6)","v":1}]
[null,null,null,"FINANCEIRO",{"$f":"ORÇAMENTO!I9","v":27378.93},{"$f":"ROUND($E$7*F6,2)","v":10951.57},8213.68,8213.68,{"$f":"SUM(F7:H7)","v":27378.93}]
["B",{"$f":"VLOOKUP(A8,ORÇAMENTO!$A$9:$I$27,2)","v":2},{"$f":"VLOOKUP(A8,ORÇAMENTO!$A$9:$I$27,3)","v":"PAVIMENTAÇÃO"},"FISICO ",{"$f":"ROUND(E9/$G$2,4)","v":0.65900000000000003},0.3,0.4,0.3,{"$f":"SUM(F8:H8)","v":1}]
[null,null,null,"FINANCEIRO",{"$f":"ORÇAMENTO!I15","v":381612.62},{"$f":"ROUND($E$9*F8,2)","v":114483.79},152645.04999999999,114483.79,381612.62999999995]
["C",{"$f":"VLOOKUP(A10,ORÇAMENTO!$A$9:$I$27,2)","v":3},{"$f":"VLOOKUP(A10,ORÇAMENTO!$A$9:$I$27,3)","v":"TRANSPORTE DE MATERIAIS"},"FISICO ",{"$f":"ROUND(E11/$G$2,4)","v":9.8699999999999996E-2},0.5,0.5,null,1]
[null,null,null,"FINANCEIRO",{"$f":"ORÇAMENTO!I22","v":57173.72},{"$f":"ROUND($E$11*F10,2)","v":28586.86},{"$f":"ROUND($E$11*G10,2)","v":28586.86},0,57173.72]
["D",{"$f":"VLOOKUP(A12,ORÇAMENTO!$A$9:$I$27,2)","v":4},{"$f":"VLOOKUP(A12,ORÇAMENTO!$A$9:$I$27,3)","v":"DRENAGEM E OBRAS COMPLEMENTARES"},"FISICO ",{"$f":"ROUND(E13/$G$2,4)","v":0.19489999999999999},0,0.5,0.5,1]
[null,null,null,"FINANCEIRO",{"$f":"ORÇAMENTO!I25","v":112879.07},{"$f":"ROUND($E$13*F12,2)","v":0},{"$f":"ROUND($E$13*G12,2)","v":56439.54},{"$f":"ROUND($E$13*H12,2)","v":56439.54},112879.08]
[null,"TOTAL",null,"FISICO ",{"$f":"SUM(F14:H14)","v":1.0000000345396693},{"$f":"F15/E15","v":0.26599382700122759},{"$f":"G15/E15","v":0.42463955350984001},{"$f":"H15/E15","v":0.3093666540286017},{"$f":"SUM(F14:H14)","v":1.0000000345396693}]
[null,null,null,"FINANCEIRO",{"$f":"E11+E9+E7+E13","v":579044.34},{"$f":"F11+F9+F7+F13","v":154022.22},{"$f":"G11+G9+G7+G13","v":245885.12999999998},{"$f":"H11+H9+H7+H13","v":179137.01},{"$f":"SUM(F15:H15)","v":579044.36}]
[]
[null,"OBSERVAÇÕES:"]