{"text_format":"2","workbook":"xlsx","n_sheets":4,"sheets":["ORÇAMENTO","CPU","BDI SERV","CRONOGRAMA"],"not_rendered":{"charts":0,"images":2,"macros":0,"external_links":0,"defined_names":4,"comments":0,"pivot_tables":0},"unopened":[],"bounds":{"document_bytes":16777216,"sheet_cells":100000,"run_cost":"one","rows_first":2000,"rows_last":500,"rows_between":2000,"halvings":0,"cell_chars":16384,"cell_head_chars":4096},"cells_cut":0,"cells_raw":0,"read":"whole","date_system":"1900"}

{"sheet":"ORÇAMENTO","index":0,"n_rows":55,"n_cols":12,"rows_kept":55,"cut":false,"hidden":false,"merged":[[31,9,35,9],[7,6,7,7],[54,1,54,2],[0,0,8,0],[0,2,0,8],[1,2,1,8],[2,2,2,8],[4,2,4,8],[6,6,6,7],[7,1,7,2],[5,2,5,8]]}
["<---- NUMERAR SERVIÇOS PARA CPU",null,"Ministério da Integração Nacional"]
[null,null,"Companhia de Desenvolvimento dos Vales do São Francisco e do Parnaíba"]
[null,null,"1ª Superintendência Regional"]
[]
[null,"OBRA: ","CONSTRUÇÃO DE PONTE SOBRE O RIO BARREIRO - SÃO JOÃO DO PACUÍ (COMUNIDADE BARREIRO)"]
[null,"LOCAL:","SÃO JOÃO DO PACUÍ - MG"]
[null,"DATA:","OUTUBRO/2022",null,null,null,"BDI Serviços:",null,{"$f":"'BDI SERV'!D31/100","v":0.2069}]
[null,"PRAZO DE EXECUÇÃO:  120 DIAS"]
[null,"ITEM","DISCRIMINAÇÃO","REFER.","UNID.","QUANT.","P. UNITÁRIO","P.UNIT.C/ BDI","P. TOTAL",{"$f":"I55","v":413134.13000000006}]
["A",1,"SERVIÇOS PRELIMINARES ",{"$nulls":5},{"$f":"SUM(I11:I16)","v":52126.68},{"$f":"I10/I55","v":0.12617374410581858}]
[0,"1.1","MOBILIZAÇÃO E DESMOBILIZAÇÃO","CPU.1","GL",1,{"$f":"VLOOKUP(A11,CPU!$A$1:$N$3254,9)","v":6819.64},{"$f":"VLOOKUP(A11,CPU!$A$1:$N$3254,10)","v":8230.6235160000015},{"$f":"ROUND(F11*H11,2)","v":8230.6200000000008}]
[1,"1.2","ADMINISTRAÇÃO LOCAL E MANUTENÇÃO DO CANTEIRO DE OBRAS","CPU.2","GL",1,{"$f":"VLOOKUP(A12,CPU!$A$1:$N$3254,9)","v":27201.199999999997},{"$f":"VLOOKUP(A12,CPU!$A$1:$N$3254,10)","v":32829.128279999997},{"$f":"ROUND(F12*H12,2)","v":32829.129999999997},{"$f":"I12/I55","v":7.9463611491018646E-2}]
[2,"1.3","LIMPEZA MECANIZADA DE CAMADA VEGETAL, VEGETAÇÃO E PEQUENAS ÁRVORES (DIÂMETRO DE TRONCO MENOR QUE 0,20 M)",98525,"M2",300,{"$f":"VLOOKUP(A13,CPU!$A$1:$N$3254,9)","v":0.39},{"$f":"VLOOKUP(A13,CPU!$A$1:$N$3254,10)","v":0.47069100000000003},{"$f":"ROUND(F13*H13,2)","v":141.21}]
[3,"1.4","INSTALAÇÕES E CANTEIRO DE OBRAS","CPU.3","GL",1,{"$f":"VLOOKUP(A14,CPU!$A$1:$N$3254,9)","v":4708.5599999999995},{"$f":"VLOOKUP(A14,CPU!$A$1:$N$3254,10)","v":5682.7610639999994},{"$f":"ROUND(F14*H14,2)","v":5682.76},"OK"]
[4,"1.5","PLACA DE OBRA EM CHAPA DE AÇO GALVANIZADO","74209/001","M2",4,{"$f":"VLOOKUP(A15,CPU!$A$1:$N$3254,9)","v":592.84},{"$f":"VLOOKUP(A15,CPU!$A$1:$N$3254,10)","v":715.49859600000013},{"$f":"ROUND(F15*H15,2)","v":2861.99},"OK"]
[5,"1.6","LOCACAO CONVENCIONAL DE OBRA, UTILIZANDO GABARITO DE TÁBUAS CORRIDAS PONTALETADAS A CADA 2,00M",99059,"M",30,{"$f":"VLOOKUP(A16,CPU!$A$1:$N$3254,9)","v":65.759999999999991},{"$f":"VLOOKUP(A16,CPU!$A$1:$N$3254,10)","v":79.365743999999992},{"$f":"ROUND(F16*H16,2)","v":2380.9699999999998},"OK"]
["B",2,"INFRAESTRUTURA E MESOESTRUTURA",{"$nulls":5},{"$f":"SUM(I18:I30)","v":222770.66},{"$f":"I17/I55","v":0.53922114834714807}]
[6,"2.1","ESCAVAÇÃO MECANIZADA DE VALA EM MATERIAL DE 1A CATEGORIA",102299,"M3",96,{"$f":"VLOOKUP(A18,CPU!$A$1:$N$3254,9)","v":14.969999999999999},{"$f":"VLOOKUP(A18,CPU!$A$1:$N$3254,10)","v":18.067292999999999},{"$f":"ROUND(F18*H18,2)","v":1734.46},"OK"]
[7,"2.2","ESCAVAÇÃO MECANIZADA DE VALA EM MATERIAL DE 2A CATEGORIA ",102306,"M3",40.000000000000007,{"$f":"VLOOKUP(A19,CPU!$A$1:$N$3254,9)","v":16.18},{"$f":"VLOOKUP(A19,CPU!$A$1:$N$3254,10)","v":19.527642},{"$f":"ROUND(F19*H19,2)","v":781.11},"OK",null,"52,40 + 21,30"]
[8,"2.3","DESMONTE DE MATERIAL DE 3ª CATEGORIA (BLOCOS DE ROCHAS OU MATACOS), COM MARTELETE PNEUMÁTICO MANUAL EXCLUSIVE CARGA E TRANSPORTE",102354,"M3",20.000000000000004,{"$f":"VLOOKUP(A20,CPU!$A$1:$N$3254,9)","v":160.43},{"$f":"VLOOKUP(A20,CPU!$A$1:$N$3254,10)","v":193.62296700000002},{"$f":"ROUND(F20*H20,2)","v":3872.46},"OK"]
[9,"2.4","CARGA, MANOBRA E DESCARGA DE SOLOS E MATERIAIS GRANULARES EM CAMINHÃO BASCULANTE",100974,"M3",156,{"$f":"VLOOKUP(A21,CPU!$A$1:$N$3254,9)","v":8.59},{"$f":"VLOOKUP(A21,CPU!$A$1:$N$3254,10)","v":10.367271000000001},{"$f":"ROUND(F21*H21,2)","v":1617.29},"OK"]
[10,"2.5","LASTRO DE CONCRETO MAGRO, APLICADO EM BLOCOS DE COROAMENTO OU SAPATAS, ESPESSURA DE 5 CM.",96619,"M2",40,{"$f":"VLOOKUP(A22,CPU!$A$1:$N$3254,9)","v":31.05},{"$f":"VLOOKUP(A22,CPU!$A$1:$N$3254,10)","v":37.474245000000003},1498.97,"OK"]
[11,"2.6","ARMAÇÃO DE BLOCO, PILAR, VIGA OU SAPATA UTILIZANDO AÇO CA-50 DE 8 MM",96545,"KG",570.00000000000011,{"$f":"VLOOKUP(A23,CPU!$A$1:$N$3254,9)","v":17.02},{"$f":"VLOOKUP(A23,CPU!$A$1:$N$3254,10)","v":20.541437999999999},{"$f":"ROUND(F23*H23,2)","v":11708.62},"OK"]
[12,"2.7","ARMAÇÃO DE BLOCO, PILAR, VIGA OU SAPATA UTILIZANDO AÇO CA-50 DE 12,5 MM",96547,"KG",2230.0000000000005,{"$f":"VLOOKUP(A24,CPU!$A$1:$N$3254,9)","v":12.879999999999999},{"$f":"VLOOKUP(A24,CPU!$A$1:$N$3254,10)","v":15.544872},{"$f":"ROUND(F24*H24,2)","v":34665.06}]
[13,"2.8","TRANSPORTE COM CAMINHÃO CARROCERIA 9T, EM VIA URBANA PAVIMENTADA (MAT. DIVERSOS - AÇO, MADEIRA, CIMENTO)",100947,"TXKM",600.00398830000006,{"$f":"VLOOKUP(A25,CPU!$A$1:$N$3254,9)","v":2.17},{"$f":"VLOOKUP(A25,CPU!$A$1:$N$3254,10)","v":2.618973},1571.39,"Não considerou"]
[14,"2.9","TRANSPORTE COM CAMINHÃO CARROCERIA 9T, EM VIA URBANA EM LEITO NATURAL (MAT. DIVERSOS - AÇO, MADEIRA, CIMENTO)",100945,"TXKM",1650.0023279420004,{"$f":"VLOOKUP(A26,CPU!$A$1:$N$3254,9)","v":2.7300000000000004},{"$f":"VLOOKUP(A26,CPU!$A$1:$N$3254,10)","v":3.2948370000000007},{"$f":"ROUND(F26*H26,2)","v":5436.49},"Não considerou"]
[15,"2.10","TRANSPORTE COM CAMINHÃO BASCULANTE, EM VIA URBANA PAVIMENTADA (MAT. DIVERSOS - AREIA, BRITA, SOLO, ENTULHO)",95427,"M3XKM",1599.9969500000002,{"$f":"VLOOKUP(A27,CPU!$A$1:$N$3254,9)","v":0.75},{"$f":"VLOOKUP(A27,CPU!$A$1:$N$3254,10)","v":0.90517500000000006},1448.28,"Não considerou"]
[16,"2.11","TRANSPORTE COM CAMINHÃO BASCULANTE, EM VIA URBANA EM LEITO NATURAL (MAT. DIVERSOS - AREIA, BRITA, SOLO, ENTULHO)",95425,"M3XKM",4350.0012429999997,{"$f":"VLOOKUP(A28,CPU!$A$1:$N$3254,9)","v":2.31},{"$f":"VLOOKUP(A28,CPU!$A$1:$N$3254,10)","v":2.7879390000000002},12127.54,"Não considerou"]
[17,"2.12","FABRICAÇÃO, MONTAGEM E DESMONTAGEM DE FÔRMA PARA ESTRUTURAS EM CHAPA DE MADEIRA COMPENSADA RESINADA, E=17 MM, 2 UTILIZAÇÕES",96539,"M2",320.00400000000008,{"$f":"VLOOKUP(A29,CPU!$A$1:$N$3254,9)","v":120.68},{"$f":"VLOOKUP(A29,CPU!$A$1:$N$3254,10)","v":145.64869200000001},46608.160000000003,"OK"]
[18,"2.13","CONCRETAGEM DE BLOCOS DE COROAMENTO E VIGAS BALDRAME, FCK 30 MPA, COM USO DE JERICA LANÇAMENTO, ADENSAMENTO E ACABAMENTO",96555,"M3",119.99800000000002,{"$f":"VLOOKUP(A30,CPU!$A$1:$N$3254,9)","v":688.42},{"$f":"VLOOKUP(A30,CPU!$A$1:$N$3254,10)","v":830.85409800000002},99700.83,"OK","magro?"]
["D",3,"SUPERESTRUTURA E LAJES DE APROXIMAÇÃO",{"$nulls":5},{"$f":"SUM(I32:I47)","v":117514.85},{"$f":"I31/I55","v":0.28444720846471822}]
[19,"3.1","ARMAÇÃO DE PILAR OU VIGA DE UMA ESTRUTURA CONVENCIONAL DE CONCRETO ARMADO UTILIZANDO AÇO CA-50 DE 6,3 MM",92776,"KG",250,{"$f":"VLOOKUP(A32,CPU!$A$1:$N$3254,9)","v":18.190000000000001},{"$f":"VLOOKUP(A32,CPU!$A$1:$N$3254,10)","v":21.953511000000002},{"$f":"ROUND(F32*H32,2)","v":5488.38},"OK",92776]
[20,"3.2","ARMAÇÃO DE PILAR OU VIGA DE UMA ESTRUTURA CONVENCIONAL DE CONCRETO ARMADO UTILIZANDO AÇO CA-50 DE 8 MM",92777,"KG",480.00300000000004,{"$f":"VLOOKUP(A33,CPU!$A$1:$N$3254,9)","v":17.02},{"$f":"VLOOKUP(A33,CPU!$A$1:$N$3254,10)","v":20.541437999999999},9859.9500000000007,null,92777]
[21,"3.3","ARMAÇÃO DE PILAR OU VIGA DE UMA ESTRUTURA CONVENCIONAL DE CONCRETO ARMADO UTILIZANDO AÇO CA-50 DE 10 MM",92778,"KG",619.99500000000012,{"$f":"VLOOKUP(A34,CPU!$A$1:$N$3254,9)","v":15.16},{"$f":"VLOOKUP(A34,CPU!$A$1:$N$3254,10)","v":18.296604000000002},11343.8,null,92778]
[22,"3.4","ARMAÇÃO DE PILAR OU VIGA DE UMA ESTRUTURA CONVENCIONAL DE CONCRETO ARMADO UTILIZANDO AÇO CA-50 DE 12,5 MM",92779,"KG",260,{"$f":"VLOOKUP(A35,CPU!$A$1:$N$3254,9)","v":12.74},{"$f":"VLOOKUP(A35,CPU!$A$1:$N$3254,10)","v":15.375906000000001},3997.74,null,92779]
[23,"3.5","ARMAÇÃO DE PILAR OU VIGA DE UMA ESTRUTURA CONVENCIONAL DE CONCRETO ARMADO UTILIZANDO AÇO CA-50 DE 20 MM",92781,"KG",1160,{"$f":"VLOOKUP(A36,CPU!$A$1:$N$3254,9)","v":13.35},{"$f":"VLOOKUP(A36,CPU!$A$1:$N$3254,10)","v":16.112114999999999},18690.05,null,92781]
[24,"3.6","FABRICAÇÃO DE FÔRMA PARA PILARES E VIGAS, EM CHAPA DE MADEIRA COMPENSADA RESINADA, E = 17 MM",92263,"M2",99.999999999999986,{"$f":"VLOOKUP(A37,CPU!$A$1:$N$3254,9)","v":163.07},{"$f":"VLOOKUP(A37,CPU!$A$1:$N$3254,10)","v":196.80918300000002},{"$f":"ROUND(F37*H37,2)","v":19680.919999999998},"OK",92263]
[25,"3.7","MONTAGEM E DESMONTAGEM DE FÔRMA DE PILARES RETANGULARES E VIGAS, EM CHAPA DE MADEIRA COMPENSADA PLASTIFICADA",92431,"M2",99.999999999999986,{"$f":"VLOOKUP(A38,CPU!$A$1:$N$3254,9)","v":55.84},{"$f":"VLOOKUP(A38,CPU!$A$1:$N$3254,10)","v":67.393296000000007},6739.33,"OK",92431]
[26,"3.8","FABRICAÇÃO DE FÔRMA PARA LAJES, EM CHAPA DE MADEIRA COMPENSADA RESINADA, E = 17 MM",92267,"M2",30,{"$f":"VLOOKUP(A39,CPU!$A$1:$N$3254,9)","v":54.96},{"$f":"VLOOKUP(A39,CPU!$A$1:$N$3254,10)","v":66.331224000000006},{"$f":"ROUND(F39*H39,2)","v":1989.94},"OK",92267]
[27,"3.9","MONTAGEM E DESMONTAGEM DE FÔRMA DE LAJE MACIÇA, PÉ-DIREITO DUPLO, EM CHAPA DE MADEIRA COMPENSADA RESINADA, 2 UTILIZAÇÕES",92508,"M2",30,{"$f":"VLOOKUP(A40,CPU!$A$1:$N$3254,9)","v":111.27000000000001},{"$f":"VLOOKUP(A40,CPU!$A$1:$N$3254,10)","v":134.29176300000003},4028.75,"OK",92508]
[28,"3.10","ESCORAMENTO DE FÔRMAS DE VIGAS E LAJES EM MADEIRA NÃO APARELHADA, INCLUSO TRAVAMENTO, 4 UTILIZAÇÕES",101792,"M3",209.99999999999997,{"$f":"VLOOKUP(A41,CPU!$A$1:$N$3254,9)","v":17.96},{"$f":"VLOOKUP(A41,CPU!$A$1:$N$3254,10)","v":21.675924000000002},{"$f":"ROUND(F41*H41,2)","v":4551.9399999999996},"Não considerou",101792]
[29,"3.11","CONCRETAGEM DE ESTRUTURAS (PAREDES E LAJES) COM CONCRETO USINADO BOMBEÁVEL FCK 30 MPA - LANÇAMENTO, ADENSAMENTO E ACABAMENTO","90861.a","M3",32.000100000000003,{"$f":"VLOOKUP(A42,CPU!$A$1:$N$3254,9)","v":586.74},{"$f":"VLOOKUP(A42,CPU!$A$1:$N$3254,10)","v":708.13650600000005},{"$f":"ROUND(F42*H42,2)","v":22660.44},"OK","90861.a"]
[30,"3.12","APARELHO DE APOIO EM NEOPRENE FRETADO, COM FRETAGEM DE AÇO 4MM INTERCALADAS COM ELASTÔMERO DE 11MM E REVESTIMENTO FINAL COM ELASTÔMERO DE 6MM","CPU.4","DM3",18.75,{"$f":"VLOOKUP(A43,CPU!$A$1:$N$3254,9)","v":108.7},{"$f":"VLOOKUP(A43,CPU!$A$1:$N$3254,10)","v":131.19003000000001},{"$f":"ROUND(F43*H43,2)","v":2459.81},"OK","CPU.5"]
[13,"3.13","TRANSPORTE COM CAMINHÃO CARROCERIA 9T, EM VIA URBANA PAVIMENTADA (MAT. DIVERSOS - AÇO, MADEIRA, CIMENTO)",100947,"TXKM",350.44738558500001,{"$f":"VLOOKUP(A44,CPU!$A$1:$N$3254,9)","v":2.17},{"$f":"VLOOKUP(A44,CPU!$A$1:$N$3254,10)","v":2.618973},917.81,"Não considerou",100947]
[14,"3.14","TRANSPORTE COM CAMINHÃO CARROCERIA 9T, EM VIA URBANA EM LEITO NATURAL (MAT. DIVERSOS - AÇO, MADEIRA, CIMENTO)",100945,"TXKM",1001.2284365029,{"$f":"VLOOKUP(A45,CPU!$A$1:$N$3254,9)","v":2.7300000000000004},{"$f":"VLOOKUP(A45,CPU!$A$1:$N$3254,10)","v":3.2948370000000007},3298.88,"Não considerou",100945]
[15,"3.15","TRANSPORTE COM CAMINHÃO BASCULANTE DE 10 M³, EM VIA URBANA PAVIMENTADA (MAT. DIVERSOS - AREIA, BRITA, SOLO, ENTULHO)",95427,"M3XKM",210.0006525,{"$f":"VLOOKUP(A46,CPU!$A$1:$N$3254,9)","v":0.75},{"$f":"VLOOKUP(A46,CPU!$A$1:$N$3254,10)","v":0.90517500000000006},190.09,"Não considerou",93590]
[16,"3.16","TRANSPORTE COM CAMINHÃO BASCULANTE DE 10 M³, EM VIA URBANA EM LEITO NATURAL (MAT. DIVERSOS - AREIA, BRITA, SOLO, ENTULHO)",95425,"M3XKM",580.00378784999998,{"$f":"VLOOKUP(A47,CPU!$A$1:$N$3254,9)","v":2.31},{"$f":"VLOOKUP(A47,CPU!$A$1:$N$3254,10)","v":2.7879390000000002},{"$f":"ROUND(F47*H47,2)","v":1617.02},"Não considerou",93588]
["E",4,"SERVIÇOS DIVERSOS - ENCABEÇAMENTO, GUARDA-CORPO E LIMPEZA FINAL",{"$nulls":5},{"$f":"SUM(I49:I54)","v":20721.940000000002},{"$f":"I48/I55","v":5.0157899082314987E-2}]
[31,"4.1","REATERRO MANUAL APILOADO COM SOQUETE",96995,"M3",160,{"$f":"VLOOKUP(A49,CPU!$A$1:$N$3254,9)","v":43.22},{"$f":"VLOOKUP(A49,CPU!$A$1:$N$3254,10)","v":52.162218000000003},{"$f":"ROUND(F49*H49,2)","v":8345.9500000000007},"OK",98576]
[32,"4.2","TUBO, PVC, SOLDÁVEL, DN 50MM - FORNECIMENTO E INSTALAÇÃO",89449,"M",4,{"$f":"VLOOKUP(A50,CPU!$A$1:$N$3254,9)","v":23.03},{"$f":"VLOOKUP(A50,CPU!$A$1:$N$3254,10)","v":27.794907000000002},{"$f":"ROUND(F50*H50,2)","v":111.18},"OK",96402]
[33,"4.3","GUARDA-CORPO DE AÇO GALVANIZADO DE 1,10M DE ALTURA, MONTANTES TUBULARES DE 1.1/2\u0094 ESPAÇADOS DE 1,20M, TRAVESSA SUPERIOR DE 2\u0094, GRADIL FORMADO POR BARRAS CHATAS EM FERRO DE 32X4,8MM, FIXADO COM CHUMBADOR MECÂNICO",99839,"M",20,{"$f":"VLOOKUP(A51,CPU!$A$1:$N$3254,9)","v":502.24999999999994},{"$f":"VLOOKUP(A51,CPU!$A$1:$N$3254,10)","v":606.165525},{"$f":"ROUND(F51*H51,2)","v":12123.31},"OK",95995]
[34,"4.4","CARGA, MANOBRA E DESCARGA DE SOLOS E MATERIAIS EM GERAL (ENTULHO) EM CAMINHÃO BASCULANTE",100990,"M3",6,{"$f":"VLOOKUP(A52,CPU!$A$1:$N$3254,9)","v":5.74},{"$f":"VLOOKUP(A52,CPU!$A$1:$N$3254,10)","v":6.9276060000000008},41.57,"OK",100984]
[15,"4.5","TRANSPORTE COM CAMINHÃO BASCULANTE DE 10 M³, EM VIA URBANA PAVIMENTADA (MAT. DIVERSOS - AREIA, BRITA, SOLO, ENTULHO)",95427,"M3XKM",18,{"$f":"VLOOKUP(A53,CPU!$A$1:$N$3254,9)","v":0.75},{"$f":"VLOOKUP(A53,CPU!$A$1:$N$3254,10)","v":0.90517500000000006},16.29,"Não considerou",93590]
[16,"4.6","TRANSPORTE COM CAMINHÃO BASCULANTE DE 10 M³, EM VIA URBANA EM LEITO NATURAL (MAT. DIVERSOS - AREIA, BRITA, SOLO, ENTULHO)",95425,"M3XKM",30,{"$f":"VLOOKUP(A54,CPU!$A$1:$N$3254,9)","v":2.31},{"$f":"VLOOKUP(A54,CPU!$A$1:$N$3254,10)","v":2.7879390000000002},83.64,"Não considerou",93588]
[null,"TOTAL GERAL DA OBRA COM BDI ",{"$nulls":6},{"$f":"SUM(I10,I17,I31,I48)","v":413134.13000000006}]

{"sheet":"CPU","index":1,"n_rows":515,"n_cols":13,"rows_kept":515,"cut":false,"hidden":false,"merged":[[245,0,264,0],[265,0,278,0],[279,0,293,0],[336,10,336,11],[337,2,337,5],[338,2,338,3],[339,1,339,7],[346,1,346,3],[346,5,346,6],[336,0,349,0],[290,5,290,6],[291,1,291,6],[308,0,321,0],[308,1,308,3],[308,4,308,7],[308,10,308,11],[309,2,309,5],[294,0,307,0],[294,1,294,3],[294,4,294,7],[294,10,294,11],[295,2,295,5],[296,2,296,3],[293,1,293,6],[135,1,135,6],[136,1,136,6],[123,0,136,0],[322,10,322,11],[323,2,323,5],[324,2,324,3],[325,1,325,7],[332,1,332,3],[332,5,332,6],[297,1,297,7],[304,1,304,3],[304,5,304,6],[305,1,305,6],[306,1,306,6],[307,1,307,6],[246,2,246,5],[247,2,247,3],[248,1,248,7],[322,0,335,0],[279,10,279,11],[280,2,280,5],[281,2,281,3],[282,1,282,7],[290,1,290,3],[347,1,347,6],[348,1,348,6],[349,1,349,6],[310,2,310,3],[311,1,311,7],[318,1,318,3],[318,5,318,6],[319,1,319,6],[320,1,320,6],[321,1,321,6],[333,1,333,6],[334,1,334,6],[335,1,335,6],[336,1,336,3],[336,4,336,7],[322,1,322,3],[322,4,322,7],[292,1,292,6],[245,1,245,3],[245,4,245,7],[245,10,245,11],[261,1,261,3],[261,5,261,6],[262,1,262,6],[263,1,263,6],[264,1,264,6],[277,1,277,6],[278,1,278,6],[265,1,265,3],[265,4,265,7],[265,10,265,11],[266,2,266,5],[267,2,267,3],[268,1,268,7],[275,1,275,3],[275,5,275,6],[276,1,276,6],[279,1,279,3],[279,4,279,7],[221,0,233,0],[234,1,234,3],[234,4,234,7],[0,0,13,0],[14,0,29,0],[44,0,58,0],[59,0,75,0],[76,0,96,0],[97,0,109,0],[110,0,122,0],[138,0,152,0],[166,0,181,0],[229,1,229,3],[229,5,229,6],[230,1,230,6],[231,1,231,6],[232,1,232,6],[234,0,244,0],[221,1,221,3],[221,4,221,7],[244,1,244,6],[242,1,242,6],[243,1,243,6],[221,10,221,11],[222,2,222,5],[223,2,223,3],[224,1,224,7],[168,2,168,3],[185,1,185,7],[219,1,219,6],[220,1,220,6],[193,1,193,3],[193,5,193,6],[194,1,194,6],[234,10,234,11],[235,2,235,5],[236,2,236,3],[237,1,237,7],[241,1,241,3],[241,5,241,6],[164,1,164,6],[182,10,182,11],[177,1,177,3],[177,5,177,6],[178,1,178,6],[179,1,179,6],[180,1,180,6],[166,1,166,3],[166,4,166,7],[169,1,169,7],[163,1,163,6],[106,1,106,6],[107,1,107,6],[108,1,108,6],[110,1,110,3],[110,4,110,7],[110,10,110,11],[111,2,111,5],[112,2,112,3],[113,1,113,7],[148,1,148,3],[148,5,148,6],[149,1,149,6],[150,1,150,6],[151,1,151,6],[123,1,123,3],[123,4,123,7],[123,10,123,11],[124,2,124,5],[125,2,125,3],[126,1,126,7],[133,1,133,3],[133,5,133,6],[134,1,134,6],[94,1,94,6],[95,1,95,6],[118,1,118,3],[118,5,118,6],[166,10,166,11],[167,2,167,5],[119,1,119,6],[120,1,120,6],[121,1,121,6],[138,1,138,3],[138,4,138,7],[138,10,138,11],[139,2,139,5],[140,2,140,3],[141,1,141,7],[153,1,153,3],[153,4,153,7],[153,10,153,11],[154,2,154,5],[155,2,155,3],[156,1,156,7],[161,1,161,3],[161,5,161,6],[162,1,162,6],[97,10,97,11],[98,2,98,5],[99,2,99,3],[100,1,100,7],[105,1,105,3],[105,5,105,6],[0,1,0,3],[0,4,0,7],[0,10,0,11],[1,2,1,5],[2,2,2,3],[3,1,3,7],[9,1,9,3],[9,5,9,6],[10,1,10,6],[11,1,11,6],[12,1,12,6],[14,1,14,3],[14,4,14,7],[14,10,14,11],[15,2,15,5],[16,2,16,3],[76,10,76,11],[77,2,77,5],[17,1,17,7],[25,1,25,3],[25,5,25,6],[26,1,26,6],[27,1,27,6],[28,1,28,6],[44,1,44,3],[44,4,44,7],[44,10,44,11],[45,2,45,5],[46,2,46,3],[47,1,47,7],[54,1,54,3],[54,5,54,6],[55,1,55,6],[217,1,217,3],[217,5,217,6],[218,1,218,6],[56,1,56,6],[57,1,57,6],[59,1,59,3],[59,4,59,7],[76,1,76,3],[76,4,76,7],[183,2,183,5],[184,2,184,3],[97,1,97,3],[97,4,97,7],[78,2,78,3],[79,1,79,7],[92,1,92,3],[92,5,92,6],[93,1,93,6],[59,10,59,11],[60,2,60,5],[61,2,61,3],[62,1,62,7],[71,1,71,3],[71,5,71,6],[72,1,72,6],[73,1,73,6],[74,1,74,6],[197,0,208,0],[209,0,220,0],[207,1,207,6],[208,1,208,6],[182,0,196,0],[209,1,209,3],[209,4,209,7],[209,10,209,11],[210,2,210,5],[211,2,211,3],[212,1,212,7],[197,1,197,3],[197,4,197,7],[197,10,197,11],[198,2,198,5],[199,2,199,3],[200,1,200,7],[205,1,205,3],[205,5,205,6],[206,1,206,6],[195,1,195,6],[196,1,196,6],[182,1,182,3],[182,4,182,7],[367,0,384,0],[367,1,367,3],[367,4,367,7],[367,10,367,11],[368,2,368,5],[369,2,369,3],[370,1,370,7],[381,1,381,3],[381,5,381,6],[382,1,382,6],[383,1,383,6],[384,1,384,6],[350,0,366,0],[350,1,350,3],[350,4,350,7],[350,10,350,11],[351,2,351,5],[352,2,352,3],[353,1,353,7],[363,1,363,3],[363,5,363,6],[364,1,364,6],[365,1,365,6],[366,1,366,6],[400,0,415,0],[400,1,400,3],[400,4,400,7],[400,10,400,11],[401,2,401,5],[402,2,402,3],[403,1,403,7],[412,1,412,3],[412,5,412,6],[413,1,413,6],[414,1,414,6],[415,1,415,6],[385,0,399,0],[385,1,385,3],[385,4,385,7],[385,10,385,11],[386,2,386,5],[387,2,387,3],[388,1,388,7],[396,1,396,3],[396,5,396,6],[397,1,397,6],[398,1,398,6],[399,1,399,6],[431,0,445,0],[431,1,431,3],[431,4,431,7],[431,10,431,11],[432,2,432,5],[433,2,433,3],[434,1,434,7],[443,1,443,6],[444,1,444,6],[445,1,445,6],[442,1,442,3],[442,5,442,6],[416,0,430,0],[416,1,416,3],[416,4,416,7],[416,10,416,11],[417,2,417,5],[418,2,418,3],[419,1,419,7],[427,1,427,3],[427,5,427,6],[428,1,428,6],[429,1,429,6],[430,1,430,6],[458,1,458,6],[459,0,469,0],[459,1,459,3],[459,4,459,7],[459,10,459,11],[460,2,460,5],[461,2,461,3],[462,1,462,7],[466,1,466,3],[466,5,466,6],[467,1,467,6],[468,1,468,6],[469,1,469,6],[502,0,514,0],[502,1,502,3],[502,4,502,7],[502,10,502,11],[503,2,503,5],[504,2,504,3],[505,1,505,7],[511,1,511,3],[511,5,511,6],[512,1,512,6],[513,1,513,6],[514,1,514,6],[484,0,501,0],[484,1,484,3],[484,4,484,7],[484,10,484,11],[485,2,485,5],[486,2,486,3],[487,1,487,7],[498,1,498,3],[498,5,498,6],[499,1,499,6],[500,1,500,6],[501,1,501,6],[153,0,161,0],[470,0,483,0],[470,1,470,3],[470,4,470,7],[470,10,470,11],[471,2,471,5],[472,2,472,3],[473,1,473,7],[480,1,480,3],[480,5,480,6],[481,1,481,6],[482,1,482,6],[483,1,483,6],[446,0,458,0],[446,1,446,3],[446,4,446,7],[446,10,446,11],[447,2,447,5],[448,2,448,3],[449,1,449,7],[455,1,455,3],[455,5,455,6],[456,1,456,6],[457,1,457,6],[30,0,43,0],[30,1,30,3],[30,4,30,7],[30,10,30,11],[31,2,31,5],[32,2,32,3],[33,1,33,7],[39,1,39,3],[39,5,39,6],[40,1,40,6],[41,1,41,6],[42,1,42,6]]}
[0,"CODEVASF",null,null," COMPOSIÇÃO DE PREÇO UNITÁRIO",null,null,null,{"$f":"H11","v":6819.64},{"$f":"H13","v":8230.6235160000015},"BDI CALCULADO:",null,{"$f":"ORÇAMENTO!I7","v":0.2069}]
[null,"OBRA:  ",{"$f":"ORÇAMENTO!C5","v":"CONSTRUÇÃO DE PONTE SOBRE O RIO BARREIRO - SÃO JOÃO DO PACUÍ (COMUNIDADE BARREIRO)"},null,null,null,"DATA: ",{"$f":"ORÇAMENTO!C7","v":"OUTUBRO/2022"}]
[null,"SERVIÇO:  ",{"$f":"VLOOKUP(A1,ORÇAMENTO!A11:I50,3)","v":"MOBILIZAÇÃO E DESMOBILIZAÇÃO"},null,"Referência:",{"$f":"VLOOKUP(A1,ORÇAMENTO!A11:I50,4)","v":"CPU.1"},"UNIDADE: ",{"$f":"VLOOKUP(A1,ORÇAMENTO!A11:I50,5)","v":"GL"},"OK"]
[]
[null,"TIPO ITEM","CODIGO ITEM","DESCRIÇÃO ITEM","UNIDADE ITEM","COEFICIENTE","PRECO UNITARIO","CUSTO TOTAL"]
[null,"COMPOSICAO",73467,"CAMINHÃO TOCO, PBT 14.300 KG, CARGA ÚTIL MÁX. 9.710 KG, DIST. ENTRE EIXOS 3,56 M, POTÊNCIA 185 CV, INCLUSIVE CARROCERIA FIXA ABERTA DE MADEIRA P/ TRANSPORTE GERAL DE CARGA SECA, DIMEN. APROX. 2,50 X 6,50 X 0,50M","CHP DIURNO.",20,252.95,{"$f":"ROUNDDOWN(F6*G6,2)","v":5059}]
[null,"COMPOSICAO",91395,"CAMINHÃO TOCO, PBT 14.300 KG, CARGA ÚTIL MÁX. 9.710 KG, DIST. ENTRE EIXOS 3,56 M, POTÊNCIA 185 CV, INCLUSIVE CARROCERIA FIXA ABERTA DE MADEIRA P/ TRANSPORTE GERAL DE CARGA SECA, DIMEN. APROX. 2,50 X 6,50 X 0,50M","CHI DIURNO.",20,47.2,{"$f":"ROUNDDOWN(F7*G7,2)","v":944}]
[null,"COMPOSIÇÃO",88316,"SERVENTE COM ENCARGOS COMPLEMENTARES","H",32,18.02,576.64]
[null,"ESTIMATIVA",null,"PASSAGENS DE ÔNIBUS","UNID",4,60,240]
[null,"PRODUÇÃO DA EQUIPE",null,null,1,"CUSTO ",null,{"$f":"SUM(H6:H9)","v":6819.64}]
[null,"TOTAL",{"$nulls":5},{"$f":"H10/E10","v":6819.64}]
[null,"BDI                %",{"$nulls":5},{"$f":"1+$M$1","v":1.2069000000000001}]
[null,"TOTAL DO SERVIÇO - R$",{"$nulls":5},{"$f":"H11*H12","v":8230.6235160000015}]
[]
[{"$f":"A1+1","v":1},"CODEVASF",null,null," COMPOSIÇÃO DE PREÇO UNITÁRIO",null,null,null,{"$f":"H27","v":27201.199999999997},{"$f":"H29","v":32829.128279999997}]
[null,"OBRA:  ",{"$f":"$C$2","v":"CONSTRUÇÃO DE PONTE SOBRE O RIO BARREIRO - SÃO JOÃO DO PACUÍ (COMUNIDADE BARREIRO)"},null,null,null,"DATA: ",{"$f":"$H$2","v":"OUTUBRO/2022"}]
[null,"SERVIÇO:  ",{"$f":"VLOOKUP(A15,ORÇAMENTO!$A$11:$I$50,3)","v":"ADMINISTRAÇÃO LOCAL E MANUTENÇÃO DO CANTEIRO DE OBRAS"},null,"SINAPI","CPU","UNIDADE: ",{"$f":"VLOOKUP(A15,ORÇAMENTO!$A$11:$I$50,5)","v":"GL"},"OK"]
[]
[null,"TIPO ITEM","CODIGO ITEM","DESCRIÇÃO ITEM","UNIDADE ITEM","COEFICIENTE","PRECO UNITARIO","CUSTO TOTAL"]
[null,"INSUMO",3346,"LOCACAO DE GRUPO GERADOR *80 A 125* KVA, MOTOR DIESEL, REBOCAVEL","H",60,15.66,{"$f":"ROUNDDOWN(F20*G20,2)","v":939.6}]
[null,"COMPOSICAO",101008,"CARGA DE ÁGUA EM CAMINHÃO PIPA","M3",9,5.47,49.23]
[null,"COMPOSICAO",100955,"TRANSPORTE COM CAMINHÃO PIPA, EM VIA URBANA EM LEITO NATURAL","M3XKM",{"$f":"F21*15","v":135},4.95,668.25]
[null,"COTAÇÃO","MERC.","VAN PARA TRANSPORTE DO PESSOAL","VB",1,600,600]
[null,"COMPOSICAO",90777,"Engenheiro Civil","H",22,103.51,2277.2199999999998]
[null,"COMPOSICAO",90776,"Encarregado Geral","H",55,41.2,2266]
[null,"PRODUÇÃO DA EQUIPE",null,null,0.25,"CUSTO ",null,{"$f":"SUM(H20:H25)","v":6800.2999999999993}]
[null,"TOTAL",{"$nulls":5},{"$f":"H26/E26","v":27201.199999999997}]
[null,"BDI                %",{"$nulls":5},{"$f":"1+$M$1","v":1.2069000000000001}]
[null,"TOTAL DO SERVIÇO - R$",{"$nulls":5},{"$f":"H27*H28","v":32829.128279999997}]
[]
[2,"CODEVASF",null,null," COMPOSIÇÃO DE PREÇO UNITÁRIO",null,null,null,{"$f":"H41","v":0.39},{"$f":"H43","v":0.47069100000000003}]
[null,"OBRA:  ",{"$f":"$C$2","v":"CONSTRUÇÃO DE PONTE SOBRE O RIO BARREIRO - SÃO JOÃO DO PACUÍ (COMUNIDADE BARREIRO)"},null,null,null,"DATA: ",{"$f":"$H$2","v":"OUTUBRO/2022"}]
[null,"SERVIÇO:  ",{"$f":"VLOOKUP(A31,ORÇAMENTO!$A$11:$I$50,3)","v":"LIMPEZA MECANIZADA DE CAMADA VEGETAL, VEGETAÇÃO E PEQUENAS ÁRVORES (DIÂMETRO DE TRONCO MENOR QUE 0,20 M)"},null,"SINAPI",{"$f":"VLOOKUP(A31,ORÇAMENTO!$A$11:$I$50,4)","v":98525},"UNIDADE: ",{"$f":"VLOOKUP(A31,ORÇAMENTO!$A$11:$I$50,5)","v":"M2"},"OK"]
[]
[null,"TIPO ITEM","CODIGO ITEM","DESCRIÇÃO ITEM","UNIDADE ITEM","COEFICIENTE","PRECO UNITARIO","CUSTO TOTAL"]
[null,"COMPOSICAO","88316","SERVENTE COM ENCARGOS COMPLEMENTARES","H","0,0030000","18,02",{"$f":"ROUNDDOWN(F36*G36,2)","v":0.05}]
[null,"COMPOSICAO","88441","JARDINEIRO COM ENCARGOS COMPLEMENTARES","H","0,0030000","22,22",0.06]
[null,"COMPOSICAO","89031","TRATOR DE ESTEIRAS, POTÊNCIA 100 HP, PESO OPERACIONAL 9,4 T, COM LÂMINA 2,19 M3 - CHI DIURNO. AF_06/2014","CHI","0,0024000","69,89",0.16]
[null,"COMPOSICAO","89032","TRATOR DE ESTEIRAS, POTÊNCIA 100 HP, PESO OPERACIONAL 9,4 T, COM LÂMINA 2,19 M3 - CHP DIURNO. AF_06/2014","CHP","0,0006000","202,18",0.12]
[null,"PRODUÇÃO DA EQUIPE",null,null,1,"CUSTO ",null,{"$f":"SUM(H36:H39)","v":0.39}]
[null,"TOTAL",{"$nulls":5},{"$f":"H40/E40","v":0.39}]
[null,"BDI                %",{"$nulls":5},{"$f":"1+$M$1","v":1.2069000000000001}]
[null,"TOTAL DO SERVIÇO - R$",{"$nulls":5},{"$f":"H41*H42","v":0.47069100000000003}]
[]
[3,"CODEVASF",null,null," COMPOSIÇÃO DE PREÇO UNITÁRIO",null,null,null,{"$f":"H56","v":4708.5599999999995},{"$f":"H58","v":5682.7610639999994}]
[null,"OBRA:  ",{"$f":"$C$2","v":"CONSTRUÇÃO DE PONTE SOBRE O RIO BARREIRO - SÃO JOÃO DO PACUÍ (COMUNIDADE BARREIRO)"},null,null,null,"DATA: ",{"$f":"$H$2","v":"OUTUBRO/2022"}]
[null,"SERVIÇO:  ",{"$f":"VLOOKUP(A45,ORÇAMENTO!$A$11:$I$50,3)","v":"INSTALAÇÕES E CANTEIRO DE OBRAS"},null,"SINAPI",{"$f":"VLOOKUP(A45,ORÇAMENTO!$A$11:$I$50,4)","v":"CPU.3"},"UNIDADE: ",{"$f":"VLOOKUP(A45,ORÇAMENTO!$A$11:$I$50,5)","v":"GL"},"OK"]
[]
[null,"TIPO ITEM","CODIGO ITEM","DESCRIÇÃO ITEM","UNIDADE ITEM","COEFICIENTE","PRECO UNITARIO","CUSTO TOTAL"]
[null,"INSUMO",10775,"LOCACAO DE CONTAINER 2,30 X 6,00M, ALT. 2,50 M, COM SANITARIO, PARA ESCRITORIO, COMPLETO, SEM DIVISORIAS INTERNAS","MÊS",4,919.5,{"$f":"ROUNDDOWN(F50*G50,2)","v":3678}]
[null,"INSUMO",37524,"TELA PLASTICA LARANJA, TIPO TAPUME PARA SINALIZACAO, MALHA RETANGULAR","M",40,3,120]
[null,"COMPOSICAO",100382,"FABRICAÇÃO E INSTALAÇÃO DE PONTALETES DE MADEIRA NÃO APARELHADA PARA TELHADOS COM ATÉ 2 ÁGUAS E COM TELHA ONDULADA DE FIBROCIMENTO","M2",12,34.29,411.48]
[null,"COMPOSICAO",94207,"TELHAMENTO COM TELHA ONDULADA DE FIBROCIMENTO E = 6 MM, COM RECOBRIMENTO LATERAL DE 1/4 DE ONDA","M2",12,41.59,499.08]
[{"$nulls":7},0]
[null,"PRODUÇÃO DA EQUIPE",null,null,1,"CUSTO ",null,{"$f":"SUM(H50:H54)","v":4708.5599999999995}]
[null,"TOTAL",{"$nulls":5},{"$f":"H55/E55","v":4708.5599999999995}]
[null,"BDI                %",{"$nulls":5},{"$f":"1+$M$1","v":1.2069000000000001}]
[null,"TOTAL DO SERVIÇO - R$",{"$nulls":5},{"$f":"H56*H57","v":5682.7610639999994}]
[]
[{"$f":"A45+1","v":4},"CODEVASF",null,null," COMPOSIÇÃO DE PREÇO UNITÁRIO",null,null,null,{"$f":"H73","v":592.84},{"$f":"H75","v":715.49859600000013}]
[null,"OBRA:  ",{"$f":"$C$2","v":"CONSTRUÇÃO DE PONTE SOBRE O RIO BARREIRO - SÃO JOÃO DO PACUÍ (COMUNIDADE BARREIRO)"},null,null,null,"DATA: ",{"$f":"$H$2","v":"OUTUBRO/2022"}]
[null,"SERVIÇO:  ",{"$f":"VLOOKUP(A60,ORÇAMENTO!$A$11:$I$50,3)","v":"PLACA DE OBRA EM CHAPA DE AÇO GALVANIZADO"},null,"SINAPI",{"$f":"VLOOKUP(A60,ORÇAMENTO!$A$11:$I$50,4)","v":"74209/001"},"UNIDADE: ",{"$f":"VLOOKUP(A60,ORÇAMENTO!$A$11:$I$50,5)","v":"M2"},"OK"]
[]
[null,"TIPO ITEM","CODIGO ITEM","DESCRIÇÃO ITEM","UNIDADE ITEM","COEFICIENTE","PRECO UNITARIO","CUSTO TOTAL"]
[null,"INSUMO","4417","SARRAFO DE MADEIRA NAO APARELHADA *2,5 X 7* CM, MACARANDUBA, ANGELIM OU EQUIVALENTE DA REGIAO","M","1,0000000",11.94,{"$f":"ROUNDDOWN(F65*G65,2)","v":11.94}]
[null,"INSUMO","4491","PONTALETE DE MADEIRA NAO APARELHADA *7,5 X 7,5* CM (3 X 3 \") PINUS, MISTA OU EQUIVALENTE DA REGIAO","M","4,0000000",8.39,33.56]
[null,"INSUMO","4813","PLACA DE OBRA (PARA CONSTRUCAO CIVIL) EM CHAPA GALVANIZADA *N. 22*, ADESIVADA, DE *2,0 X 1,125* M","M2","1,0000000",480,480]
[null,"INSUMO","5075","PREGO DE ACO POLIDO COM CABECA 18 X 30 (2 3/4 X 10)","KG","0,1100000",23.4,2.57]
[null,"COMPOSICAO","88262","CARPINTEIRO DE FORMAS COM ENCARGOS COMPLEMENTARES","H","1,0000000",24.86,24.86]
[null,"COMPOSICAO","88316","SERVENTE COM ENCARGOS COMPLEMENTARES","H","2,0000000",18.02,36.04]
[null,"COMPOSICAO","94962","CONCRETO MAGRO PARA LASTRO, TRAÇO 1:4,5:4,5 (CIMENTO/ AREIA MÉDIA/ BRITA 1)  - PREPARO MECÂNICO COM BETONEIRA 400 L","M3","0,0100000",387.31,3.87]
[null,"PRODUÇÃO DA EQUIPE",null,null,1,"CUSTO ",null,{"$f":"SUM(H65:H71)","v":592.84}]
[null,"TOTAL",{"$nulls":5},{"$f":"H72/E72","v":592.84}]
[null,"BDI                %",{"$nulls":5},{"$f":"1+$M$1","v":1.2069000000000001}]
[null,"TOTAL DO SERVIÇO - R$",{"$nulls":5},{"$f":"H73*H74","v":715.49859600000013}]
[]
[{"$f":"A60+1","v":5},"CODEVASF",null,null," COMPOSIÇÃO DE PREÇO UNITÁRIO",null,null,null,{"$f":"H94","v":65.759999999999991},{"$f":"H96","v":79.365743999999992}]
[null,"OBRA:  ",{"$f":"$C$2","v":"CONSTRUÇÃO DE PONTE SOBRE O RIO BARREIRO - SÃO JOÃO DO PACUÍ (COMUNIDADE BARREIRO)"},null,null,null,"DATA: ",{"$f":"$H$2","v":"OUTUBRO/2022"}]
[null,"SERVIÇO:  ",{"$f":"VLOOKUP(A77,ORÇAMENTO!$A$11:$I$50,3)","v":"LOCACAO CONVENCIONAL DE OBRA, UTILIZANDO GABARITO DE TÁBUAS CORRIDAS PONTALETADAS A CADA 2,00M"},null,"SINAPI",{"$f":"VLOOKUP(A77,ORÇAMENTO!$A$11:$I$50,4)","v":99059},"UNIDADE: ",{"$f":"VLOOKUP(A77,ORÇAMENTO!$A$11:$I$50,5)","v":"M"},"OK"]
[]
[null,"TIPO ITEM","CODIGO ITEM","DESCRIÇÃO ITEM","UNIDADE ITEM","COEFICIENTE","PRECO UNITARIO","CUSTO TOTAL"]
[null,"INSUMO","4417","SARRAFO NAO APARELHADO *2,5 X 7* CM, EM MACARANDUBA, ANGELIM OU EQUIVALENTE DA REGIAO -  BRUTA","M","0,7445000","11,94",{"$f":"ROUNDDOWN(F82*G82,2)","v":8.8800000000000008}]
[null,"INSUMO","4433","CAIBRO NAO APARELHADO  *7,5 X 7,5* CM, EM MACARANDUBA, ANGELIM OU EQUIVALENTE DA REGIAO -  BRUTA","M","0,4125000","42,90",17.690000000000001]
[null,"INSUMO","5068","PREGO DE ACO POLIDO COM CABECA 17 X 21 (2 X 11)","KG","0,1110000","23,40",2.59]
[null,"INSUMO","7356","TINTA LATEX ACRILICA PREMIUM, COR BRANCO FOSCO","L","0,0256000","22,39",0.56999999999999995]
[null,"INSUMO","10567","TABUA *2,5 X 23* CM EM PINUS, MISTA OU EQUIVALENTE DA REGIAO - BRUTA","M","0,5500000","9,48",5.21]
[null,"COMPOSICAO","88239","AJUDANTE DE CARPINTEIRO COM ENCARGOS COMPLEMENTARES","H","0,3563000","19,96",7.11]
[null,"COMPOSICAO","88262","CARPINTEIRO DE FORMAS COM ENCARGOS COMPLEMENTARES","H","0,7125000","24,86",17.71]
[null,"COMPOSICAO","91692","SERRA CIRCULAR DE BANCADA COM MOTOR ELÉTRICO POTÊNCIA DE 5HP, COM COIFA PARA DISCO 10\" - CHP DIURNO. AF_08/2015","CHP","0,0039000","28,39",0.11]
[null,"COMPOSICAO","91693","SERRA CIRCULAR DE BANCADA COM MOTOR ELÉTRICO POTÊNCIA DE 5HP, COM COIFA PARA DISCO 10\" - CHI DIURNO. AF_08/2015","CHI","0,0168000","27,35",0.45]
[null,"COMPOSICAO","94974","CONCRETO MAGRO PARA LASTRO, TRAÇO 1:4,5:4,5 (EM MASSA SECA DE CIMENTO/ AREIA MÉDIA/ BRITA 1) - PREPARO MANUAL. AF_05/2021","M3","0,0046000","432,11",1.98]
[null,"COMPOSICAO","99062","MARCAÇÃO DE PONTOS EM GABARITO OU CAVALETE. AF_10/2018","UN","1,5000000","2,31",3.46]
[null,"PRODUÇÃO DA EQUIPE",null,null,1,"CUSTO ",null,{"$f":"SUM(H82:H92)","v":65.759999999999991}]
[null,"TOTAL",{"$nulls":5},{"$f":"H93/E93","v":65.759999999999991}]
[null,"BDI                %",{"$nulls":5},{"$f":"1+$M$1","v":1.2069000000000001}]
[null,"TOTAL DO SERVIÇO - R$",{"$nulls":5},{"$f":"H94*H95","v":79.365743999999992}]
[]
[{"$f":"A77+1","v":6},"CODEVASF",null,null," COMPOSIÇÃO DE PREÇO UNITÁRIO",null,null,null,{"$f":"H107","v":14.969999999999999},{"$f":"H109","v":18.067292999999999}]
[null,"OBRA:  ",{"$f":"$C$2","v":"CONSTRUÇÃO DE PONTE SOBRE O RIO BARREIRO - SÃO JOÃO DO PACUÍ (COMUNIDADE BARREIRO)"},null,null,null,"DATA: ",{"$f":"$H$2","v":"OUTUBRO/2022"},null,{"$f":"H110","v":0}]
[null,"SERVIÇO:  ",{"$f":"VLOOKUP(A98,ORÇAMENTO!$A$11:$I$50,3)","v":"ESCAVAÇÃO MECANIZADA DE VALA EM MATERIAL DE 1A CATEGORIA"},null,"SINAPI",{"$f":"VLOOKUP(A98,ORÇAMENTO!$A$11:$I$50,4)","v":102299},"UNIDADE: ",{"$f":"VLOOKUP(A98,ORÇAMENTO!$A$11:$I$50,5)","v":"M3"},"OK"]
[]
[null,"TIPO ITEM","CODIGO ITEM","DESCRIÇÃO ITEM","UNIDADE ITEM","COEFICIENTE","PRECO UNITARIO","CUSTO TOTAL"]
[null,"COMPOSICAO","5678","RETROESCAVADEIRA SOBRE RODAS COM CARREGADEIRA, TRAÇÃO 4X4, POTÊNCIA LÍQ. 88 HP, CAÇAMBA CARREG. CAP. MÍN. 1 M3, CAÇAMBA RETRO CAP. 0,26 M3, PESO OPERACIONAL MÍN. 6.674 KG, PROFUNDIDADE ESCAVAÇÃO MÁX. 4,37M","CHP","0,0555000","155,07",{"$f":"ROUNDDOWN(F103*G103,2)","v":8.6}]
[null,"COMPOSICAO","5679","RETROESCAVADEIRA SOBRE RODAS COM CARREGADEIRA, TRAÇÃO 4X4, POTÊNCIA LÍQ. 88 HP, CAÇAMBA CARREG. CAP. MÍN. 1 M3, CAÇAMBA RETRO CAP. 0,26 M3, PESO OPERACIONAL MÍN. 6.674 KG, PROFUNDIDADE ESCAVAÇÃO MÁX. 4,37M","CHI","0,0670000","62,29",4.17]
[null,"COMPOSICAO","88316","SERVENTE COM ENCARGOS COMPLEMENTARES","H","0,1225000","18,02",2.2000000000000002]
[null,"PRODUÇÃO DA EQUIPE",null,null,1,"CUSTO ",null,{"$f":"SUM(H103:H105)","v":14.969999999999999}]
[null,"TOTAL",{"$nulls":5},{"$f":"H106/E106","v":14.969999999999999}]
[null,"BDI                %",{"$nulls":5},{"$f":"1+$M$1","v":1.2069000000000001}]
[null,"TOTAL DO SERVIÇO - R$",{"$nulls":5},{"$f":"H107*H108","v":18.067292999999999}]
[]
[{"$f":"A98+1","v":7},"CODEVASF",null,null," COMPOSIÇÃO DE PREÇO UNITÁRIO",null,null,null,{"$f":"H120","v":16.18},{"$f":"H122","v":19.527642}]
[null,"OBRA:  ",{"$f":"$C$2","v":"CONSTRUÇÃO DE PONTE SOBRE O RIO BARREIRO - SÃO JOÃO DO PACUÍ (COMUNIDADE BARREIRO)"},null,null,null,"DATA: ",{"$f":"$H$2","v":"OUTUBRO/2022"}]
[null,"SERVIÇO:  ",{"$f":"VLOOKUP(A111,ORÇAMENTO!$A$11:$I$50,3)","v":"ESCAVAÇÃO MECANIZADA DE VALA EM MATERIAL DE 2A CATEGORIA "},null,"SINAPI",{"$f":"VLOOKUP(A111,ORÇAMENTO!$A$11:$I$50,4)","v":102306},"UNIDADE: ",{"$f":"VLOOKUP(A111,ORÇAMENTO!$A$11:$I$50,5)","v":"M3"},"OK"]
[]
[null,"TIPO ITEM","CODIGO ITEM","DESCRIÇÃO ITEM","UNIDADE ITEM","COEFICIENTE","PRECO UNITARIO","CUSTO TOTAL"]
[null,"COMPOSICAO","5631","ESCAVADEIRA HIDRÁULICA SOBRE ESTEIRAS, CAÇAMBA 0,80 M3, PESO OPERACIONAL 17 T, POTENCIA BRUTA 111 HP","CHP","0,0453000","224,30",{"$f":"ROUNDDOWN(F116*G116,2)","v":10.16}]
[null,"COMPOSICAO","5632","ESCAVADEIRA HIDRÁULICA SOBRE ESTEIRAS, CAÇAMBA 0,80 M3, PESO OPERACIONAL 17 T, POTENCIA BRUTA 111 HP","CHI","0,0492000","87,91",4.32]
[null,"COMPOSICAO","88316","SERVENTE COM ENCARGOS COMPLEMENTARES","H","0,0945000","18,02",1.7]
[null,"PRODUÇÃO DA EQUIPE",null,null,1,"CUSTO ",null,{"$f":"SUM(H116:H118)","v":16.18}]
[null,"TOTAL",{"$nulls":5},{"$f":"H119/E119","v":16.18}]
[null,"BDI                %",{"$nulls":5},{"$f":"1+$M$1","v":1.2069000000000001}]
[null,"TOTAL DO SERVIÇO - R$",{"$nulls":5},{"$f":"H120*H121","v":19.527642}]
[]
[8,"CODEVASF",null,null," COMPOSIÇÃO DE PREÇO UNITÁRIO",null,null,null,{"$f":"H135","v":160.43},{"$f":"H137","v":193.62296700000002}]
[null,"OBRA:  ",{"$f":"$C$2","v":"CONSTRUÇÃO DE PONTE SOBRE O RIO BARREIRO - SÃO JOÃO DO PACUÍ (COMUNIDADE BARREIRO)"},null,null,null,"DATA: ",{"$f":"$H$2","v":"OUTUBRO/2022"}]
[null,"SERVIÇO:  ",{"$f":"VLOOKUP(A124,ORÇAMENTO!$A$11:$I$50,3)","v":"DESMONTE DE MATERIAL DE 3ª CATEGORIA (BLOCOS DE ROCHAS OU MATACOS), COM MARTELETE PNEUMÁTICO MANUAL EXCLUSIVE CARGA E TRANSPORTE"},null,"SINAPI",{"$f":"VLOOKUP(A124,ORÇAMENTO!$A$11:$I$50,4)","v":102354},"UNIDADE: ",{"$f":"VLOOKUP(A124,ORÇAMENTO!$A$11:$I$50,5)","v":"M3"},"OK"]
[]
[null,"TIPO ITEM","CODIGO ITEM","DESCRIÇÃO ITEM","UNIDADE ITEM","COEFICIENTE","PRECO UNITARIO","CUSTO TOTAL"]
[null,"COMPOSICAO","5795","MARTELETE OU ROMPEDOR PNEUMÁTICO MANUAL, 28 KG, COM SILENCIADOR","CHP","1,3422000","26,95",{"$f":"ROUNDDOWN(F129*G129,2)","v":36.17}]
[null,"COMPOSICAO","5952","MARTELETE OU ROMPEDOR PNEUMÁTICO MANUAL, 28 KG, COM SILENCIADOR","CHI","1,1698000","24,98",29.22]
[null,"COMPOSICAO","5953","COMPRESSOR DE AR REBOCÁVEL, VAZÃO 189 PCM, PRESSÃO EFETIVA DE TRABALHO 102 PSI, MOTOR DIESEL, POTÊNCIA 63 CV","CHP","1,3422000","65,95",88.51]
[null,"COMPOSICAO","5954","COMPRESSOR DE AR REBOCÁVEL, VAZÃO 189 PCM, PRESSÃO EFETIVA DE TRABALHO 102 PSI, MOTOR DIESEL, POTÊNCIA 63 CV","CHI","1,1698000","5,59",6.53]
[{"$nulls":7},0]
[null,"PRODUÇÃO DA EQUIPE",null,null,1,"CUSTO ",null,{"$f":"SUM(H129:H133)","v":160.43}]
[null,"TOTAL",{"$nulls":5},{"$f":"H134/E134","v":160.43}]
[null,"BDI                %",{"$nulls":5},{"$f":"1+$M$1","v":1.2069000000000001}]
[null,"TOTAL DO SERVIÇO - R$",{"$nulls":5},{"$f":"H135*H136","v":193.62296700000002}]
[]
[9,"CODEVASF",null,null," COMPOSIÇÃO DE PREÇO UNITÁRIO",null,null,null,{"$f":"H150","v":8.59},{"$f":"H152","v":10.367271000000001}]
[null,"OBRA:  ",{"$f":"$C$2","v":"CONSTRUÇÃO DE PONTE SOBRE O RIO BARREIRO - SÃO JOÃO DO PACUÍ (COMUNIDADE BARREIRO)"},null,null,null,"DATA: ",{"$f":"$H$2","v":"OUTUBRO/2022"}]
[null,"SERVIÇO:  ",{"$f":"VLOOKUP(A139,ORÇAMENTO!$A$11:$I$50,3)","v":"CARGA, MANOBRA E DESCARGA DE SOLOS E MATERIAIS GRANULARES EM CAMINHÃO BASCULANTE"},null,"SINAPI",{"$f":"VLOOKUP(A139,ORÇAMENTO!$A$11:$I$50,4)","v":100974},"UNIDADE: ",{"$f":"VLOOKUP(A139,ORÇAMENTO!$A$11:$I$50,5)","v":"M3"},"OK"]
[]
[null,"TIPO ITEM","CODIGO ITEM","DESCRIÇÃO ITEM","UNIDADE ITEM","COEFICIENTE","PRECO UNITARIO","CUSTO TOTAL"]
[null,"COMPOSICAO","5940","PÁ CARREGADEIRA SOBRE RODAS, POTÊNCIA LÍQUIDA 128 HP, CAPACIDADE DA CAÇAMBA 1,7 A 2,8 M3, PESO OPERACIONAL 11632 KG","CHP","0,0083000","213,75",{"$f":"ROUNDDOWN(F144*G144,2)","v":1.77}]
[null,"COMPOSICAO","5942","PÁ CARREGADEIRA SOBRE RODAS, POTÊNCIA LÍQUIDA 128 HP, CAPACIDADE DA CAÇAMBA 1,7 A 2,8 M3, PESO OPERACIONAL 11632 KG","CHI","0,0105000","81,69",0.85]
[null,"COMPOSICAO","91386","CAMINHÃO BASCULANTE 10 M3, TRUCADO CABINE SIMPLES, PESO BRUTO TOTAL 23.000 KG, CARGA ÚTIL MÁXIMA 15.935 KG, DISTÂNCIA ENTRE EIXOS 4,80 M, POTÊNCIA 230 CV INCLUSIVE CAÇAMBA METÁLICA","CHP","0,0198000","262,43",5.19]
[null,"COMPOSICAO","91387","CAMINHÃO BASCULANTE 10 M3, TRUCADO CABINE SIMPLES, PESO BRUTO TOTAL 23.000 KG, CARGA ÚTIL MÁXIMA 15.935 KG, DISTÂNCIA ENTRE EIXOS 4,80 M, POTÊNCIA 230 CV INCLUSIVE CAÇAMBA METÁLICA","CHI","0,0138000","57,00",0.78]
[{"$nulls":7},0]
[null,"PRODUÇÃO DA EQUIPE",null,null,1,"CUSTO ",null,{"$f":"SUM(H144:H148)","v":8.59}]
[null,"TOTAL",{"$nulls":5},{"$f":"H149/E149","v":8.59}]
[null,"BDI                %",{"$nulls":5},{"$f":"1+$M$1","v":1.2069000000000001}]
[null,"TOTAL DO SERVIÇO - R$",{"$nulls":5},{"$f":"H150*H151","v":10.367271000000001}]
[]
[10,"CODEVASF",null,null," COMPOSIÇÃO DE PREÇO UNITÁRIO",null,null,null,{"$f":"H163","v":31.05},{"$f":"H165","v":37.474245000000003}]
[null,"OBRA:  ",{"$f":"$C$2","v":"CONSTRUÇÃO DE PONTE SOBRE O RIO BARREIRO - SÃO JOÃO DO PACUÍ (COMUNIDADE BARREIRO)"},null,null,null,"DATA: ",{"$f":"$H$2","v":"OUTUBRO/2022"}]
[null,"SERVIÇO:  ",{"$f":"VLOOKUP(A154,ORÇAMENTO!$A$11:$I$54,3)","v":"LASTRO DE CONCRETO MAGRO, APLICADO EM BLOCOS DE COROAMENTO OU SAPATAS, ESPESSURA DE 5 CM."},null,"SINAPI",{"$f":"VLOOKUP(A154,ORÇAMENTO!$A$11:$I$50,4)","v":96619},"UNIDADE: ",{"$f":"VLOOKUP(A154,ORÇAMENTO!$A$11:$I$50,5)","v":"M2"},"OK"]
[]
[null,"TIPO ITEM","CODIGO ITEM","DESCRIÇÃO ITEM","UNIDADE ITEM","COEFICIENTE","PRECO UNITARIO","CUSTO TOTAL"]
[null,"COMPOSICAO","88309","PEDREIRO COM ENCARGOS COMPLEMENTARES","H","0,3106000","25,14",{"$f":"ROUNDDOWN(F159*G159,2)","v":7.8}]
[null,"COMPOSICAO","88316","SERVENTE COM ENCARGOS COMPLEMENTARES","H","0,0847000","18,02",1.52]
[null,"COMPOSICAO","94968","CONCRETO MAGRO PARA LASTRO, TRAÇO 1:4,5:4,5 (EM MASSA SECA DE CIMENTO/ AREIA MÉDIA/ BRITA 1) - PREPARO MECÂNICO COM BETONEIRA ","M3","0,0565000","384,68",21.73]
[null,"PRODUÇÃO DA EQUIPE",null,null,1,"CUSTO ",null,{"$f":"SUM(H159:H161)","v":31.05}]
[null,"TOTAL",{"$nulls":5},{"$f":"H162/E162","v":31.05}]
[null,"BDI                %",{"$nulls":5},{"$f":"1+$M$1","v":1.2069000000000001}]
[null,"TOTAL DO SERVIÇO - R$",{"$nulls":5},{"$f":"H163*H164","v":37.474245000000003}]
[]
[11,"CODEVASF",null,null," COMPOSIÇÃO DE PREÇO UNITÁRIO",null,null,null,{"$f":"H179","v":17.02},{"$f":"H181","v":20.541437999999999}]
[null,"OBRA:  ",{"$f":"$C$2","v":"CONSTRUÇÃO DE PONTE SOBRE O RIO BARREIRO - SÃO JOÃO DO PACUÍ (COMUNIDADE BARREIRO)"},null,null,null,"DATA: ",{"$f":"$H$2","v":"OUTUBRO/2022"}]
[null,"SERVIÇO:  ",{"$f":"VLOOKUP(A167,ORÇAMENTO!$A$11:$I$50,3)","v":"ARMAÇÃO DE BLOCO, PILAR, VIGA OU SAPATA UTILIZANDO AÇO CA-50 DE 8 MM"},null,"SINAPI",{"$f":"VLOOKUP(A167,ORÇAMENTO!$A$11:$I$50,4)","v":96545},"UNIDADE: ",{"$f":"VLOOKUP(A167,ORÇAMENTO!$A$11:$I$50,5)","v":"KG"},"OK"]
[]
[null,"TIPO ITEM","CODIGO ITEM","DESCRIÇÃO ITEM","UNIDADE ITEM","COEFICIENTE","PRECO UNITARIO","CUSTO TOTAL"]
[null,"INSUMO","39017","ESPACADOR / DISTANCIADOR CIRCULAR COM ENTRADA LATERAL, EM PLASTICO, PARA VERGALHAO *4,2 A 12,5* MM, COBRIMENTO 20 MM","UN","0,7240000","0,21",{"$f":"ROUNDDOWN(F172*G172,2)","v":0.15}]
[null,"INSUMO","43132","ARAME RECOZIDO 16 BWG, D = 1,65 MM (0,016 KG/M) OU 18 BWG, D = 1,25 MM (0,01 KG/M)","KG","0,0250000","26,20",0.65]
[null,"COMPOSICAO","88238","AJUDANTE DE ARMADOR COM ENCARGOS COMPLEMENTARES","H","0,0375000","18,40",0.69]
[null,"COMPOSICAO","88245","ARMADOR COM ENCARGOS COMPLEMENTARES","H","0,1155000","24,98",2.88]
[null,"COMPOSICAO","92802","CORTE E DOBRA DE AÇO CA-50, DIÂMETRO DE 8,0 MM","KG","1,0000000","12,65",12.65]
[{"$nulls":7},0]
[null,"PRODUÇÃO DA EQUIPE",null,null,1,"CUSTO ",null,{"$f":"SUM(H172:H177)","v":17.02}]
[null,"TOTAL",{"$nulls":5},{"$f":"H178/E178","v":17.02}]
[null,"BDI                %",{"$nulls":5},{"$f":"1+$M$1","v":1.2069000000000001}]
[null,"TOTAL DO SERVIÇO - R$",{"$nulls":5},{"$f":"H179*H180","v":20.541437999999999}]
[]
[12,"CODEVASF",null,null," COMPOSIÇÃO DE PREÇO UNITÁRIO",null,null,null,{"$f":"H195","v":12.879999999999999},{"$f":"H197","v":15.544872}]
[null,"OBRA:  ",{"$f":"$C$2","v":"CONSTRUÇÃO DE PONTE SOBRE O RIO BARREIRO - SÃO JOÃO DO PACUÍ (COMUNIDADE BARREIRO)"},null,null,null,"DATA: ",{"$f":"$H$2","v":"OUTUBRO/2022"}]
[null,"SERVIÇO:  ",{"$f":"VLOOKUP(A183,ORÇAMENTO!$A$11:$I$50,3)","v":"ARMAÇÃO DE BLOCO, PILAR, VIGA OU SAPATA UTILIZANDO AÇO CA-50 DE 12,5 MM"},null,"SINAPI",{"$f":"VLOOKUP(A183,ORÇAMENTO!$A$11:$I$50,4)","v":96547},"UNIDADE: ",{"$f":"VLOOKUP(A183,ORÇAMENTO!$A$11:$I$50,5)","v":"KG"},"OK"]
[]
[null,"TIPO ITEM","CODIGO ITEM","DESCRIÇÃO ITEM","UNIDADE ITEM","COEFICIENTE","PRECO UNITARIO","CUSTO TOTAL"]
[null,"INSUMO","39017","ESPACADOR / DISTANCIADOR CIRCULAR COM ENTRADA LATERAL, EM PLASTICO, PARA VERGALHAO *4,2 A 12,5* MM, COBRIMENTO 20 MM","UN","0,3060000","0,21",{"$f":"ROUNDDOWN(F188*G188,2)","v":0.06}]
[null,"INSUMO","43132","ARAME RECOZIDO 16 BWG, D = 1,65 MM (0,016 KG/M) OU 18 BWG, D = 1,25 MM (0,01 KG/M)","KG","0,0250000","26,20",0.65]
[null,"COMPOSICAO","88238","AJUDANTE DE ARMADOR COM ENCARGOS COMPLEMENTARES","H","0,0220000","18,40",0.4]
[null,"COMPOSICAO","88245","ARMADOR COM ENCARGOS COMPLEMENTARES","H","0,0680000","24,98",1.69]
[null,"COMPOSICAO","92804","CORTE E DOBRA DE AÇO CA-50, DIÂMETRO DE 12,5 MM","KG","1,0000000","10,08",10.08]
[{"$nulls":7},0]
[null,"PRODUÇÃO DA EQUIPE",null,null,1,"CUSTO ",null,{"$f":"SUM(H188:H193)","v":12.879999999999999}]
[null,"TOTAL",{"$nulls":5},{"$f":"H194/E194","v":12.879999999999999}]
[null,"BDI                %",{"$nulls":5},{"$f":"1+$M$1","v":1.2069000000000001}]
[null,"TOTAL DO SERVIÇO - R$",{"$nulls":5},{"$f":"H195*H196","v":15.544872}]
[{"$f":"A183+1","v":13},"CODEVASF",null,null," COMPOSIÇÃO DE PREÇO UNITÁRIO",null,null,null,{"$f":"H207","v":2.17},{"$f":"H209","v":2.618973}]
[null,"OBRA:  ",{"$f":"$C$2","v":"CONSTRUÇÃO DE PONTE SOBRE O RIO BARREIRO - SÃO JOÃO DO PACUÍ (COMUNIDADE BARREIRO)"},null,null,null,"DATA: ",{"$f":"$H$2","v":"OUTUBRO/2022"}]
[null,"SERVIÇO:  ",{"$f":"VLOOKUP(A198,ORÇAMENTO!$A$11:$I$50,3)","v":"TRANSPORTE COM CAMINHÃO CARROCERIA 9T, EM VIA URBANA PAVIMENTADA (MAT. DIVERSOS - AÇO, MADEIRA, CIMENTO)"},null,"SINAPI",{"$f":"VLOOKUP(A198,ORÇAMENTO!$A$11:$I$50,4)","v":100947},"UNIDADE: ",{"$f":"VLOOKUP(A198,ORÇAMENTO!$A$11:$I$50,5)","v":"TXKM"},"OK"]
[]
[null,"TIPO ITEM","CODIGO ITEM","DESCRIÇÃO ITEM","UNIDADE ITEM","COEFICIENTE","PRECO UNITARIO","CUSTO TOTAL"]
[null,"COMPOSICAO","5824","CAMINHÃO TOCO, PBT 16.000 KG, CARGA ÚTIL MÁX. 10.685 KG, DIST. ENTRE EIXOS 4,8 M, POTÊNCIA 189 CV, INCLUSIVE CARROCERIA FIXA ABERTA DE MADEIRA P/ TRANSPORTE GERAL DE CARGA SECA, DIMEN. APROX. 2,5 X 7,00 X 0,50 M - CHP DIURNO. AF_06/2014","CHP","0,0093000","213,60",{"$f":"ROUNDDOWN(F203*G203,2)","v":1.98}]
[null,"COMPOSICAO","5826","CAMINHÃO TOCO, PBT 16.000 KG, CARGA ÚTIL MÁX. 10.685 KG, DIST. ENTRE EIXOS 4,8 M, POTÊNCIA 189 CV, INCLUSIVE CARROCERIA FIXA ABERTA DE MADEIRA P/ TRANSPORTE GERAL DE CARGA SECA, DIMEN. APROX. 2,5 X 7,00 X 0,50 M - CHI DIURNO. AF_06/2014","CHI","0,0040000","49,20",0.19]
[{"$nulls":7},0]
[null,"PRODUÇÃO DA EQUIPE",null,null,1,"CUSTO ",null,{"$f":"SUM(H203:H205)","v":2.17}]
[null,"TOTAL",{"$nulls":5},{"$f":"H206/E206","v":2.17}]
[null,"BDI                %",{"$nulls":5},{"$f":"1+$M$1","v":1.2069000000000001}]
[null,"TOTAL DO SERVIÇO - R$",{"$nulls":5},{"$f":"H207*H208","v":2.618973}]
[{"$f":"A198+1","v":14},"CODEVASF",null,null," COMPOSIÇÃO DE PREÇO UNITÁRIO",null,null,null,{"$f":"H219","v":2.7300000000000004},{"$f":"H221","v":3.2948370000000007}]
[null,"OBRA:  ",{"$f":"$C$2","v":"CONSTRUÇÃO DE PONTE SOBRE O RIO BARREIRO - SÃO JOÃO DO PACUÍ (COMUNIDADE BARREIRO)"},null,null,null,"DATA: ",{"$f":"$H$2","v":"OUTUBRO/2022"}]
[null,"SERVIÇO:  ",{"$f":"VLOOKUP(A210,ORÇAMENTO!$A$11:$I$50,3)","v":"TRANSPORTE COM CAMINHÃO CARROCERIA 9T, EM VIA URBANA EM LEITO NATURAL (MAT. DIVERSOS - AÇO, MADEIRA, CIMENTO)"},null,"SINAPI",{"$f":"VLOOKUP(A210,ORÇAMENTO!$A$11:$I$50,4)","v":100945},"UNIDADE: ",{"$f":"VLOOKUP(A210,ORÇAMENTO!$A$11:$I$50,5)","v":"TXKM"},"OK"]
[]
[null,"TIPO ITEM","CODIGO ITEM","DESCRIÇÃO ITEM","UNIDADE ITEM","COEFICIENTE","PRECO UNITARIO","CUSTO TOTAL"]
[null,"COMPOSICAO","5824","CAMINHÃO TOCO, PBT 16.000 KG, CARGA ÚTIL MÁX. 10.685 KG, DIST. ENTRE EIXOS 4,8 M, POTÊNCIA 189 CV, INCLUSIVE CARROCERIA FIXA ABERTA DE MADEIRA P/ TRANSPORTE GERAL DE CARGA SECA, DIMEN. APROX. 2,5 X 7,00 X 0,50 M - CHP DIURNO. AF_06/2014","CHP","0,0117000","213,60",{"$f":"ROUNDDOWN(F215*G215,2)","v":2.4900000000000002}]
[null,"COMPOSICAO","5826","CAMINHÃO TOCO, PBT 16.000 KG, CARGA ÚTIL MÁX. 10.685 KG, DIST. ENTRE EIXOS 4,8 M, POTÊNCIA 189 CV, INCLUSIVE CARROCERIA FIXA ABERTA DE MADEIRA P/ TRANSPORTE GERAL DE CARGA SECA, DIMEN. APROX. 2,5 X 7,00 X 0,50 M - CHI DIURNO. AF_06/2014","CHI","0,0050000","49,20",0.24]
[{"$nulls":7},0]
[null,"PRODUÇÃO DA EQUIPE",null,null,1,"CUSTO ",null,{"$f":"SUM(H215:H217)","v":2.7300000000000004}]
[null,"TOTAL",{"$nulls":5},{"$f":"H218/E218","v":2.7300000000000004}]
[null,"BDI                %",{"$nulls":5},{"$f":"1+$M$1","v":1.2069000000000001}]
[null,"TOTAL DO SERVIÇO - R$",{"$nulls":5},{"$f":"H219*H220","v":3.2948370000000007}]
[{"$f":"A210+1","v":15},"CODEVASF",null,null," COMPOSIÇÃO DE PREÇO UNITÁRIO",null,null,null,{"$f":"H231","v":0.75},{"$f":"H233","v":0.90517500000000006}]
[null,"OBRA:  ",{"$f":"$C$2","v":"CONSTRUÇÃO DE PONTE SOBRE O RIO BARREIRO - SÃO JOÃO DO PACUÍ (COMUNIDADE BARREIRO)"},null,null,null,"DATA: ",{"$f":"$H$2","v":"OUTUBRO/2022"}]
[null,"SERVIÇO:  ",{"$f":"VLOOKUP(A222,ORÇAMENTO!$A$11:$I$50,3)","v":"TRANSPORTE COM CAMINHÃO BASCULANTE, EM VIA URBANA PAVIMENTADA (MAT. DIVERSOS - AREIA, BRITA, SOLO, ENTULHO)"},null,"SINAPI",{"$f":"VLOOKUP(A222,ORÇAMENTO!$A$11:$I$50,4)","v":95427},"UNIDADE: ",{"$f":"VLOOKUP(A222,ORÇAMENTO!$A$11:$I$50,5)","v":"M3XKM"},"OK"]
[]
[null,"TIPO ITEM","CODIGO ITEM","DESCRIÇÃO ITEM","UNIDADE ITEM","COEFICIENTE","PRECO UNITARIO","CUSTO TOTAL"]
[null,"COMPOSICAO","89883","CAMINHÃO BASCULANTE 18 M3, COM CAVALO MECÂNICO DE CAPACIDADE MÁXIMA DE TRAÇÃO COMBINADO DE 45000 KG, POTÊNCIA 330 CV, INCLUSIVE SEMIREBOQUE COM CAÇAMBA METÁLICA - CHP DIURNO. AF_12/2014","CHP","0,0019000","368,62",{"$f":"ROUNDDOWN(F227*G227,2)","v":0.7}]
[null,"COMPOSICAO","89884","CAMINHÃO BASCULANTE 18 M3, COM CAVALO MECÂNICO DE CAPACIDADE MÁXIMA DE TRAÇÃO COMBINADO DE 45000 KG, POTÊNCIA 330 CV, INCLUSIVE SEMIREBOQUE COM CAÇAMBA METÁLICA - CHI DIURNO. AF_12/2014","CHI","0,0008000","73,22",0.05]
[{"$nulls":7},0]
[null,"PRODUÇÃO DA EQUIPE",null,null,1,"CUSTO ",null,{"$f":"SUM(H227:H229)","v":0.75}]
[null,"TOTAL",{"$nulls":5},{"$f":"H230/E230","v":0.75}]
[null,"BDI                %",{"$nulls":5},{"$f":"1+$M$1","v":1.2069000000000001}]
[null,"TOTAL DO SERVIÇO - R$",{"$nulls":5},{"$f":"H231*H232","v":0.90517500000000006}]
[]
[{"$f":"A222+1","v":16},"CODEVASF",null,null," COMPOSIÇÃO DE PREÇO UNITÁRIO",null,null,null,{"$f":"H243","v":2.31},{"$f":"H245","v":2.7879390000000002}]
[null,"OBRA:  ",{"$f":"$C$2","v":"CONSTRUÇÃO DE PONTE SOBRE O RIO BARREIRO - SÃO JOÃO DO PACUÍ (COMUNIDADE BARREIRO)"},null,null,null,"DATA: ",{"$f":"$H$2","v":"OUTUBRO/2022"}]
[null,"SERVIÇO:  ",{"$f":"VLOOKUP(A235,ORÇAMENTO!$A$11:$I$50,3)","v":"TRANSPORTE COM CAMINHÃO BASCULANTE, EM VIA URBANA EM LEITO NATURAL (MAT. DIVERSOS - AREIA, BRITA, SOLO, ENTULHO)"},null,"SINAPI",{"$f":"VLOOKUP(A235,ORÇAMENTO!$A$11:$I$50,4)","v":95425},"UNIDADE: ",{"$f":"VLOOKUP(A235,ORÇAMENTO!$A$11:$I$50,5)","v":"M3XKM"},"OK","21.05.2021"]
[]
[null,"TIPO ITEM","CODIGO ITEM","DESCRIÇÃO ITEM","UNIDADE ITEM","COEFICIENTE","PRECO UNITARIO","CUSTO TOTAL"]
[null,"COMPOSICAO","89883","CAMINHÃO BASCULANTE 18 M3, COM CAVALO MECÂNICO DE CAPACIDADE MÁXIMA DE TRAÇÃO COMBINADO DE 45000 KG, POTÊNCIA 330 CV, INCLUSIVE SEMIREBOQUE COM CAÇAMBA METÁLICA","CHP","0,0058000","368,62",{"$f":"ROUNDDOWN(F240*G240,2)","v":2.13},{"$f":"F240/0.035","v":0.16571428571428568}]
[null,"COMPOSICAO","89884","CAMINHÃO BASCULANTE 18 M3, COM CAVALO MECÂNICO DE CAPACIDADE MÁXIMA DE TRAÇÃO COMBINADO DE 45000 KG, POTÊNCIA 330 CV, INCLUSIVE SEMIREBOQUE COM CAÇAMBA METÁLICA","CHI","0,0025000","73,22",0.18,7.1428571428571425E-2]
[null,"PRODUÇÃO DA EQUIPE",null,null,1,"CUSTO ",null,{"$f":"SUM(H240:H241)","v":2.31}]
[null,"TOTAL",{"$nulls":5},{"$f":"H242/E242","v":2.31}]
[null,"BDI                %",{"$nulls":5},{"$f":"1+$M$1","v":1.2069000000000001}]
[null,"TOTAL DO SERVIÇO - R$",{"$nulls":5},{"$f":"H243*H244","v":2.7879390000000002}]
[{"$f":"A235+1","v":17},"CODEVASF",null,null," COMPOSIÇÃO DE PREÇO UNITÁRIO",null,null,null,{"$f":"H263","v":120.68},{"$f":"H265","v":145.64869200000001}]
[null,"OBRA:  ",{"$f":"$C$2","v":"CONSTRUÇÃO DE PONTE SOBRE O RIO BARREIRO - SÃO JOÃO DO PACUÍ (COMUNIDADE BARREIRO)"},null,null,null,"DATA: ",{"$f":"$H$2","v":"OUTUBRO/2022"}]
[null,"SERVIÇO:  ",{"$f":"VLOOKUP(A246,ORÇAMENTO!$A$11:$I$50,3)","v":"FABRICAÇÃO, MONTAGEM E DESMONTAGEM DE FÔRMA PARA ESTRUTURAS EM CHAPA DE MADEIRA COMPENSADA RESINADA, E=17 MM, 2 UTILIZAÇÕES"},null,"SINAPI",{"$f":"VLOOKUP(A246,ORÇAMENTO!$A$11:$I$50,4)","v":96539},"UNIDADE: ",{"$f":"VLOOKUP(A246,ORÇAMENTO!$A$11:$I$50,5)","v":"M2"},"OK"]
[]
[null,"TIPO ITEM","CODIGO ITEM","DESCRIÇÃO ITEM","UNIDADE ITEM","COEFICIENTE","PRECO UNITARIO","CUSTO TOTAL"]
[null,"INSUMO","1358","CHAPA/PAINEL DE MADEIRA COMPENSADA RESINADA (MADEIRITE RESINADO ROSA) PARA FORMA DE CONCRETO, DE 2200 x 1100 MM, E = 17 MM","M2","0,5930000","51,44",{"$f":"ROUNDDOWN(F251*G251,2)","v":30.5}]
[null,"INSUMO","2692","DESMOLDANTE PROTETOR PARA FORMAS DE MADEIRA, DE BASE OLEOSA EMULSIONADA EM AGUA","L","0,0100000","5,92",0.05]
[null,"INSUMO","4491","PONTALETE *7,5 X 7,5* CM EM PINUS, MISTA OU EQUIVALENTE DA REGIAO - BRUTA","M","2,2940000","8,39",19.239999999999998]
[null,"INSUMO","4517","SARRAFO *2,5 X 7,5* CM EM PINUS, MISTA OU EQUIVALENTE DA REGIAO - BRUTA","M","1,3590000","2,93",3.98]
[null,"INSUMO","5073","PREGO DE ACO POLIDO COM CABECA 17 X 24","KG","0,0350000","23,85",0.83]
[null,"INSUMO","20247","PREGO DE ACO POLIDO COM CABECA 15 X 15","KG","0,0070000","25,91",0.18]
[null,"INSUMO","40304","PREGO DE ACO POLIDO CABECA DUPLA 17 X 27","KG","0,0100000","28,88",0.28000000000000003]
[null,"COMPOSICAO","88239","AJUDANTE DE CARPINTEIRO COM ENCARGOS COMPLEMENTARES","H","0,7630000","19,96",15.22]
[null,"COMPOSICAO","88262","CARPINTEIRO DE FORMAS COM ENCARGOS COMPLEMENTARES","H","1,9380000","24,86",48.17]
[null,"COMPOSICAO","91692","SERRA CIRCULAR DE BANCADA COM MOTOR ELÉTRICO POTÊNCIA DE 5HP, COM COIFA PARA DISCO 10\"","CHP","0,0260000","28,39",0.73]
[null,"COMPOSICAO","91693","SERRA CIRCULAR DE BANCADA COM MOTOR ELÉTRICO POTÊNCIA DE 5HP, COM COIFA PARA DISCO 10\"","CHI","0,0550000","27,35",1.5]
[null,"PRODUÇÃO DA EQUIPE",null,null,1,"CUSTO ",null,{"$f":"SUM(H251:H261)","v":120.68}]
[null,"TOTAL",{"$nulls":5},{"$f":"H262/E262","v":120.68}]
[null,"BDI                %",{"$nulls":5},{"$f":"1+$M$1","v":1.2069000000000001}]
[null,"TOTAL DO SERVIÇO - R$",{"$nulls":5},{"$f":"H263*H264","v":145.64869200000001}]
[{"$f":"A246+1","v":18},"CODEVASF",null,null," COMPOSIÇÃO DE PREÇO UNITÁRIO",null,null,null,{"$f":"H277","v":688.42},{"$f":"H279","v":830.85409800000002}]
[null,"OBRA:  ",{"$f":"$C$2","v":"CONSTRUÇÃO DE PONTE SOBRE O RIO BARREIRO - SÃO JOÃO DO PACUÍ (COMUNIDADE BARREIRO)"},null,null,null,"DATA: ",{"$f":"$H$2","v":"OUTUBRO/2022"}]
[null,"SERVIÇO:  ",{"$f":"VLOOKUP(A266,ORÇAMENTO!$A$11:$I$50,3)","v":"CONCRETAGEM DE BLOCOS DE COROAMENTO E VIGAS BALDRAME, FCK 30 MPA, COM USO DE JERICA LANÇAMENTO, ADENSAMENTO E ACABAMENTO"},null,"SINAPI",{"$f":"VLOOKUP(A266,ORÇAMENTO!$A$11:$I$50,4)","v":96555},"UNIDADE: ",{"$f":"VLOOKUP(A266,ORÇAMENTO!$A$11:$I$50,5)","v":"M3"},"OK"]
[]
[null,"TIPO ITEM","CODIGO ITEM","DESCRIÇÃO ITEM","UNIDADE ITEM","COEFICIENTE","PRECO UNITARIO","CUSTO TOTAL"]
[null,"COMPOSICAO","88309","PEDREIRO COM ENCARGOS COMPLEMENTARES","H","2,3860000","25,14",{"$f":"ROUNDDOWN(F271*G271,2)","v":59.98}]
[null,"COMPOSICAO","88316","SERVENTE COM ENCARGOS COMPLEMENTARES","H","2,4500000","18,02",44.14]
[null,"COMPOSICAO","90586","VIBRADOR DE IMERSÃO, DIÂMETRO DE PONTEIRA 45MM, MOTOR ELÉTRICO TRIFÁSICO POTÊNCIA 2CV","CHP","0,3140000","1,32",0.41]
[null,"COMPOSICAO","90587","VIBRADOR DE IMERSÃO, DIÂMETRO DE PONTEIRA 45MM, MOTOR ELÉTRICO TRIFÁSICO POTÊNCIA 2CV","CHI","0,9110000","0,56",0.51]
[null,"COMPOSICAO","94972","CONCRETO FCK = 30MPA, TRAÇO 1:2,1:2,5 (EM MASSA SECA DE CIMENTO/ AREIA MÉDIA/ BRITA 1) - PREPARO MECÂNICO COM BETONEIRA","M3","1,1500000","507,29",583.38]
[null,"PRODUÇÃO DA EQUIPE",null,null,1,"CUSTO ",null,{"$f":"SUM(H271:H275)","v":688.42}]
[null,"TOTAL",{"$nulls":5},{"$f":"H276/E276","v":688.42}]
[null,"BDI                %",{"$nulls":5},{"$f":"1+$M$1","v":1.2069000000000001}]
[null,"TOTAL DO SERVIÇO - R$",{"$nulls":5},{"$f":"H277*H278","v":830.85409800000002}]
[{"$f":"A266+1","v":19},"CODEVASF",null,null," COMPOSIÇÃO DE PREÇO UNITÁRIO",null,null,null,{"$f":"H292","v":18.190000000000001},{"$f":"H294","v":21.953511000000002}]
[null,"OBRA:  ",{"$f":"$C$2","v":"CONSTRUÇÃO DE PONTE SOBRE O RIO BARREIRO - SÃO JOÃO DO PACUÍ (COMUNIDADE BARREIRO)"},null,null,null,"DATA: ",{"$f":"$H$2","v":"OUTUBRO/2022"}]
[null,"SERVIÇO:  ",{"$f":"VLOOKUP(A280,ORÇAMENTO!$A$11:$I$50,3)","v":"ARMAÇÃO DE PILAR OU VIGA DE UMA ESTRUTURA CONVENCIONAL DE CONCRETO ARMADO UTILIZANDO AÇO CA-50 DE 6,3 MM"},null,"SINAPI",{"$f":"VLOOKUP(A280,ORÇAMENTO!$A$11:$I$50,4)","v":92776},"UNIDADE: ",{"$f":"VLOOKUP(A280,ORÇAMENTO!$A$11:$I$50,5)","v":"KG"},"OK"]
[]
[null,"TIPO ITEM","CODIGO ITEM","DESCRIÇÃO ITEM","UNIDADE ITEM","COEFICIENTE","PRECO UNITARIO","CUSTO TOTAL"]
[null,"INSUMO","39017","ESPACADOR / DISTANCIADOR CIRCULAR COM ENTRADA LATERAL, EM PLASTICO, PARA VERGALHAO *4,2 A 12,5* MM, COBRIMENTO 20 MM","UN","0,9700000",0.21,{"$f":"ROUNDDOWN(F285*G285,2)","v":0.2}]
[null,"INSUMO","43132","ARAME RECOZIDO 16 BWG, D = 1,65 MM (0,016 KG/M) OU 18 BWG, D = 1,25 MM (0,01 KG/M)","KG","0,0250000",26.2,0.65]
[null,"COMPOSICAO","88238","AJUDANTE DE ARMADOR COM ENCARGOS COMPLEMENTARES","H","0,0280000",18.399999999999999,0.51]
[null,"COMPOSICAO","88245","ARMADOR COM ENCARGOS COMPLEMENTARES","H","0,1713000",24.98,4.2699999999999996]
[null,"COMPOSICAO",92801,"CORTE E DOBRA DE AÇO CA-50, DIÂMETRO DE 6,3 MM, UTILIZADO EM ESTRUTURAS DIVERSAS","KG","1,0000000",12.56,12.56]
[{"$nulls":7},0]
[null,"PRODUÇÃO DA EQUIPE",null,null,1,"CUSTO ",null,{"$f":"SUM(H285:H290)","v":18.190000000000001}]
[null,"TOTAL",{"$nulls":5},{"$f":"H291/E291","v":18.190000000000001}]
[null,"BDI                %",{"$nulls":5},{"$f":"1+$M$1","v":1.2069000000000001}]
[null,"TOTAL DO SERVIÇO - R$",{"$nulls":5},{"$f":"H292*H293","v":21.953511000000002}]
[{"$f":"A280+1","v":20},"CODEVASF",null,null," COMPOSIÇÃO DE PREÇO UNITÁRIO",null,null,null,{"$f":"H306","v":17.02},{"$f":"H308","v":20.541437999999999}]
[null,"OBRA:  ",{"$f":"$C$2","v":"CONSTRUÇÃO DE PONTE SOBRE O RIO BARREIRO - SÃO JOÃO DO PACUÍ (COMUNIDADE BARREIRO)"},null,null,null,"DATA: ",{"$f":"$H$2","v":"OUTUBRO/2022"}]
[null,"SERVIÇO:  ",{"$f":"VLOOKUP(A295,ORÇAMENTO!$A$11:$I$50,3)","v":"ARMAÇÃO DE PILAR OU VIGA DE UMA ESTRUTURA CONVENCIONAL DE CONCRETO ARMADO UTILIZANDO AÇO CA-50 DE 8 MM"},null,"SINAPI",{"$f":"VLOOKUP(A295,ORÇAMENTO!$A$11:$I$50,4)","v":92777},"UNIDADE: ",{"$f":"VLOOKUP(A295,ORÇAMENTO!$A$11:$I$50,5)","v":"KG"},"OK"]
[]
[null,"TIPO ITEM","CODIGO ITEM","DESCRIÇÃO ITEM","UNIDADE ITEM","COEFICIENTE","PRECO UNITARIO","CUSTO TOTAL"]
[null,"INSUMO","39017","ESPACADOR / DISTANCIADOR CIRCULAR COM ENTRADA LATERAL, EM PLASTICO, PARA VERGALHAO *4,2 A 12,5* MM, COBRIMENTO 20 MM","UN","0,7430000",{"$f":"G285","v":0.21},{"$f":"ROUNDDOWN(F300*G300,2)","v":0.15}]
[null,"INSUMO","43132","ARAME RECOZIDO 16 BWG, D = 1,65 MM (0,016 KG/M) OU 18 BWG, D = 1,25 MM (0,01 KG/M)","KG","0,0250000",{"$f":"G286","v":26.2},0.65]
[null,"COMPOSICAO","88238","AJUDANTE DE ARMADOR COM ENCARGOS COMPLEMENTARES","H","0,0209000",18.399999999999999,0.38]
[null,"COMPOSICAO","88245","ARMADOR COM ENCARGOS COMPLEMENTARES","H","0,1278000",24.98,3.19]
[null,"COMPOSICAO",92802,"CORTE E DOBRA DE AÇO CA-50, DIÂMETRO DE 8,0 MM, UTILIZADO EM ESTRUTURAS DIVERSAS","KG","1,0000000",12.65,12.65]
[null,"PRODUÇÃO DA EQUIPE",null,null,1,"CUSTO ",null,{"$f":"SUM(H300:H304)","v":17.02}]
[null,"TOTAL",{"$nulls":5},{"$f":"H305/E305","v":17.02}]
[null,"BDI                %",{"$nulls":5},{"$f":"1+$M$1","v":1.2069000000000001}]
[null,"TOTAL DO SERVIÇO - R$",{"$nulls":5},{"$f":"H306*H307","v":20.541437999999999}]
[{"$f":"A295+1","v":21},"CODEVASF",null,null," COMPOSIÇÃO DE PREÇO UNITÁRIO",null,null,null,{"$f":"H320","v":15.16},{"$f":"H322","v":18.296604000000002}]
[null,"OBRA:  ",{"$f":"$C$2","v":"CONSTRUÇÃO DE PONTE SOBRE O RIO BARREIRO - SÃO JOÃO DO PACUÍ (COMUNIDADE BARREIRO)"},null,null,null,"DATA: ",{"$f":"$H$2","v":"OUTUBRO/2022"}]
[null,"SERVIÇO:  ",{"$f":"VLOOKUP(A309,ORÇAMENTO!$A$11:$I$54,3)","v":"ARMAÇÃO DE PILAR OU VIGA DE UMA ESTRUTURA CONVENCIONAL DE CONCRETO ARMADO UTILIZANDO AÇO CA-50 DE 10 MM"},null,"SINAPI",{"$f":"VLOOKUP(A309,ORÇAMENTO!$A$11:$I$54,4)","v":92778},"UNIDADE: ",{"$f":"VLOOKUP(A309,ORÇAMENTO!$A$11:$I$54,5)","v":"KG"},"OK"]
[]
[null,"TIPO ITEM","CODIGO ITEM","DESCRIÇÃO ITEM","UNIDADE ITEM","COEFICIENTE","PRECO UNITARIO","CUSTO TOTAL"]
[null,"INSUMO","39017","ESPACADOR / DISTANCIADOR CIRCULAR COM ENTRADA LATERAL, EM PLASTICO, PARA VERGALHAO *4,2 A 12,5* MM, COBRIMENTO 20 MM","UN","0,5430000",{"$f":"G300","v":0.21},{"$f":"ROUNDDOWN(F314*G314,2)","v":0.11}]
[null,"INSUMO","43132","ARAME RECOZIDO 16 BWG, D = 1,65 MM (0,016 KG/M) OU 18 BWG, D = 1,25 MM (0,01 KG/M)","KG","0,0250000",{"$f":"G301","v":26.2},0.65]
[null,"COMPOSICAO","88238","AJUDANTE DE ARMADOR COM ENCARGOS COMPLEMENTARES","H","0,0156000",18.399999999999999,0.28000000000000003]
[null,"COMPOSICAO","88245","ARMADOR COM ENCARGOS COMPLEMENTARES","H","0,0956000",24.98,2.38]
[null,"COMPOSICAO",92803,"CORTE E DOBRA DE AÇO CA-50, DIÂMETRO DE 10,0 MM, UTILIZADO EM ESTRUTURAS DIVERSAS","KG","1,0000000",11.74,11.74]
[null,"PRODUÇÃO DA EQUIPE",null,null,1,"CUSTO ",null,{"$f":"SUM(H314:H318)","v":15.16}]
[null,"TOTAL",{"$nulls":5},{"$f":"H319/E319","v":15.16}]
[null,"BDI                %",{"$nulls":5},{"$f":"1+$M$1","v":1.2069000000000001}]
[null,"TOTAL DO SERVIÇO - R$",{"$nulls":5},{"$f":"H320*H321","v":18.296604000000002}]
[22,"CODEVASF",null,null," COMPOSIÇÃO DE PREÇO UNITÁRIO",null,null,null,{"$f":"H334","v":12.74},{"$f":"H336","v":15.375906000000001}]
[null,"OBRA:  ",{"$f":"$C$2","v":"CONSTRUÇÃO DE PONTE SOBRE O RIO BARREIRO - SÃO JOÃO DO PACUÍ (COMUNIDADE BARREIRO)"},null,null,null,"DATA: ",{"$f":"$H$2","v":"OUTUBRO/2022"}]
[null,"SERVIÇO:  ",{"$f":"VLOOKUP(A323,ORÇAMENTO!$A$11:$I$50,3)","v":"ARMAÇÃO DE PILAR OU VIGA DE UMA ESTRUTURA CONVENCIONAL DE CONCRETO ARMADO UTILIZANDO AÇO CA-50 DE 12,5 MM"},null,"SINAPI",{"$f":"VLOOKUP(A323,ORÇAMENTO!$A$11:$I$50,4)","v":92779},"UNIDADE: ",{"$f":"VLOOKUP(A323,ORÇAMENTO!$A$11:$I$50,5)","v":"KG"},"OK"]
[]
[null,"TIPO ITEM","CODIGO ITEM","DESCRIÇÃO ITEM","UNIDADE ITEM","COEFICIENTE","PRECO UNITARIO","CUSTO TOTAL"]
[null,"INSUMO","39017","ESPACADOR / DISTANCIADOR CIRCULAR COM ENTRADA LATERAL, EM PLASTICO, PARA VERGALHAO *4,2 A 12,5* MM, COBRIMENTO 20 MM","UN","0,3670000",{"$f":"G314","v":0.21},{"$f":"ROUNDDOWN(F328*G328,2)","v":7.0000000000000007E-2}]
[null,"INSUMO","43132","ARAME RECOZIDO 16 BWG, D = 1,65 MM (0,016 KG/M) OU 18 BWG, D = 1,25 MM (0,01 KG/M)","KG","0,0250000",{"$f":"G315","v":26.2},0.65]
[null,"COMPOSICAO","88238","AJUDANTE DE ARMADOR COM ENCARGOS COMPLEMENTARES","H","0,0114000",18.399999999999999,0.2]
[null,"COMPOSICAO","88245","ARMADOR COM ENCARGOS COMPLEMENTARES","H","0,0698000",24.98,1.74]
[null,"COMPOSICAO",92804,"CORTE E DOBRA DE AÇO CA-50, DIÂMETRO DE 12,5 MM, UTILIZADO EM ESTRUTURAS DIVERSAS","KG","1,0000000",10.08,10.08]
[null,"PRODUÇÃO DA EQUIPE",null,null,1,"CUSTO ",null,{"$f":"SUM(H328:H332)","v":12.74}]
[null,"TOTAL",{"$nulls":5},{"$f":"H333/E333","v":12.74}]
[null,"BDI                %",{"$nulls":5},{"$f":"1+$M$1","v":1.2069000000000001}]
[null,"TOTAL DO SERVIÇO - R$",{"$nulls":5},{"$f":"H334*H335","v":15.375906000000001}]
[23,"CODEVASF",null,null," COMPOSIÇÃO DE PREÇO UNITÁRIO",null,null,null,{"$f":"H348","v":13.35},{"$f":"H350","v":16.112114999999999}]
[null,"OBRA:  ",{"$f":"$C$2","v":"CONSTRUÇÃO DE PONTE SOBRE O RIO BARREIRO - SÃO JOÃO DO PACUÍ (COMUNIDADE BARREIRO)"},null,null,null,"DATA: ",{"$f":"$H$2","v":"OUTUBRO/2022"}]
[null,"SERVIÇO:  ",{"$f":"VLOOKUP(A337,ORÇAMENTO!$A$11:$I$50,3)","v":"ARMAÇÃO DE PILAR OU VIGA DE UMA ESTRUTURA CONVENCIONAL DE CONCRETO ARMADO UTILIZANDO AÇO CA-50 DE 20 MM"},null,{"$f":"E325","v":"SINAPI"},{"$f":"VLOOKUP(A337,ORÇAMENTO!$A$11:$I$50,4)","v":92781},"UNIDADE: ",{"$f":"VLOOKUP(A337,ORÇAMENTO!$A$11:$I$50,5)","v":"KG"},"OK"]
[]
[null,"TIPO ITEM","CODIGO ITEM","DESCRIÇÃO ITEM","UNIDADE ITEM","COEFICIENTE","PRECO UNITARIO","CUSTO TOTAL"]
[null,"INSUMO","39017","ESPACADOR / DISTANCIADOR CIRCULAR COM ENTRADA LATERAL, EM PLASTICO, PARA VERGALHAO *4,2 A 12,5* MM, COBRIMENTO 20 MM","UN","0,1130000",{"$f":"G328","v":0.21},{"$f":"ROUNDDOWN(F342*G342,2)","v":0.02}]
[null,"INSUMO","43132","ARAME RECOZIDO 16 BWG, D = 1,65 MM (0,016 KG/M) OU 18 BWG, D = 1,25 MM (0,01 KG/M)","KG","0,0250000",{"$f":"G329","v":26.2},0.65]
[null,"COMPOSICAO","88238","AJUDANTE DE ARMADOR COM ENCARGOS COMPLEMENTARES","H","0,0051000",18.399999999999999,0.09]
[null,"COMPOSICAO","88245","ARMADOR COM ENCARGOS COMPLEMENTARES","H","0,0312000",24.98,0.77]
[null,"COMPOSICAO",92806,"CORTE E DOBRA DE AÇO CA-50, DIÂMETRO DE 20,0 MM, UTILIZADO EM ESTRUTURAS DIVERSAS","KG","1,0000000",11.82,11.82]
[null,"PRODUÇÃO DA EQUIPE",null,null,1,"CUSTO ",null,{"$f":"SUM(H342:H346)","v":13.35}]
[null,"TOTAL",{"$nulls":5},{"$f":"H347/E347","v":13.35}]
[null,"BDI                %",{"$nulls":5},{"$f":"1+$M$1","v":1.2069000000000001}]
[null,"TOTAL DO SERVIÇO - R$",{"$nulls":5},{"$f":"H348*H349","v":16.112114999999999}]
[{"$f":"A337+1","v":24},"CODEVASF",null,null," COMPOSIÇÃO DE PREÇO UNITÁRIO",null,null,null,{"$f":"H365","v":163.07},{"$f":"H367","v":196.80918300000002}]
[null,"OBRA:  ",{"$f":"$C$2","v":"CONSTRUÇÃO DE PONTE SOBRE O RIO BARREIRO - SÃO JOÃO DO PACUÍ (COMUNIDADE BARREIRO)"},null,null,null,"DATA: ",{"$f":"$H$2","v":"OUTUBRO/2022"}]
[null,"SERVIÇO:  ",{"$f":"VLOOKUP(A351,ORÇAMENTO!$A$36:$I$51,3)","v":"FABRICAÇÃO DE FÔRMA PARA PILARES E VIGAS, EM CHAPA DE MADEIRA COMPENSADA RESINADA, E = 17 MM"},null,{"$f":"E339","v":"SINAPI"},{"$f":"VLOOKUP(A351,ORÇAMENTO!$A$36:$I$50,4)","v":92263},"UNIDADE: ",{"$f":"VLOOKUP(A351,ORÇAMENTO!$A$36:$I$50,5)","v":"M2"},"OK"]
[]
[null,"TIPO ITEM","CODIGO ITEM","DESCRIÇÃO ITEM","UNIDADE ITEM","COEFICIENTE","PRECO UNITARIO","CUSTO TOTAL"]
[null,"INSUMO","1358","CHAPA/PAINEL DE MADEIRA COMPENSADA RESINADA (MADEIRITE RESINADO ROSA) PARA FORMA DE CONCRETO, DE 2200 x 1100 MM, E = 17 MM","M2","1,3360000","51,44",{"$f":"ROUNDDOWN(F356*G356,2)","v":68.72}]
[null,"INSUMO","4491","PONTALETE *7,5 X 7,5* CM EM PINUS, MISTA OU EQUIVALENTE DA REGIAO - BRUTA","M","2,3080000","8,39",19.36]
[null,"INSUMO","4517","SARRAFO *2,5 X 7,5* CM EM PINUS, MISTA OU EQUIVALENTE DA REGIAO - BRUTA","M","9,2370000","2,93",27.06]
[null,"INSUMO","5068","PREGO DE ACO POLIDO COM CABECA 17 X 21","KG","0,2080000","23,40",4.8600000000000003]
[null,"COMPOSICAO","88239","AJUDANTE DE CARPINTEIRO COM ENCARGOS COMPLEMENTARES","H","0,2500000","19,96",4.99]
[null,"COMPOSICAO","88262","CARPINTEIRO DE FORMAS COM ENCARGOS COMPLEMENTARES","H","1,1800000","24,86",29.33]
[null,"COMPOSICAO","91692","SERRA CIRCULAR DE BANCADA COM MOTOR ELÉTRICO POTÊNCIA DE 5HP, COM COIFA PARA DISCO 10\"","CHP","0,0630000","28,39",1.78]
[null,"COMPOSICAO","91693","SERRA CIRCULAR DE BANCADA COM MOTOR ELÉTRICO POTÊNCIA DE 5HP, COM COIFA PARA DISCO 10\"","CHI","0,2550000","27,35",6.97]
[null,"PRODUÇÃO DA EQUIPE",null,null,1,"CUSTO ",null,{"$f":"SUM(H356:H363)","v":163.07}]
[null,"TOTAL",{"$nulls":5},{"$f":"H364/E364","v":163.07}]
[null,"BDI                %",{"$nulls":5},{"$f":"1+$M$1","v":1.2069000000000001}]
[null,"TOTAL DO SERVIÇO - R$",{"$nulls":5},{"$f":"H365*H366","v":196.80918300000002}]
[{"$f":"A351+1","v":25},"CODEVASF",null,null," COMPOSIÇÃO DE PREÇO UNITÁRIO",null,null,null,{"$f":"H383","v":55.84},{"$f":"H385","v":67.393296000000007}]
[null,"OBRA:  ",{"$f":"$C$2","v":"CONSTRUÇÃO DE PONTE SOBRE O RIO BARREIRO - SÃO JOÃO DO PACUÍ (COMUNIDADE BARREIRO)"},null,null,null,"DATA: ",{"$f":"$H$2","v":"OUTUBRO/2022"}]
[null,"SERVIÇO:  ",{"$f":"VLOOKUP(A368,ORÇAMENTO!$A$36:$I$51,3)","v":"MONTAGEM E DESMONTAGEM DE FÔRMA DE PILARES RETANGULARES E VIGAS, EM CHAPA DE MADEIRA COMPENSADA PLASTIFICADA"},null,{"$f":"E353","v":"SINAPI"},{"$f":"VLOOKUP(A368,ORÇAMENTO!$A$36:$I$50,4)","v":92431},"UNIDADE: ",{"$f":"VLOOKUP(A368,ORÇAMENTO!$A$36:$I$50,5)","v":"M2"},"OK"]
[]
[null,"TIPO ITEM","CODIGO ITEM","DESCRIÇÃO ITEM","UNIDADE ITEM","COEFICIENTE","PRECO UNITARIO","CUSTO TOTAL"]
[null,"INSUMO","2692","DESMOLDANTE PROTETOR PARA FORMAS DE MADEIRA, DE BASE OLEOSA EMULSIONADA EM AGUA","L","0,0040000","5,92",{"$f":"ROUNDDOWN(F373*G373,2)","v":0.02}]
[null,"INSUMO","40271","LOCACAO DE APRUMADOR METALICO DE PILAR, COM ALTURA E ANGULO REGULAVEIS, EXTENSAO DE *1,50* A *2,80* M","MES","0,1960000","13,00",2.54]
[null,"INSUMO","40275","LOCACAO DE VIGA SANDUICHE METALICA VAZADA PARA TRAVAMENTO DE PILARES, ALTURA DE *8* CM, LARGURA DE *6* CM E EXTENSAO DE 2 M","MES","0,3930000","20,00",7.86]
[null,"INSUMO","40287","LOCACAO DE BARRA DE ANCORAGEM DE 0,80 A 1,20 M DE EXTENSAO, COM ROSCA DE 5/8\", INCLUINDO PORCA E FLANGE","MES","0,7850000","5,00",3.92]
[null,"INSUMO","40304","PREGO DE ACO POLIDO CABECA DUPLA 17 X 27","KG","0,0190000","28,88",0.54]
[null,"COMPOSICAO","88239","AJUDANTE DE CARPINTEIRO COM ENCARGOS COMPLEMENTARES","H","0,1210000","19,96",2.41]
[null,"COMPOSICAO","88262","CARPINTEIRO DE FORMAS COM ENCARGOS COMPLEMENTARES","H","0,6610000","24,86",16.43]
[null,"COMPOSICAO","92264","FABRICAÇÃO DE FÔRMA PARA PILARES E ESTRUTURAS SIMILARES, EM CHAPA DE MADEIRA COMPENSADA PLASTIFICADA, E = 18 MM","M2","0,1050000","210,72",22.12]
[{"$nulls":7},0]
[null,"PRODUÇÃO DA EQUIPE",null,null,1,"CUSTO ",null,{"$f":"SUM(H373:H381)","v":55.84}]
[null,"TOTAL",{"$nulls":5},{"$f":"H382/E382","v":55.84}]
[null,"BDI                %",{"$nulls":5},{"$f":"1+$M$1","v":1.2069000000000001}]
[null,"TOTAL DO SERVIÇO - R$",{"$nulls":5},{"$f":"H383*H384","v":67.393296000000007}]
[{"$f":"A368+1","v":26},"CODEVASF",null,null," COMPOSIÇÃO DE PREÇO UNITÁRIO",null,null,null,{"$f":"H398","v":54.96},{"$f":"H400","v":66.331224000000006}]
[null,"OBRA:  ",{"$f":"$C$2","v":"CONSTRUÇÃO DE PONTE SOBRE O RIO BARREIRO - SÃO JOÃO DO PACUÍ (COMUNIDADE BARREIRO)"},null,null,null,"DATA: ",{"$f":"$H$2","v":"OUTUBRO/2022"}]
[null,"SERVIÇO:  ",{"$f":"VLOOKUP(A386,ORÇAMENTO!$A$36:$I$51,3)","v":"FABRICAÇÃO DE FÔRMA PARA LAJES, EM CHAPA DE MADEIRA COMPENSADA RESINADA, E = 17 MM"},null,"SICRO",{"$f":"VLOOKUP(A386,ORÇAMENTO!$A$36:$I$50,4)","v":92267},"UNIDADE: ",{"$f":"VLOOKUP(A386,ORÇAMENTO!$A$36:$I$50,5)","v":"M2"},"OK"]
[]
[null,"TIPO ITEM","CODIGO ITEM","DESCRIÇÃO ITEM","UNIDADE ITEM","COEFICIENTE","PRECO UNITARIO","CUSTO TOTAL"]
[null,"INSUMO","1358","CHAPA/PAINEL DE MADEIRA COMPENSADA RESINADA (MADEIRITE RESINADO ROSA) PARA FORMA DE CONCRETO, DE 2200 x 1100 MM, E = 17 MM","M2","1,0500000","51,44",{"$f":"ROUNDDOWN(F391*G391,2)","v":54.01}]
[null,"COMPOSICAO","88239","AJUDANTE DE CARPINTEIRO COM ENCARGOS COMPLEMENTARES","H","0,0050000","19,96",0.09]
[null,"COMPOSICAO","88262","CARPINTEIRO DE FORMAS COM ENCARGOS COMPLEMENTARES","H","0,0050000","24,86",0.12]
[null,"COMPOSICAO","91692","SERRA CIRCULAR DE BANCADA COM MOTOR ELÉTRICO POTÊNCIA DE 5HP, COM COIFA PARA DISCO 10\"","CHP","0,0050000","28,39",0.14000000000000001]
[null,"COMPOSICAO","91693","SERRA CIRCULAR DE BANCADA COM MOTOR ELÉTRICO POTÊNCIA DE 5HP, COM COIFA PARA DISCO 10\"","CHI","0,0220000","27,35",0.6]
[{"$nulls":7},0]
[null,"PRODUÇÃO DA EQUIPE",null,null,1,"CUSTO ",null,{"$f":"SUM(H391:H396)","v":54.96}]
[null,"TOTAL",{"$nulls":5},{"$f":"H397/E397","v":54.96}]
[null,"BDI                %",{"$nulls":5},{"$f":"1+$M$1","v":1.2069000000000001}]
[null,"TOTAL DO SERVIÇO - R$",{"$nulls":5},{"$f":"H398*H399","v":66.331224000000006}]
[{"$f":"A386+1","v":27},"CODEVASF",null,null," COMPOSIÇÃO DE PREÇO UNITÁRIO",null,null,null,{"$f":"H414","v":111.27000000000001},{"$f":"H416","v":134.29176300000003}]
[null,"OBRA:  ",{"$f":"$C$2","v":"CONSTRUÇÃO DE PONTE SOBRE O RIO BARREIRO - SÃO JOÃO DO PACUÍ (COMUNIDADE BARREIRO)"},null,null,null,"DATA: ",{"$f":"$H$2","v":"OUTUBRO/2022"}]
[null,"SERVIÇO:  ",{"$f":"VLOOKUP(A401,ORÇAMENTO!$A$11:$I$50,3)","v":"MONTAGEM E DESMONTAGEM DE FÔRMA DE LAJE MACIÇA, PÉ-DIREITO DUPLO, EM CHAPA DE MADEIRA COMPENSADA RESINADA, 2 UTILIZAÇÕES"},null,"SINAPI",{"$f":"VLOOKUP(A401,ORÇAMENTO!$A$11:$I$50,4)","v":92508},"UNIDADE: ",{"$f":"VLOOKUP(A401,ORÇAMENTO!$A$11:$I$50,5)","v":"M2"},"OK"]
[]
[null,"TIPO ITEM","CODIGO ITEM","DESCRIÇÃO ITEM","UNIDADE ITEM","COEFICIENTE","PRECO UNITARIO","CUSTO TOTAL"]
[null,"INSUMO","2692","DESMOLDANTE PROTETOR PARA FORMAS DE MADEIRA, DE BASE OLEOSA EMULSIONADA EM AGUA","L","0,0100000","5,92",{"$f":"ROUNDDOWN(F406*G406,2)","v":0.05}]
[null,"INSUMO","40270","VIGA DE ESCORAMAENTO H20, DE MADEIRA, PESO DE 5,00 A 5,20 KG/M, COM EXTREMIDADES PLASTICAS","M","0,0950000","113,18",10.75]
[null,"INSUMO","40291","LOCACAO DE TORRE METALICA COMPLETA PARA UMA CARGA DE 8 TF (80 KN)  E PE DIREITO DE 6 M, INCLUINDO MODULOS , DIAGONAIS, SAPATAS E FORCADOS","MES","0,0500000","697,69",34.880000000000003]
[null,"COMPOSICAO","88239","AJUDANTE DE CARPINTEIRO COM ENCARGOS COMPLEMENTARES","H","0,2180000","19,96",4.3499999999999996]
[null,"COMPOSICAO","88262","CARPINTEIRO DE FORMAS COM ENCARGOS COMPLEMENTARES","H","1,1880000","24,86",29.53]
[null,"COMPOSICAO","92267","FABRICAÇÃO DE FÔRMA PARA LAJES, EM CHAPA DE MADEIRA COMPENSADA RESINADA, E = 17 MM","M2","0,5770000","54,96",31.71]
[{"$nulls":7},0]
[null,"PRODUÇÃO DA EQUIPE",null,null,1,"CUSTO ",null,{"$f":"SUM(H406:H412)","v":111.27000000000001}]
[null,"TOTAL",{"$nulls":5},{"$f":"H413/E413","v":111.27000000000001}]
[null,"BDI                %",{"$nulls":5},{"$f":"1+$M$1","v":1.2069000000000001}]
[null,"TOTAL DO SERVIÇO - R$",{"$nulls":5},{"$f":"H414*H415","v":134.29176300000003}]
[{"$f":"A401+1","v":28},"CODEVASF",null,null," COMPOSIÇÃO DE PREÇO UNITÁRIO",null,null,null,{"$f":"H429","v":17.96},{"$f":"H431","v":21.675924000000002}]
[null,"OBRA:  ",{"$f":"$C$2","v":"CONSTRUÇÃO DE PONTE SOBRE O RIO BARREIRO - SÃO JOÃO DO PACUÍ (COMUNIDADE BARREIRO)"},null,null,null,"DATA: ",{"$f":"$H$2","v":"OUTUBRO/2022"}]
[null,"SERVIÇO:  ",{"$f":"ORÇAMENTO!C41","v":"ESCORAMENTO DE FÔRMAS DE VIGAS E LAJES EM MADEIRA NÃO APARELHADA, INCLUSO TRAVAMENTO, 4 UTILIZAÇÕES"},null,"SINAPI",{"$f":"ORÇAMENTO!D41","v":101792},"UNIDADE: ",{"$f":"ORÇAMENTO!E41","v":"M3"},"NÃO ATUALIZADO AUTOMATICAMENTE"]
[]
[null,"TIPO ITEM","CODIGO ITEM","DESCRIÇÃO ITEM","UNIDADE ITEM","COEFICIENTE","PRECO UNITARIO","CUSTO TOTAL"]
[null,"INSUMO","6193","TABUA  NAO  APARELHADA  *2,5 X 20* CM, EM MACARANDUBA, ANGELIM OU EQUIVALENTE DA REGIAO - BRUTA","M","0,1430000","31,00",{"$f":"ROUNDDOWN(F422*G422,2)","v":4.43}]
[null,"INSUMO","40304","PREGO DE ACO POLIDO CABECA DUPLA 17 X 27","KG","0,0110000","28,88",0.31]
[null,"COMPOSICAO","88239","AJUDANTE DE CARPINTEIRO COM ENCARGOS COMPLEMENTARES","H","0,0900000","19,96",1.79]
[null,"COMPOSICAO","88262","CARPINTEIRO DE FORMAS COM ENCARGOS COMPLEMENTARES","H","0,1270000","24,86",3.15]
[null,"COMPOSICAO","92273","FABRICAÇÃO DE ESCORAS DO TIPO PONTALETE, EM MADEIRA, PARA PÉ-DIREITO SIMPLES","M","0,5450000","15,20",8.2799999999999994]
[{"$nulls":7},0]
[null,"PRODUÇÃO DA EQUIPE",null,null,1,"CUSTO ",null,{"$f":"SUM(H422:H427)","v":17.96}]
[null,"TOTAL",{"$nulls":5},{"$f":"H428/E428","v":17.96}]
[null,"BDI                %",{"$nulls":5},{"$f":"1+$M$1","v":1.2069000000000001}]
[null,"TOTAL DO SERVIÇO - R$",{"$nulls":5},{"$f":"H429*H430","v":21.675924000000002}]
[{"$f":"A417+1","v":29},"CODEVASF",null,null," COMPOSIÇÃO DE PREÇO UNITÁRIO",null,null,null,{"$f":"H444","v":586.74},{"$f":"H446","v":708.13650600000005}]
[null,"OBRA:  ",{"$f":"$C$2","v":"CONSTRUÇÃO DE PONTE SOBRE O RIO BARREIRO - SÃO JOÃO DO PACUÍ (COMUNIDADE BARREIRO)"},null,null,null,"DATA: ",{"$f":"$H$2","v":"OUTUBRO/2022"}]
[null,"SERVIÇO:  ",{"$f":"ORÇAMENTO!C42","v":"CONCRETAGEM DE ESTRUTURAS (PAREDES E LAJES) COM CONCRETO USINADO BOMBEÁVEL FCK 30 MPA - LANÇAMENTO, ADENSAMENTO E ACABAMENTO"},null,"SINAPI",{"$f":"ORÇAMENTO!D42","v":"90861.a"},"UNIDADE: ",{"$f":"ORÇAMENTO!E42","v":"M3"},"NÃO ATUALIZADO AUTOMATICAMENTE"]
[]
[null,"TIPO ITEM","CODIGO ITEM","DESCRIÇÃO ITEM","UNIDADE ITEM","COEFICIENTE","PRECO UNITARIO","CUSTO TOTAL"]
[null,"COMPOSICAO","94972","CONCRETO FCK = 30MPA, TRAÇO 1:2,1:2,5 (EM MASSA SECA DE CIMENTO/ AREIA MÉDIA/ BRITA 1) - PREPARO MECÂNICO COM BETONEIRA","M3",1.0900000000000001,"507,29",{"$f":"ROUNDDOWN(F437*G437,2)","v":552.94000000000005}]
[null,"COMPOSICAO","88262","CARPINTEIRO DE FORMAS COM ENCARGOS COMPLEMENTARES","H","0,1630000",24.86,4.05]
[null,"COMPOSICAO","88309","PEDREIRO COM ENCARGOS COMPLEMENTARES","H","0,6530000",25.14,16.41]
[null,"COMPOSICAO","88316","SERVENTE COM ENCARGOS COMPLEMENTARES","H","0,7340000",18.02,13.22]
[null,"COMPOSICAO","90586","VIBRADOR DE IMERSÃO, DIÂMETRO DE PONTEIRA 45MM, MOTOR ELÉTRICO TRIFÁSICO 2 CV","CHP","0,0600000",1.32,7.0000000000000007E-2]
[null,"COMPOSICAO","90587","VIBRADOR DE IMERSÃO, DIÂMETRO DE PONTEIRA 45MM, MOTOR ELÉTRICO TRIFÁSICO 2 CV","CHI","0,1030000",0.56000000000000005,0.05]
[null,"PRODUÇÃO DA EQUIPE",null,null,1,"CUSTO ",null,{"$f":"SUM(H437:H442)","v":586.74}]
[null,"TOTAL",{"$nulls":5},{"$f":"H443/E443","v":586.74}]
[null,"BDI                %",{"$nulls":5},{"$f":"1+$M$1","v":1.2069000000000001}]
[null,"TOTAL DO SERVIÇO - R$",{"$nulls":5},{"$f":"H444*H445","v":708.13650600000005}]
[{"$f":"A432+1","v":30},"CODEVASF",null,null," COMPOSIÇÃO DE PREÇO UNITÁRIO",null,null,null,{"$f":"H457","v":108.7},{"$f":"H459","v":131.19003000000001}]
[null,"OBRA:  ",{"$f":"$C$2","v":"CONSTRUÇÃO DE PONTE SOBRE O RIO BARREIRO - SÃO JOÃO DO PACUÍ (COMUNIDADE BARREIRO)"},null,null,null,"DATA: ",{"$f":"$H$2","v":"OUTUBRO/2022"}]
[null,"SERVIÇO:  ",{"$f":"ORÇAMENTO!C43","v":"APARELHO DE APOIO EM NEOPRENE FRETADO, COM FRETAGEM DE AÇO 4MM INTERCALADAS COM ELASTÔMERO DE 11MM E REVESTIMENTO FINAL COM ELASTÔMERO DE 6MM"},null,"SINAPI",{"$f":"ORÇAMENTO!D43","v":"CPU.4"},"UNIDADE: ",{"$f":"ORÇAMENTO!E43","v":"DM3"},"NÃO ATUALIZADO AUTOMATICAMENTE"]
[]
[null,"TIPO ITEM","CODIGO ITEM","DESCRIÇÃO ITEM","UNIDADE ITEM","COEFICIENTE","PRECO UNITARIO","CUSTO TOTAL"]
[null,"INSUMO",12888,"APARELHO DE APOIO DE NEOPRENE FRETADO, 50 X 50 X 4,35 CM, COM FRETAGEM DE ACO DE 3 MM INTERCALADAS COM ELASTOMERO DE 12,5 MM E REVESTIMENTO FINAL COM ELASTOMERO DE 12,5 MM","DM3",1,104.77,{"$f":"ROUNDDOWN(F452*G452,2)","v":104.77}]
[null,"COMPOSICAO","88262","CARPINTEIRO DE FORMAS COM ENCARGOS COMPLEMENTARES","H",9.1911764705882346E-2,24.86,2.2799999999999998]
[null,"COMPOSICAO","88316","SERVENTE COM ENCARGOS COMPLEMENTARES","H",9.1911764705882346E-2,18.02,1.65]
[{"$nulls":7},0]
[null,"PRODUÇÃO DA EQUIPE",null,null,1,"CUSTO ",null,{"$f":"SUM(H452:H455)","v":108.7}]
[null,"TOTAL",{"$nulls":5},{"$f":"H456/E456","v":108.7}]
[null,"BDI                %",{"$nulls":5},{"$f":"1+$M$1","v":1.2069000000000001}]
[null,"TOTAL DO SERVIÇO - R$",{"$nulls":5},{"$f":"H457*H458","v":131.19003000000001}]
[{"$f":"A447+1","v":31},"CODEVASF",null,null," COMPOSIÇÃO DE PREÇO UNITÁRIO",null,null,null,{"$f":"H468","v":43.22},{"$f":"H470","v":52.162218000000003}]
[null,"OBRA:  ",{"$f":"$C$2","v":"CONSTRUÇÃO DE PONTE SOBRE O RIO BARREIRO - SÃO JOÃO DO PACUÍ (COMUNIDADE BARREIRO)"},null,null,null,"DATA: ",{"$f":"$H$2","v":"OUTUBRO/2022"}]
[null,"SERVIÇO:  ",{"$f":"VLOOKUP(A460,ORÇAMENTO!$A$39:$I$55,3)","v":"REATERRO MANUAL APILOADO COM SOQUETE"},null,"SINAPI",{"$f":"VLOOKUP(A460,ORÇAMENTO!$A$39:$I$55,4)","v":96995},"UNIDADE: ",{"$f":"VLOOKUP(A460,ORÇAMENTO!$A$39:$I$55,5)","v":"M3"},"OK"]
[]
[null,"TIPO ITEM","CODIGO ITEM","DESCRIÇÃO ITEM","UNIDADE ITEM","COEFICIENTE","PRECO UNITARIO","CUSTO TOTAL"]
[null,"COMPOSICAO","88316","SERVENTE COM ENCARGOS COMPLEMENTARES","H","2,3986000",18.02,{"$f":"ROUNDDOWN(F465*G465,2)","v":43.22}]
[{"$nulls":7},0]
[null,"PRODUÇÃO DA EQUIPE",null,null,1,"CUSTO ",null,{"$f":"SUM(H465:H466)","v":43.22}]
[null,"TOTAL",{"$nulls":5},{"$f":"H467/E467","v":43.22}]
[null,"BDI                %",{"$nulls":5},{"$f":"1+$M$1","v":1.2069000000000001}]
[null,"TOTAL DO SERVIÇO - R$",{"$nulls":5},{"$f":"H468*H469","v":52.162218000000003}]
[32,"CODEVASF",null,null," COMPOSIÇÃO DE PREÇO UNITÁRIO",null,null,null,{"$f":"H482","v":23.03},{"$f":"H484","v":27.794907000000002}]
[null,"OBRA:  ",{"$f":"$C$2","v":"CONSTRUÇÃO DE PONTE SOBRE O RIO BARREIRO - SÃO JOÃO DO PACUÍ (COMUNIDADE BARREIRO)"},null,null,null,"DATA: ",{"$f":"$H$2","v":"OUTUBRO/2022"}]
[null,"SERVIÇO:  ",{"$f":"VLOOKUP(A471,ORÇAMENTO!$A$39:$I$55,3)","v":"TUBO, PVC, SOLDÁVEL, DN 50MM - FORNECIMENTO E INSTALAÇÃO"},null,"SINAPI",{"$f":"VLOOKUP(A471,ORÇAMENTO!$A$39:$I$55,4)","v":89449},"UNIDADE: ",{"$f":"VLOOKUP(A471,ORÇAMENTO!$A$39:$I$55,5)","v":"M"},"OK"]
[]
[null,"TIPO ITEM","CODIGO ITEM","DESCRIÇÃO ITEM","UNIDADE ITEM","COEFICIENTE","PRECO UNITARIO","CUSTO TOTAL"]
[null,"INSUMO","9875","TUBO PVC, SOLDAVEL, DN 50 MM, PARA AGUA FRIA (NBR-5648)","M","1,0493000","20,52",{"$f":"ROUNDDOWN(F476*G476,2)","v":21.53}]
[null,"INSUMO","38383","LIXA D'AGUA EM FOLHA, GRAO 100","UN","0,0080000","2,41",0.01]
[null,"COMPOSICAO","88248","AUXILIAR DE ENCANADOR OU BOMBEIRO HIDRÁULICO COM ENCARGOS COMPLEMENTARES","H","0,0341000","19,54",0.66]
[null,"COMPOSICAO","88267","ENCANADOR OU BOMBEIRO HIDRÁULICO COM ENCARGOS COMPLEMENTARES","H","0,0341000","24,52",0.83]
[{"$nulls":7},0]
[null,"PRODUÇÃO DA EQUIPE",null,null,1,"CUSTO ",null,{"$f":"SUM(H476:H480)","v":23.03}]
[null,"TOTAL",{"$nulls":5},{"$f":"H481/E481","v":23.03}]
[null,"BDI                %",{"$nulls":5},{"$f":"1+$M$1","v":1.2069000000000001}]
[null,"TOTAL DO SERVIÇO - R$",{"$nulls":5},{"$f":"H482*H483","v":27.794907000000002}]
[{"$f":"A471+1","v":33},"CODEVASF",null,null," COMPOSIÇÃO DE PREÇO UNITÁRIO",null,null,null,{"$f":"H500","v":502.24999999999994},{"$f":"H502","v":606.165525}]
[null,"OBRA:  ",{"$f":"$C$2","v":"CONSTRUÇÃO DE PONTE SOBRE O RIO BARREIRO - SÃO JOÃO DO PACUÍ (COMUNIDADE BARREIRO)"},null,null,null,"DATA: ",{"$f":"$H$2","v":"OUTUBRO/2022"}]
[null,"SERVIÇO:  ",{"$f":"VLOOKUP(A485,ORÇAMENTO!$A$39:$I$55,3)","v":"GUARDA-CORPO DE AÇO GALVANIZADO DE 1,10M DE ALTURA, MONTANTES TUBULARES DE 1.1/2\u0094 ESPAÇADOS DE 1,20M, TRAVESSA SUPERIOR DE 2\u0094, GRADIL FORMADO POR BARRAS CHATAS EM FERRO DE 32X4,8MM, FIXADO COM CHUMBADOR MECÂNICO"},null,"SINAPI",{"$f":"VLOOKUP(A485,ORÇAMENTO!$A$39:$I$55,4)","v":99839},"UNIDADE: ",{"$f":"VLOOKUP(A485,ORÇAMENTO!$A$39:$I$55,5)","v":"M"},"OK"]
[]
[null,"TIPO ITEM","CODIGO ITEM","DESCRIÇÃO ITEM","UNIDADE ITEM","COEFICIENTE","PRECO UNITARIO","CUSTO TOTAL"]
[null,"INSUMO","546","BARRA DE ACO CHATA, RETANGULAR (QUALQUER BITOLA)","KG","9,2240000","9,79",{"$f":"ROUNDDOWN(F490*G490,2)","v":90.3}]
[null,"INSUMO","1332","CHAPA DE ACO GROSSA, ASTM A36, E = 3/8 \" (9,53 MM) 74,69 KG/M2","KG","0,8960000","11,32",10.14]
[null,"INSUMO","11002","ELETRODO REVESTIDO AWS - E6013, DIAMETRO IGUAL A 2,50 MM","KG","0,0710000","46,79",3.32]
[null,"INSUMO","11964","PARAFUSO DE ACO TIPO CHUMBADOR PARABOLT, DIAMETRO 3/8\", COMPRIMENTO 75 MM","UN","3,3330000","3,69",12.29]
[null,"INSUMO","21012","TUBO ACO GALVANIZADO COM COSTURA, CLASSE LEVE, DN 40 MM ( 1 1/2\"),  E = 3,00 MM,  *3,48* KG/M (NBR 5580)","M","0,9000000","65,40",58.86]
[null,"INSUMO","21013","TUBO ACO GALVANIZADO COM COSTURA, CLASSE LEVE, DN 50 MM ( 2\"),  E = 3,00 MM,  *4,40* KG/M (NBR 5580)","M","1,0290000","85,35",87.82]
[null,"COMPOSICAO","88251","AUXILIAR DE SERRALHEIRO COM ENCARGOS COMPLEMENTARES","H","4,7480000","20,04",95.14]
[null,"COMPOSICAO","88315","SERRALHEIRO COM ENCARGOS COMPLEMENTARES","H","5,7800000","24,98",144.38]
[{"$nulls":7},0]
[null,"PRODUÇÃO DA EQUIPE",null,null,1,"CUSTO ",null,{"$f":"SUM(H490:H498)","v":502.24999999999994}]
[null,"TOTAL",{"$nulls":5},{"$f":"H499/E499","v":502.24999999999994}]
[null,"BDI                %",{"$nulls":5},{"$f":"1+$M$1","v":1.2069000000000001}]
[null,"TOTAL DO SERVIÇO - R$",{"$nulls":5},{"$f":"H500*H501","v":606.165525}]
[{"$f":"A485+1","v":34},"CODEVASF",null,null," COMPOSIÇÃO DE PREÇO UNITÁRIO",null,null,null,{"$f":"H513","v":5.74},{"$f":"H515","v":6.9276060000000008}]
[null,"OBRA:  ",{"$f":"$C$2","v":"CONSTRUÇÃO DE PONTE SOBRE O RIO BARREIRO - SÃO JOÃO DO PACUÍ (COMUNIDADE BARREIRO)"},null,null,null,"DATA: ",{"$f":"$H$2","v":"OUTUBRO/2022"}]
[null,"SERVIÇO:  ",{"$f":"ORÇAMENTO!C52","v":"CARGA, MANOBRA E DESCARGA DE SOLOS E MATERIAIS EM GERAL (ENTULHO) EM CAMINHÃO BASCULANTE"},null,"SINAPI",{"$f":"ORÇAMENTO!D52","v":100990},"UNIDADE: ",{"$f":"ORÇAMENTO!E52","v":"M3"},"OK"]
[]
[null,"TIPO ITEM","CODIGO ITEM","DESCRIÇÃO ITEM","UNIDADE ITEM","COEFICIENTE","PRECO UNITARIO","CUSTO TOTAL"]
[null,"COMPOSICAO","5940","PÁ CARREGADEIRA SOBRE RODAS, POTÊNCIA LÍQUIDA 128 HP, CAPACIDADE DA CAÇAMBA 1,7 A 2,8 M3, PESO OPERACIONAL 11632 KG - CHP DIURNO. AF_06/2014","CHP","0,0056000","213,75",{"$f":"ROUNDDOWN(F508*G508,2)","v":1.19}]
[null,"COMPOSICAO","5942","PÁ CARREGADEIRA SOBRE RODAS, POTÊNCIA LÍQUIDA 128 HP, CAPACIDADE DA CAÇAMBA 1,7 A 2,8 M3, PESO OPERACIONAL 11632 KG - CHI DIURNO. AF_06/2014","CHI","0,0070000","81,69",0.56999999999999995]
[null,"COMPOSICAO","91386","CAMINHÃO BASCULANTE 10 M3, TRUCADO CABINE SIMPLES, PESO BRUTO TOTAL 23.000 KG, CARGA ÚTIL MÁXIMA 15.935 KG, DISTÂNCIA ENTRE EIXOS 4,80 M, POTÊNCIA 230 CV INCLUSIVE CAÇAMBA METÁLICA - CHP DIURNO. AF_06/2014","CHP","0,0132000","262,43",3.46]
[null,"COMPOSICAO","91387","CAMINHÃO BASCULANTE 10 M3, TRUCADO CABINE SIMPLES, PESO BRUTO TOTAL 23.000 KG, CARGA ÚTIL MÁXIMA 15.935 KG, DISTÂNCIA ENTRE EIXOS 4,80 M, POTÊNCIA 230 CV INCLUSIVE CAÇAMBA METÁLICA - CHI DIURNO. AF_06/2014","CHI","0,0092000","57,00",0.52]
[null,"PRODUÇÃO DA EQUIPE",null,null,1,"CUSTO ",null,{"$f":"SUM(H508:H511)","v":5.74}]
[null,"TOTAL",{"$nulls":5},{"$f":"H512/E512","v":5.74}]
[null,"BDI                %",{"$nulls":5},{"$f":"1+$M$1","v":1.2069000000000001}]
[null,"TOTAL DO SERVIÇO - R$",{"$nulls":5},{"$f":"H513*H514","v":6.9276060000000008}]

{"sheet":"BDI SERV","index":2,"n_rows":37,"n_cols":5,"rows_kept":37,"cut":false,"hidden":false,"merged":[[36,0,36,5],[3,1,4,1],[3,2,4,2],[0,1,2,4],[32,0,34,5],[28,0,28,5],[30,1,30,2],[31,1,31,2]]}
[null,"DETALHAMENTO DO BDI - SERVIÇOS"]
[]
[]
[null,"Item","Descrição dos Serviços","%","%"]
[null,null,null,"PV","CD"]
[]
[null,1,"ADMINISTRAÇÃO CENTRAL"," ",4]
[null,"1.1","ESCRITÓRIO CENTRAL"," "," "]
[null,"1.2","VIAGENS"," "," "]
[null,"1.3","OUTROS"," "," "]
[null," "," "," "," "]
[null,2,"IMPOSTOS E TAXAS",{"$f":"SUM(D13:D16)","v":5.65},{"$f":"SUM(E13:E16)","v":7.0600000000000005}]
[null,"2.1","ISS (*)",2,{"$f":"ROUND(D13*1.2515,2)","v":2.5}]
[null,"2.2","PIS",0.65,0.81]
[null,"2.3","Cofins",3,3.75]
[null,"2.4","CONTRIBUIÇÃO PREVIDENCIÁRIA SOBRE A RENDA BRUTA",0,0]
[]
[null,3,"TAXA DE RISCO"," ",{"$f":"SUM(E19:E22)","v":0.96}]
[null,"3.1","SEGURO",null,0.2]
[null,"3.2","RISCO",null,0.56000000000000005]
[null,"3.3","GARANTIA",null,0.2]
[]
[null,4,"DESPESAS FINANCEIRAS"," ",1.1100000000000001]
[]
[null,5,"LUCRO",null,7.3]
[]
[null," ","BDI - CALCULADO"," ",{"$f":"ROUND((((1+(E7+E18)/100)*(1+E23/100)*(1+E25/100)/(1-D12/100)-1)*100),2)","v":20.69}]
[]
["BDI = ((1+((AC+S+R+G)/100))x(1+DF/100)x(1+L/100)/(1-I/100)-1)*100"]
[]
[null,"BDI (CALCULADO):",null,{"$f":"ROUND((((1+((E7+E18)/100))*(1+E23/100)*(1+E25/100))/(1-D12/100)-1)*100,2)","v":20.69},"%"]
[null," "]
["(*) Conforme Lei Municipal nº 033/1997 que insituiu o Código Tributário do município "]
[]
[]
[]
["BDI EM CONFORMIDADE COM OS ACÓRDÃOS Nº 2369/2011 e ACÓRDÃO Nº 2.622/2013 - TCU - PLENÁRIO"]

{"sheet":"CRONOGRAMA","index":3,"n_rows":16,"n_cols":12,"rows_kept":16,"cut":false,"hidden":false,"merged":[[13,1,14,2],[15,1,19,11],[7,2,8,2],[11,2,12,2],[7,1,8,1],[11,1,12,1],[9,1,10,1],[9,2,10,2],[9,0,10,0],[7,0,8,0],[11,0,12,0],[0,1,0,11],[3,1,3,6],[5,0,6,0],[5,2,6,2],[1,1,2,1],[5,1,6,1],[1,2,2,4]]}
[null,"CRONOGRAMA FÍSICO-FINANCEIRO"]
[null,"OBRA: ",{"$f":"ORÇAMENTO!C5","v":"CONSTRUÇÃO DE PONTE SOBRE O RIO BARREIRO - SÃO JOÃO DO PACUÍ (COMUNIDADE BARREIRO)"},null,null,"VALOR:",{"$f":"ORÇAMENTO!I55","v":413134.13000000006}]
[{"$nulls":5},"PRAZO: ","120 DIAS "]
[]
[null,"ITEM","ETAPAS/DESCRIÇAO","FISICO/  FINANCEIRO","TOTAL    ETAPAS","MÊS 1","MÊS 2","MÊS 3","MÊS 4","MÊS 5","MÊS 6","TOTAL"]
["A",{"$f":"VLOOKUP(A6,ORÇAMENTO!$A$10:$I$55,2)","v":1},{"$f":"VLOOKUP(A6,ORÇAMENTO!$A$10:$I$55,3)","v":"SERVIÇOS PRELIMINARES "},"FISICO ",{"$f":"ROUND(E7/$G$2,4)","v":0.12620000000000001},0.4,0.2,0.2,0.2,null,null,{"$f":"SUM(F6:K6)","v":1}]
[null,null,null,"FINANCEIRO",{"$f":"ORÇAMENTO!I10","v":52126.68},{"$f":"ROUND($E$7*F6,2)","v":20850.669999999998},10425.34,{"$f":"ROUND($E$7*H6,2)","v":10425.34},10425.34,0,0,52126.69]
["B",{"$f":"VLOOKUP(A8,ORÇAMENTO!$A$10:$I$55,2)","v":2},{"$f":"VLOOKUP(A8,ORÇAMENTO!$A$10:$I$55,3)","v":"INFRAESTRUTURA E MESOESTRUTURA"},"FISICO ",{"$f":"ROUND(E9/$G$2,4)","v":0.53920000000000001},0.3,0.5,0.2,null,null,null,1]
[null,null,null,"FINANCEIRO",{"$f":"ORÇAMENTO!I17","v":222770.66},{"$f":"ROUND($E$9*F8,2)","v":66831.199999999997},111385.33,{"$f":"ROUND($E$9*H8,2)","v":44554.13},0,0,0,222770.66]
["D",{"$f":"VLOOKUP(A10,ORÇAMENTO!$A$10:$I$55,2)","v":3},{"$f":"VLOOKUP(A10,ORÇAMENTO!$A$10:$I$55,3)","v":"SUPERESTRUTURA E LAJES DE APROXIMAÇÃO"},"FISICO ",{"$f":"ROUND(E11/$G$2,4)","v":0.28439999999999999},null,null,0.3,0.7,null,null,{"$f":"SUM(F10:K10)","v":1}]
[null,null,null,"FINANCEIRO",{"$f":"ORÇAMENTO!I31","v":117514.85},{"$f":"ROUND($E$11*F10,2)","v":0},{"$f":"ROUND($E$11*G10,2)","v":0},35254.46,82260.399999999994,0,0,117514.85999999999]
["E",{"$f":"VLOOKUP(A12,ORÇAMENTO!$A$10:$I$55,2)","v":4},{"$f":"VLOOKUP(A12,ORÇAMENTO!$A$10:$I$55,3)","v":"SERVIÇOS DIVERSOS - ENCABEÇAMENTO, GUARDA-CORPO E LIMPEZA FINAL"},"FISICO ",{"$f":"ROUND(E13/$G$2,4)","v":5.0200000000000002E-2},null,null,null,1,null,null,1]
[null,null,null,"FINANCEIRO",{"$f":"ORÇAMENTO!I48","v":20721.940000000002},{"$f":"ROUND($E$13*F12,2)","v":0},0,{"$f":"ROUND($E$13*H12,2)","v":0},20721.939999999999,0,0,20721.939999999999]
[null,"TOTAL",null,"FISICO ",{"$f":"SUM(F14:K14)","v":1.0000000484104279},{"$f":"F15/E15","v":0.21223584214647187},{"$f":"G15/E15","v":0.29484533267682339},{"$f":"H15/E15","v":0.21841315797365857},{"$f":"I15/E15","v":0.27450571561347398},{"$f":"J15/E15","v":0},{"$f":"K15/E15","v":0},{"$f":"SUM(F14:K14)","v":1.0000000484104279}]
[null,null,null,"FINANCEIRO",{"$f":"E9+E7+E13+E11","v":413134.13},{"$f":"F9+F7+F13+F11","v":87681.87},121810.67,90233.93,113407.67999999999,0,0,{"$f":"SUM(F15:K15)","v":413134.14999999997}]
[null,"OBSERVAÇÕES:"]