{"text_format":"2","workbook":"xlsx","n_sheets":5,"sheets":["ORÇAMENTO","CPU","BDI SERV","BDI FORN","CRONOGRAMA"],"not_rendered":{"charts":0,"images":2,"macros":0,"external_links":0,"defined_names":5,"comments":1,"pivot_tables":0},"unopened":[],"bounds":{"document_bytes":16777216,"sheet_cells":100000,"run_cost":"one","rows_first":2000,"rows_last":500,"rows_between":2000,"halvings":0,"cell_chars":16384,"cell_head_chars":4096},"cells_cut":0,"cells_raw":0,"read":"whole","date_system":"1900"}

{"sheet":"ORÇAMENTO","index":0,"n_rows":37,"n_cols":11,"rows_kept":37,"cut":false,"hidden":false,"merged":[[6,6,6,7],[36,1,36,2],[0,0,7,0],[0,2,0,8],[1,2,1,8],[2,2,2,8],[4,2,4,8],[5,6,5,7],[18,6,18,7],[6,1,6,2]]}
["<---- NUMERAR SERVIÇOS PARA CPU",null,"Ministério do Desenvolvimento Regional"]
[null,null,"Companhia de Desenvolvimento dos Vales do São Francisco e do Parnaíba"]
[null,null,"1ª Superintendência Regional"]
[]
[null,"OBRA: "," PAVIMENTAÇÃO ASFÁLTICA EM PMF - COMUNIDADE LAGOA DOURADA (TAIOBEIRAS-MG)"]
[null,"DATA:","SETEMBRO DE 2022",null,null,null,"BDI Serviços:",null,{"$f":"'BDI SERV'!D31/100","v":0.21149999999999999}]
[null,"PRAZO DE EXECUÇÃO:     90 DIAS",{"$nulls":4},"BDI Serviços:",null,{"$f":"'BDI FORN'!D31/100","v":0.15}]
[null,"ITEM","DISCRIMINAÇÃO","REFER.","UNID.","QUANT.","P. UNITÁRIO","P.UNIT.C/ BDI","P. TOTAL",{"$f":"I37","v":294975.77},{"$f":"500000*0.955","v":477500}]
["A",1,"SERVIÇOS PRELIMINARES ",{"$nulls":5},{"$f":"SUM(I10:I14)","v":32228.73},{"$f":"I9/I37","v":0.10925890624846915}]
[1,"1.1","MOBILIZAÇÃO E DESMOBILIZAÇÃO","CPU.1","GL",1,{"$f":"VLOOKUP(A10,CPU!$A$1:$N$4636,9)","v":4675.8599999999997},{"$f":"VLOOKUP(A10,CPU!$A$1:$N$4636,10)","v":5664.8043899999993},{"$f":"ROUND(F10*H10,2)","v":5664.8},{"$f":"I10/$I$37","v":1.9204289220094248E-2}]
[2,"1.2","ADMINISTRAÇÃO LOCAL","CPU.2","GL",1,{"$f":"VLOOKUP(A11,CPU!$A$1:$N$4636,9)","v":17653.585358535856},{"$f":"VLOOKUP(A11,CPU!$A$1:$N$4636,10)","v":21387.318661866189},{"$f":"ROUND(F11*H11,2)","v":21387.32},{"$f":"I11/$I$37","v":7.2505345100039906E-2}]
[3,"1.3","CANTEIRO DE OBRAS","CPU.3","GL",1,{"$f":"VLOOKUP(A12,CPU!$A$1:$N$4636,9)","v":2758.5},{"$f":"VLOOKUP(A12,CPU!$A$1:$N$4636,10)","v":3341.9227500000002},{"$f":"ROUND(F12*H12,2)","v":3341.92}]
[4,"1.4","PLACA DE OBRA EM CHAPA DE AÇO GALVANIZADO","74209/001","M2",2,{"$f":"VLOOKUP(A13,CPU!$A$1:$N$4636,9)","v":594},{"$f":"VLOOKUP(A13,CPU!$A$1:$N$4636,10)","v":719.63099999999997},{"$f":"ROUND(F13*H13,2)","v":1439.26}]
[5,"1.5","LOCAÇÃO DE PAVIMENTAÇÃO",99064,"M",510,{"$f":"VLOOKUP(A14,CPU!$A$1:$N$4636,9)","v":0.64},{"$f":"VLOOKUP(A14,CPU!$A$1:$N$4636,10)","v":0.77536000000000005},{"$f":"ROUND(F14*H14,2)","v":395.43}]
["B",2,"PAVIMENTAÇÃO",{"$nulls":5},{"$f":"SUM(I16:I23)","v":67550.3},{"$f":"I15/I37","v":0.2290028770837686}]
[6,"2.1","ESCAVAÇÃO HORIZONTAL EM SOLO DE 1A CATEGORIA",101116,"M3",1190,{"$f":"VLOOKUP(A16,CPU!$A$1:$N$4636,9)","v":2.14},{"$f":"VLOOKUP(A16,CPU!$A$1:$N$4636,10)","v":2.5926100000000001},{"$f":"ROUND(F16*H16,2)","v":3085.21}]
[7,"2.2","CARGA, MANOBRA E DESCARGA DE SOLOS E MATERIAIS GRANULARES EM CAMINHÃO BASCULANTE - DESCARGA LIVRE",100976,"M3",1190,{"$f":"VLOOKUP(A17,CPU!$A$1:$N$4636,9)","v":4.3899999999999997},{"$f":"VLOOKUP(A17,CPU!$A$1:$N$4636,10)","v":5.3184849999999999},{"$f":"ROUND(F17*H17,2)","v":6329}]
[8,"2.3","REGULARIZAÇÃO E COMPACTAÇÃO DE SUBLEITO",100576,"M2",2970,{"$f":"VLOOKUP(A18,CPU!$A$1:$N$4636,9)","v":2.2200000000000002},{"$f":"VLOOKUP(A18,CPU!$A$1:$N$4636,10)","v":2.6895300000000004},7987.9]
[null,"2.4","CASCALHO DE CAVA","-","M3",595,"A CARGO DA PREFEITURA",null,0]
[9,"2.5","EXECUÇÃO E COMPACTAÇÃO DE BASE E OU SUB BASE PARA PAVIMENTAÇÃO EM CASCALHO - EXCLUSIVE SOLO, ESCAVAÇÃO, CARGA E TRANSPORTE.",96388,"M3",595,{"$f":"VLOOKUP(A20,CPU!$A$1:$N$4636,9)","v":10.57},{"$f":"VLOOKUP(A20,CPU!$A$1:$N$4636,10)","v":12.805555},7619.31]
[10,"2.6","IMPRIMAÇÃO COM ASFALTO DILUIDO CM-30",96401,"M2",2970,{"$f":"VLOOKUP(A21,CPU!$A$1:$N$4636,9)","v":1.0900000000000001},{"$f":"VLOOKUP(A21,CPU!$A$1:$N$4636,10)","v":1.320535},3921.99]
[11,"2.7","PINTURA DE LIGAÇÃO COM EMULSÃO ASFÁLTICA RR-2C",96402,"M2",2510,{"$f":"VLOOKUP(A22,CPU!$A$1:$N$4636,9)","v":0.87},{"$f":"VLOOKUP(A22,CPU!$A$1:$N$4636,10)","v":1.0540050000000001},2645.55]
[12,"2.8","EXECUÇÃO DE PAVIMENTO COM APLICAÇÃO DE PRÉ-MISTURADO A FRIO, CAMADA DE ROLAMENTO - EXCLUSIVE TRANSPORTE",100624,"M3",76,{"$f":"VLOOKUP(A23,CPU!$A$1:$N$4636,9)","v":390.57},{"$f":"VLOOKUP(A23,CPU!$A$1:$N$4636,10)","v":473.17555499999997},35961.339999999997]
["C",3,"TRANSPORTE DE MATERIAIS",{"$nulls":5},{"$f":"SUM(I25:I27)","v":19711.109999999997},{"$f":"I24/I37","v":6.6822810565084698E-2}]
[13,"3.1","TRANSPORTE COM CAMINHÃO BASCULANTE, EM VIA URBANA EM REVESTIMENTO PRIMÁRIO",95426,"M3XKM",2800.0000000000005,{"$f":"VLOOKUP(A25,CPU!$A$1:$N$4636,9,0)","v":1.0899999999999999},{"$f":"VLOOKUP(A25,CPU!$A$1:$N$4636,10)","v":1.3205349999999998},{"$f":"ROUND(F25*H25,2)","v":3697.5}]
[22,"3.2","TRANSPORTE COM CAMINHÃO BASCULANTE, EM VIA URBANA EM LEITO NATURAL",95425,"M3XKM",6550,{"$f":"VLOOKUP(A26,CPU!$A$1:$N$4636,9,0)","v":1.96},{"$f":"VLOOKUP(A26,CPU!$A$1:$N$4636,10,0)","v":2.3745400000000001},{"$f":"ROUND(F26*H26,2)","v":15553.24}]
[20,"3.3","TRANSPORTE COM CAMINHÃO BASCULANTE, EM VIA URBANA PAVIMENTADA",95427,"M3XKM",500.0010959999999,{"$f":"VLOOKUP(A27,CPU!$A$1:$N$4636,9,0)","v":0.76},{"$f":"VLOOKUP(A27,CPU!$A$1:$N$4636,10,0)","v":0.92074},{"$f":"ROUND(F27*H27,2)","v":460.37}]
["E",4,"OBRAS COMPLEMENTARES",{"$nulls":5},{"$f":"SUM(I29:I29)","v":68706.59},{"$f":"I28/I37","v":0.23292282616975621}]
[15,"4.1","GUIA (MEIO-FIO) E SARJETA CONJUGADOS DE CONCRETO, MOLDADA  IN LOCO  EM TRECHO RETO COM EXTRUSORA, 45 CM BASE (15 CM BASE DA GUIA + 30 CM BASE DA SARJETA) X 22 CM ALTURA",94267,"M",1020,{"$f":"VLOOKUP(A29,CPU!$A$1:$N$4636,9,0)","v":55.6},{"$f":"VLOOKUP(A29,CPU!$A$1:$N$4636,10,0)","v":67.359400000000008},{"$f":"ROUND(F29*H29,2)","v":68706.59}]
["F",5,"TRANSPORTE DE MATERIAL ASFÁLTICO (BDI DIFERENCIADO)",{"$nulls":5},{"$f":"SUM(I31:I32)","v":10098.15},{"$f":"I30/I37","v":3.4233828764986353E-2}]
[14,"5.1","TRANSPORTE COM CAMINHÃO TANQUE DE TRANSPORTE DE MATERIAL ASFÁLTICO DE 30000 L, EM VIA URBANA PAVIMENTADA",102331,"TXKM",13299.998400000002,{"$f":"VLOOKUP(A31,CPU!$A$1:$N$4636,9,0)","v":0.57000000000000006},{"$f":"VLOOKUP(A31,CPU!$A$1:$N$4636,10,0)","v":0.65549999999999997},{"$f":"ROUND(F31*H31,2)","v":8718.15}]
[21,"5.2","TRANSPORTE COM CAMINHÃO BASCULANTE, EM VIA URBANA PAVIMENTADA",95430,"TXKM",2499.9960000000001,{"$f":"VLOOKUP(A32,CPU!$A$1:$N$4636,9,0)","v":0.48},{"$f":"VLOOKUP(A32,CPU!$A$1:$N$4636,10,0)","v":0.55199999999999994},{"$f":"ROUND(F32*H32,2)","v":1380}]
["G",6,"FORNECIMENTOS - MATERIAL ASFÁLTICO (BDI DIFERENCIADO)",{"$nulls":5},{"$f":"SUM(I34:I36)","v":96680.890000000014},{"$f":"I33/I37","v":0.32775875116793496}]
[17,"6.1","AQUISIÇÃO DE ASFALTO DILUIDO DE PETROLEO CM-30 - EXCLUSIVE TRANSPORTE","CPU.4","T",3.5640000000000001,{"$f":"VLOOKUP(A34,CPU!$A$1:$N$4636,9,0)","v":6754.08},{"$f":"VLOOKUP(A34,CPU!$A$1:$N$4636,10,0)","v":7767.1919999999991},{"$f":"ROUND(F34*H34,2)","v":27682.27}]
[18,"6.2","AQUISIÇÃO DE EMULSAO ASFALTICA CATIONICA RR-2C - EXCLUSIVE TRANSPORTE","CPU.5","T",1.1294999999999999,{"$f":"VLOOKUP(A35,CPU!$A$1:$N$4636,9,0)","v":4222.34},{"$f":"VLOOKUP(A35,CPU!$A$1:$N$4636,10,0)","v":4855.6909999999998},{"$f":"ROUND(F35*H35,2)","v":5484.5}]
[19,"6.3","AQUISIÇÃO DE EMULSAO ASFALTICA CATIONICA RL-1C  - EXCLUSIVE TRANSPORTE","CPU.6","T",14.3108,{"$f":"VLOOKUP(A36,CPU!$A$1:$N$4636,9,0)","v":3859.3},{"$f":"VLOOKUP(A36,CPU!$A$1:$N$4636,10,0)","v":4438.1949999999997},{"$f":"ROUND(F36*H36,2)","v":63514.12}]
[null,"TOTAL GERAL DA OBRA COM BDI ",{"$nulls":6},{"$f":"SUM(I9,I15,I24,I28,I30,I33)","v":294975.77},{"$f":"I37/F21","v":99.318441077441079}," / m²"]

{"sheet":"CPU","index":1,"n_rows":333,"n_cols":17,"rows_kept":333,"cut":false,"hidden":false,"merged":[[277,0,287,0],[289,0,299,0],[289,1,289,3],[289,4,289,7],[290,2,290,5],[291,2,291,3],[292,1,292,7],[296,1,296,3],[296,5,296,6],[297,1,297,6],[298,1,298,6],[299,1,299,6],[277,1,277,3],[41,10,41,11],[42,2,42,5],[253,1,253,3],[253,5,253,6],[254,1,254,6],[255,1,255,6],[26,1,26,6],[27,1,27,6],[28,1,28,6],[95,1,95,6],[83,1,83,3],[83,4,83,7],[84,2,84,5],[85,2,85,3],[86,1,86,7],[92,1,92,3],[92,5,92,6],[93,1,93,6],[94,1,94,6],[30,1,30,3],[30,4,30,7],[39,1,39,6],[41,1,41,3],[41,4,41,7],[30,10,30,11],[31,2,31,5],[32,2,32,3],[33,1,33,7],[31,8,32,9],[36,1,36,3],[36,5,36,6],[37,1,37,6],[38,1,38,6],[10,1,10,6],[11,1,11,6],[13,1,13,3],[13,4,13,7],[13,10,13,11],[14,2,14,5],[15,2,15,3],[16,1,16,7],[25,1,25,3],[25,5,25,6],[14,8,15,9],[0,1,0,3],[0,4,0,7],[0,10,0,11],[1,2,1,5],[2,2,2,3],[3,1,3,7],[8,1,8,3],[8,5,8,6],[9,1,9,6],[1,10,1,11],[43,2,43,3],[44,1,44,7],[53,1,53,3],[53,5,53,6],[54,1,54,6],[55,1,55,6],[56,1,56,6],[58,10,58,11],[59,2,59,5],[58,1,58,3],[58,4,58,7],[60,2,60,3],[61,1,61,7],[65,1,65,3],[65,5,65,6],[66,1,66,6],[67,1,67,6],[68,1,68,6],[70,10,70,11],[71,2,71,5],[70,1,70,3],[70,4,70,7],[72,2,72,3],[73,1,73,7],[78,1,78,3],[78,5,78,6],[79,1,79,6],[80,1,80,6],[81,1,81,6],[97,10,97,11],[98,2,98,5],[97,1,97,3],[97,4,97,7],[172,10,172,11],[99,2,99,3],[100,1,100,7],[110,1,110,3],[110,5,110,6],[153,10,153,11],[111,1,111,6],[112,1,112,6],[113,1,113,6],[134,1,134,3],[134,4,134,7],[134,10,134,11],[135,2,135,5],[136,2,136,3],[137,1,137,7],[148,1,148,3],[148,5,148,6],[149,1,149,6],[150,1,150,6],[151,1,151,6],[153,1,153,3],[153,4,153,7],[154,2,154,5],[156,1,156,7],[177,8,177,9],[219,10,219,11],[220,2,220,5],[221,2,221,3],[222,1,222,7],[287,1,287,6],[285,1,285,6],[286,1,286,6],[191,1,191,6],[192,1,192,6],[227,1,227,3],[227,5,227,6],[228,1,228,6],[229,1,229,6],[258,10,258,11],[258,1,258,3],[189,1,189,3],[189,5,189,6],[219,0,230,0],[245,0,256,0],[245,1,245,3],[245,4,245,7],[246,2,246,5],[247,2,247,3],[248,1,248,7],[190,1,190,6],[167,1,167,3],[167,5,167,6],[172,4,172,7],[172,0,192,0],[233,2,233,5],[234,2,234,3],[235,1,235,7],[240,1,240,3],[240,5,240,6],[241,1,241,6],[242,1,242,6],[243,1,243,6],[232,0,243,0],[173,2,173,5],[174,2,174,3],[175,1,175,7],[168,1,168,6],[169,1,169,6],[170,1,170,6],[258,4,258,7],[256,1,256,6],[194,1,194,3],[194,4,194,7],[195,2,195,5],[196,2,196,3],[197,1,197,7],[214,1,214,3],[214,5,214,6],[215,1,215,6],[216,1,216,6],[217,1,217,6],[232,1,232,3],[232,4,232,7],[0,0,12,0],[13,0,29,0],[30,0,40,0],[41,0,57,0],[58,0,69,0],[70,0,82,0],[97,0,114,0],[134,0,152,0],[153,0,171,0],[83,0,95,0],[132,1,132,6],[115,0,132,0],[275,1,275,6],[230,1,230,6],[278,2,278,5],[279,2,279,3],[280,1,280,7],[284,1,284,3],[284,5,284,6],[277,4,277,7],[258,0,275,0],[260,2,260,3],[261,1,261,7],[272,1,272,3],[272,5,272,6],[273,1,273,6],[274,1,274,6],[259,2,259,5],[219,1,219,3],[219,4,219,7],[172,1,172,3],[115,1,115,3],[115,4,115,7],[155,2,155,3],[116,2,116,5],[117,2,117,3],[118,1,118,7],[129,1,129,3],[129,5,129,6],[130,1,130,6],[131,1,131,6],[323,0,332,0],[323,1,323,3],[323,4,323,7],[324,2,324,5],[325,2,325,3],[326,1,326,7],[329,1,329,3],[329,5,329,6],[330,1,330,6],[331,1,331,6],[332,1,332,6],[301,0,310,0],[312,0,321,0],[312,1,312,3],[312,4,312,7],[313,2,313,5],[314,2,314,3],[315,1,315,7],[318,1,318,3],[318,5,318,6],[319,1,319,6],[320,1,320,6],[321,1,321,6],[301,1,301,3],[301,4,301,7],[302,2,302,5],[303,2,303,3],[304,1,304,7],[307,1,307,3],[307,5,307,6],[308,1,308,6],[309,1,309,6],[310,1,310,6]]}
[1,"CODEVASF",null,null," COMPOSIÇÃO DE PREÇO UNITÁRIO",null,null,null,{"$f":"H10","v":4675.8599999999997},{"$f":"H12","v":5664.8043899999993},"BDI CALCULADO:",null,{"$f":"ORÇAMENTO!I6","v":0.21149999999999999}]
[null,"OBRA:  ",{"$f":"ORÇAMENTO!C5","v":" PAVIMENTAÇÃO ASFÁLTICA EM PMF - COMUNIDADE LAGOA DOURADA (TAIOBEIRAS-MG)"},null,null,null,"DATA: ",{"$f":"ORÇAMENTO!C6","v":"SETEMBRO DE 2022"},null,null,"BDI DIFERENCIADO:",null,{"$f":"'BDI FORN'!D31/100","v":0.15}]
[null,"SERVIÇO:  ",{"$f":"VLOOKUP(A1,ORÇAMENTO!A10:I29,3)","v":"MOBILIZAÇÃO E DESMOBILIZAÇÃO"},null,"Referência:",{"$f":"VLOOKUP(A1,ORÇAMENTO!A10:I29,4)","v":"CPU.1"},"UNIDADE: ",{"$f":"VLOOKUP(A1,ORÇAMENTO!A10:I29,5)","v":"GL"}]
[]
[null,"TIPO ITEM","CODIGO ITEM","DESCRIÇÃO ITEM","UNIDADE ITEM","COEFICIENTE","PRECO UNITARIO","CUSTO TOTAL"]
[null,"COMPOSICAO",89876,"CAMINHÃO BASCULANTE 14 M3, COM CAVALO MECÂNICO DE CAPACIDADE MÁXIMA DE TRAÇÃO COMBINADO DE 36000 KG, POTÊNCIA 286 CV, INCLUSIVE SEMIREBOQUE COM CAÇAMBA METÁLICA","CHP DIURNO.",12,337.91,{"$f":"ROUNDDOWN(F6*G6,2)","v":4054.92}]
[null,"COMPOSICAO",89877,"CAMINHÃO BASCULANTE 14 M3, COM CAVALO MECÂNICO DE CAPACIDADE MÁXIMA DE TRAÇÃO COMBINADO DE 36000 KG, POTÊNCIA 286 CV, INCLUSIVE SEMIREBOQUE COM CAÇAMBA METÁLICA","CHI DIURNO.",6,67.45,{"$f":"ROUNDDOWN(F7*G7,2)","v":404.7}]
[null,"COMPOSIÇÃO",88316,"SERVENTE COM ENCARGOS COMPLEMENTARES","H",12,18.02,216.24]
[null,"PRODUÇÃO DA EQUIPE",null,null,1,"CUSTO ",null,{"$f":"SUM(H6:H8)","v":4675.8599999999997}]
[null,"TOTAL",{"$nulls":5},{"$f":"H9/E9","v":4675.8599999999997}]
[null,"BDI                %",{"$nulls":5},{"$f":"1+$M$1","v":1.2115}]
[null,"TOTAL DO SERVIÇO - R$",{"$nulls":5},{"$f":"H10*H11","v":5664.8043899999993}]
[]
[{"$f":"A1+1","v":2},"CODEVASF",null,null," COMPOSIÇÃO DE PREÇO UNITÁRIO",null,null,null,{"$f":"H27","v":17653.585358535856},{"$f":"H29","v":21387.318661866189}]
[null,"OBRA:  ",{"$f":"$C$2","v":" PAVIMENTAÇÃO ASFÁLTICA EM PMF - COMUNIDADE LAGOA DOURADA (TAIOBEIRAS-MG)"},null,null,null,"DATA: ",{"$f":"$H$2","v":"SETEMBRO DE 2022"}]
[null,"SERVIÇO:  ",{"$f":"VLOOKUP(A14,ORÇAMENTO!$A$10:$I$29,3)","v":"ADMINISTRAÇÃO LOCAL"},null,"SINAPI","CPU","UNIDADE: ",{"$f":"VLOOKUP(A14,ORÇAMENTO!$A$10:$I$29,5)","v":"GL"}]
[]
[null,"TIPO ITEM","CODIGO ITEM","DESCRIÇÃO ITEM","UNIDADE ITEM","COEFICIENTE","PRECO UNITARIO","CUSTO TOTAL"]
[null,"INSUMO",14250,"ENERGIA ELÉTRICA","kwh",60,0.75,{"$f":"ROUNDDOWN(F19*G19,2)","v":45}]
[null,"INSUMO",44480,"TARIFA \"A\" ENTRE 0 E 20 M³ - FORNECIMENTO D'ÁGUA","m³",6,14.19,85.14]
[null,"COTAÇÃO","MERC.","TELEFONE (PLANO CONTROLE)","UNID",2,60,120]
[null,"COMPOSICAO",90777,"Engenheiro Civil Júnior com encargos complementares","H",20,103.51,2070.1999999999998]
[null,"COMPOSICAO",90776,"Encarregado Geral com encargos complementares","H",60,39.799999999999997,2388]
[null,"COMPOSICAO",88321,"Tecnico de Laboratório com encargos complementares","H",20,38.64,772.8]
[null,"COMPOSICAO",90772,"Auxiliar de escritório com encargos complementares","H",20,20.14,402.8]
[null,"PRODUÇÃO DA EQUIPE",null,null,0.33329999999999999,"CUSTO ",null,{"$f":"SUM(H19:H25)","v":5883.9400000000005}]
[null,"TOTAL",{"$nulls":5},{"$f":"H26/E26","v":17653.585358535856}]
[null,"BDI                %",{"$nulls":5},{"$f":"1+$M$1","v":1.2115}]
[null,"TOTAL DO SERVIÇO - R$",{"$nulls":5},{"$f":"H27*H28","v":21387.318661866189}]
[]
[{"$f":"A14+1","v":3},"CODEVASF",null,null," COMPOSIÇÃO DE PREÇO UNITÁRIO",null,null,null,{"$f":"H38","v":2758.5},{"$f":"H40","v":3341.9227500000002}]
[null,"OBRA:  ",{"$f":"$C$2","v":" PAVIMENTAÇÃO ASFÁLTICA EM PMF - COMUNIDADE LAGOA DOURADA (TAIOBEIRAS-MG)"},null,null,null,"DATA: ",{"$f":"$H$2","v":"SETEMBRO DE 2022"}]
[null,"SERVIÇO:  ",{"$f":"VLOOKUP(A31,ORÇAMENTO!$A$10:$I$29,3)","v":"CANTEIRO DE OBRAS"},null,"SINAPI",{"$f":"VLOOKUP(A31,ORÇAMENTO!$A$10:$I$29,4)","v":"CPU.3"},"UNIDADE: ",{"$f":"VLOOKUP(A31,ORÇAMENTO!$A$10:$I$29,5)","v":"GL"}]
[]
[null,"TIPO ITEM","CODIGO ITEM","DESCRIÇÃO ITEM","UNIDADE ITEM","COEFICIENTE","PRECO UNITARIO","CUSTO TOTAL"]
[null,"INSUMO",10775,"ALUGUEL DE IMÓVEL OU CONTEINER QUE ATENDA AOS REQUISITOS MÍNIMOS PARA INSTALAÇÃO DO CANTEIRO DE OBRAS","MÊS",3,919.5,{"$f":"ROUNDDOWN(F36*G36,2)","v":2758.5}]
[null,"PRODUÇÃO DA EQUIPE",null,null,1,"CUSTO ",null,{"$f":"SUM(H36:H36)","v":2758.5}]
[null,"TOTAL",{"$nulls":5},{"$f":"H37/E37","v":2758.5}]
[null,"BDI                %",{"$nulls":5},{"$f":"1+$M$1","v":1.2115}]
[null,"TOTAL DO SERVIÇO - R$",{"$nulls":5},{"$f":"H38*H39","v":3341.9227500000002}]
[]
[{"$f":"A31+1","v":4},"CODEVASF",null,null," COMPOSIÇÃO DE PREÇO UNITÁRIO",null,null,null,{"$f":"H55","v":594},{"$f":"H57","v":719.63099999999997}]
[null,"OBRA:  ",{"$f":"$C$2","v":" PAVIMENTAÇÃO ASFÁLTICA EM PMF - COMUNIDADE LAGOA DOURADA (TAIOBEIRAS-MG)"},null,null,null,"DATA: ",{"$f":"$H$2","v":"SETEMBRO DE 2022"}]
[null,"SERVIÇO:  ",{"$f":"VLOOKUP(A42,ORÇAMENTO!$A$10:$I$29,3)","v":"PLACA DE OBRA EM CHAPA DE AÇO GALVANIZADO"},null,"SINAPI",{"$f":"VLOOKUP(A42,ORÇAMENTO!$A$10:$I$29,4)","v":"74209/001"},"UNIDADE: ",{"$f":"VLOOKUP(A42,ORÇAMENTO!$A$10:$I$29,5)","v":"M2"}]
[]
[null,"TIPO ITEM","CODIGO ITEM","DESCRIÇÃO ITEM","UNIDADE ITEM","COEFICIENTE","PRECO UNITARIO","CUSTO TOTAL"]
[null,"INSUMO","4417","SARRAFO DE MADEIRA NAO APARELHADA *2,5 X 7* CM, MACARANDUBA, ANGELIM OU EQUIVALENTE DA REGIAO","M","1,0000000",12.45,{"$f":"ROUNDDOWN(F47*G47,2)","v":12.45}]
[null,"INSUMO","4491","PONTALETE DE MADEIRA NAO APARELHADA *7,5 X 7,5* CM (3 X 3 \") PINUS, MISTA OU EQUIVALENTE DA REGIAO","M","4,0000000",8.57,34.28]
[null,"INSUMO","4813","PLACA DE OBRA (PARA CONSTRUCAO CIVIL) EM CHAPA GALVANIZADA *N. 22*, ADESIVADA, DE *2,0 X 1,125* M","M2","1,0000000",480,480]
[null,"INSUMO","5075","PREGO DE ACO POLIDO COM CABECA 18 X 30 (2 3/4 X 10)","KG","0,1100000",23.4,2.57]
[null,"COMPOSICAO","88262","CARPINTEIRO DE FORMAS COM ENCARGOS COMPLEMENTARES","H","1,0000000",24.86,24.86]
[null,"COMPOSICAO","88316","SERVENTE COM ENCARGOS COMPLEMENTARES","H","2,0000000",18.02,36.04]
[null,"COMPOSICAO","94962","CONCRETO MAGRO PARA LASTRO, TRAÇO 1:4,5:4,5 (CIMENTO/ AREIA MÉDIA/ BRITA 1)  - PREPARO MECÂNICO COM BETONEIRA 400 L","M3","0,0100000",380.33,3.8]
[null,"PRODUÇÃO DA EQUIPE",null,null,1,"CUSTO ",null,{"$f":"SUM(H47:H53)","v":594}]
[null,"TOTAL",{"$nulls":5},{"$f":"H54/E54","v":594}]
[null,"BDI                %",{"$nulls":5},{"$f":"1+$M$1","v":1.2115}]
[null,"TOTAL DO SERVIÇO - R$",{"$nulls":5},{"$f":"H55*H56","v":719.63099999999997}]
[]
[{"$f":"A42+1","v":5},"CODEVASF",null,null," COMPOSIÇÃO DE PREÇO UNITÁRIO",null,null,null,{"$f":"H67","v":0.64},{"$f":"H69","v":0.77536000000000005}]
[null,"OBRA:  ",{"$f":"$C$2","v":" PAVIMENTAÇÃO ASFÁLTICA EM PMF - COMUNIDADE LAGOA DOURADA (TAIOBEIRAS-MG)"},null,null,null,"DATA: ",{"$f":"$H$2","v":"SETEMBRO DE 2022"}]
[null,"SERVIÇO:  ",{"$f":"VLOOKUP(A59,ORÇAMENTO!$A$10:$I$29,3)","v":"LOCAÇÃO DE PAVIMENTAÇÃO"},null,"SINAPI",{"$f":"VLOOKUP(A59,ORÇAMENTO!$A$10:$I$29,4)","v":99064},"UNIDADE: ",{"$f":"VLOOKUP(A59,ORÇAMENTO!$A$10:$I$29,5)","v":"M"}]
[]
[null,"TIPO ITEM","CODIGO ITEM","DESCRIÇÃO ITEM","UNIDADE ITEM","COEFICIENTE","PRECO UNITARIO","CUSTO TOTAL"]
[null,"COMPOSICAO","99058","LOCAÇÃO DE PONTO PARA REFERÊNCIA TOPOGRÁFICA","UN",0.05,12.96,{"$f":"ROUNDDOWN(F64*G64,2)","v":0.64}]
[]
[null,"PRODUÇÃO DA EQUIPE",null,null,1,"CUSTO ",null,{"$f":"SUM(H64:H65)","v":0.64}]
[null,"TOTAL",{"$nulls":5},{"$f":"H66/E66","v":0.64}]
[null,"BDI                %",{"$nulls":5},{"$f":"1+$M$1","v":1.2115}]
[null,"TOTAL DO SERVIÇO - R$",{"$nulls":5},{"$f":"H67*H68","v":0.77536000000000005}]
[]
[{"$f":"A59+1","v":6},"CODEVASF",null,null," COMPOSIÇÃO DE PREÇO UNITÁRIO",null,null,null,{"$f":"H80","v":2.14},{"$f":"H82","v":2.5926100000000001}]
[null,"OBRA:  ",{"$f":"$C$2","v":" PAVIMENTAÇÃO ASFÁLTICA EM PMF - COMUNIDADE LAGOA DOURADA (TAIOBEIRAS-MG)"},null,null,null,"DATA: ",{"$f":"$H$2","v":"SETEMBRO DE 2022"},null,{"$f":"H83","v":0}]
[null,"SERVIÇO:  ",{"$f":"VLOOKUP(A71,ORÇAMENTO!$A$10:$I$29,3)","v":"ESCAVAÇÃO HORIZONTAL EM SOLO DE 1A CATEGORIA"},null,"SINAPI",{"$f":"VLOOKUP(A71,ORÇAMENTO!$A$10:$I$29,4)","v":101116},"UNIDADE: ",{"$f":"VLOOKUP(A71,ORÇAMENTO!$A$10:$I$29,5)","v":"M3"}]
[]
[null,"TIPO ITEM","CODIGO ITEM","DESCRIÇÃO ITEM","UNIDADE ITEM","COEFICIENTE","PRECO UNITARIO","CUSTO TOTAL"]
[null,"COMPOSICAO","5847","TRATOR DE ESTEIRAS, POTÊNCIA 170 HP, PESO OPERACIONAL 19 T, CAÇAMBA 5,2 M3 - CHP DIURNO. AF_06/2014","CHP","0,0048000","274,81",{"$f":"ROUNDDOWN(F76*G76,2)","v":1.31}]
[null,"COMPOSICAO","5849","TRATOR DE ESTEIRAS, POTÊNCIA 170 HP, PESO OPERACIONAL 19 T, CAÇAMBA 5,2 M3 - CHI DIURNO. AF_06/2014","CHI","0,0082000","74,36",0.6]
[null,"COMPOSICAO","88316","SERVENTE COM ENCARGOS COMPLEMENTARES","H","0,0131000","18,02",0.23]
[null,"PRODUÇÃO DA EQUIPE",null,null,1,"CUSTO ",null,{"$f":"SUM(H76:H78)","v":2.14}]
[null,"TOTAL",{"$nulls":5},{"$f":"H79/E79","v":2.14}]
[null,"BDI                %",{"$nulls":5},{"$f":"1+$M$1","v":1.2115}]
[null,"TOTAL DO SERVIÇO - R$",{"$nulls":5},{"$f":"H80*H81","v":2.5926100000000001}]
[]
[7,"CODEVASF",null,null," COMPOSIÇÃO DE PREÇO UNITÁRIO",null,null,null,{"$f":"H94","v":4.3899999999999997},{"$f":"H96","v":5.3184849999999999}]
[null,"OBRA:  ",{"$f":"$C$2","v":" PAVIMENTAÇÃO ASFÁLTICA EM PMF - COMUNIDADE LAGOA DOURADA (TAIOBEIRAS-MG)"},null,null,null,"DATA: ",{"$f":"$H$2","v":"SETEMBRO DE 2022"}]
[null,"SERVIÇO:  ",{"$f":"VLOOKUP(A84,ORÇAMENTO!$A$10:$I$29,3)","v":"CARGA, MANOBRA E DESCARGA DE SOLOS E MATERIAIS GRANULARES EM CAMINHÃO BASCULANTE - DESCARGA LIVRE"},null,"SINAPI",{"$f":"VLOOKUP(A84,ORÇAMENTO!$A$10:$I$29,4)","v":100976},"UNIDADE: ",{"$f":"VLOOKUP(A84,ORÇAMENTO!$A$10:$I$29,5)","v":"M3"}]
[]
[null,"TIPO ITEM","CODIGO ITEM","DESCRIÇÃO ITEM","UNIDADE ITEM","COEFICIENTE","PRECO UNITARIO","CUSTO TOTAL"]
[null,"COMPOSICAO","5940","PÁ CARREGADEIRA SOBRE RODAS, POTÊNCIA LÍQUIDA 128 HP, CAPACIDADE DA CAÇAMBA 1,7 A 2,8 M3, PESO OPERACIONAL 11632 KG - CHP DIURNO. AF_06/2014","CHP",4.3E-3,"211,10",{"$f":"ROUNDDOWN(F89*G89,2)","v":0.9}]
[null,"COMPOSICAO","5942","PÁ CARREGADEIRA SOBRE RODAS, POTÊNCIA LÍQUIDA 128 HP, CAPACIDADE DA CAÇAMBA 1,7 A 2,8 M3, PESO OPERACIONAL 11632 KG - CHI DIURNO. AF_06/2014","CHI",4.0000000000000001E-3,"77,00",0.3]
[null,"COMPOSICAO","89883","CAMINHÃO BASCULANTE 18 M3, COM CAVALO MECÂNICO DE CAPACIDADE MÁXIMA DE TRAÇÃO COMBINADO DE 45000 KG, POTÊNCIA 330 CV, INCLUSIVE SEMIREBOQUE COM CAÇAMBA METÁLICA - CHP DIURNO. AF_12/2014","CHP",7.515E-3,"378,01",2.84]
[null,"COMPOSICAO","89884","CAMINHÃO BASCULANTE 18 M3, COM CAVALO MECÂNICO DE CAPACIDADE MÁXIMA DE TRAÇÃO COMBINADO DE 45000 KG, POTÊNCIA 330 CV, INCLUSIVE SEMIREBOQUE COM CAÇAMBA METÁLICA - CHI DIURNO. AF_12/2014","CHI",5.0000000000000001E-3,"70,93",0.35]
[null,"PRODUÇÃO DA EQUIPE",null,null,1,"CUSTO ",null,{"$f":"SUM(H89:H92)","v":4.3899999999999997}]
[null,"TOTAL",{"$nulls":5},{"$f":"H93/E93","v":4.3899999999999997}]
[null,"BDI                %",{"$nulls":5},{"$f":"1+$M$1","v":1.2115}]
[null,"TOTAL DO SERVIÇO - R$",{"$nulls":5},{"$f":"H94*H95","v":5.3184849999999999}]
[]
[8,"CODEVASF",null,null," COMPOSIÇÃO DE PREÇO UNITÁRIO",null,null,null,{"$f":"H112","v":2.2200000000000002},{"$f":"H114","v":2.6895300000000004}]
[null,"OBRA:  ",{"$f":"$C$2","v":" PAVIMENTAÇÃO ASFÁLTICA EM PMF - COMUNIDADE LAGOA DOURADA (TAIOBEIRAS-MG)"},null,null,null,"DATA: ",{"$f":"$H$2","v":"SETEMBRO DE 2022"}]
[null,"SERVIÇO:  ",{"$f":"VLOOKUP(A98,ORÇAMENTO!$A$10:$I$29,3)","v":"REGULARIZAÇÃO E COMPACTAÇÃO DE SUBLEITO"},null,"SINAPI",{"$f":"VLOOKUP(A98,ORÇAMENTO!$A$10:$I$29,4)","v":100576},"UNIDADE: ",{"$f":"VLOOKUP(A98,ORÇAMENTO!$A$10:$I$29,5)","v":"M2"}]
[]
[null,"TIPO ITEM","CODIGO ITEM","DESCRIÇÃO ITEM","UNIDADE ITEM","COEFICIENTE","PRECO UNITARIO","CUSTO TOTAL"]
[null,"COMPOSICAO","5901","CAMINHÃO PIPA 10.000 L TRUCADO, PESO BRUTO TOTAL 23.000 KG, CARGA ÚTIL MÁXIMA 15.935 KG, DISTÂNCIA ENTRE EIXOS 4,8 M, POTÊNCIA 230 CV, INCLUSIVE TANQUE DE AÇO PARA TRANSPORTE DE ÁGUA - CHP DIURNO. AF_06/2014","CHP","0,0010000","326,66",{"$f":"ROUNDDOWN(F103*G103,2)","v":0.32}]
[null,"COMPOSICAO","5903","CAMINHÃO PIPA 10.000 L TRUCADO, PESO BRUTO TOTAL 23.000 KG, CARGA ÚTIL MÁXIMA 15.935 KG, DISTÂNCIA ENTRE EIXOS 4,8 M, POTÊNCIA 230 CV, INCLUSIVE TANQUE DE AÇO PARA TRANSPORTE DE ÁGUA - CHI DIURNO. AF_06/2014","CHI","0,0070000","54,39",0.38]
[null,"COMPOSICAO","5932","MOTONIVELADORA POTÊNCIA BÁSICA LÍQUIDA (PRIMEIRA MARCHA) 125 HP, PESO BRUTO 13032 KG, LARGURA DA LÂMINA DE 3,7 M - CHP DIURNO. AF_06/2014","CHP","0,0001000","256,86",0.02]
[null,"COMPOSICAO","5934","MOTONIVELADORA POTÊNCIA BÁSICA LÍQUIDA (PRIMEIRA MARCHA) 125 HP, PESO BRUTO 13032 KG, LARGURA DA LÂMINA DE 3,7 M - CHI DIURNO. AF_06/2014","CHI","0,0080000","83,44",0.66]
[null,"COMPOSICAO","73436","ROLO COMPACTADOR VIBRATÓRIO PÉ DE CARNEIRO PARA SOLOS, POTÊNCIA 80 HP, PESO OPERACIONAL SEM/COM LASTRO 7,4 / 8,8 T, LARGURA DE TRABALHO 1,68 M - CHP DIURNO. AF_02/2016","CHP","0,0020000","196,72",0.39]
[null,"COMPOSICAO","88316","SERVENTE COM ENCARGOS COMPLEMENTARES","H","0,0080000","18,02",0.14000000000000001]
[null,"COMPOSICAO","93244","ROLO COMPACTADOR VIBRATÓRIO PÉ DE CARNEIRO PARA SOLOS, POTÊNCIA 80 HP, PESO OPERACIONAL SEM/COM LASTRO 7,4 / 8,8 T, LARGURA DE TRABALHO 1,68 M - CHI DIURNO. AF_02/2016","CHI","0,0060000","52,17",0.31]
[{"$nulls":7},0]
[null,"PRODUÇÃO DA EQUIPE",null,null,1,"CUSTO ",null,{"$f":"SUM(H103:H110)","v":2.2200000000000002}]
[null,"TOTAL",{"$nulls":5},{"$f":"H111/E111","v":2.2200000000000002}]
[null,"BDI                %",{"$nulls":5},{"$f":"1+$M$1","v":1.2115}]
[null,"TOTAL DO SERVIÇO - R$",{"$nulls":5},{"$f":"H112*H113","v":2.6895300000000004}]
[]
[9,"CODEVASF",null,null," COMPOSIÇÃO DE PREÇO UNITÁRIO",null,null,null,{"$f":"H131","v":10.57},{"$f":"H133","v":12.805555}]
[null,"OBRA:  ",{"$f":"$C$2","v":" PAVIMENTAÇÃO ASFÁLTICA EM PMF - COMUNIDADE LAGOA DOURADA (TAIOBEIRAS-MG)"},null,null,null,"DATA: ",{"$f":"$H$2","v":"SETEMBRO DE 2022"}]
[null,"SERVIÇO:  ",{"$f":"VLOOKUP(A116,ORÇAMENTO!$A$10:$I$29,3)","v":"EXECUÇÃO E COMPACTAÇÃO DE BASE E OU SUB BASE PARA PAVIMENTAÇÃO EM CASCALHO - EXCLUSIVE SOLO, ESCAVAÇÃO, CARGA E TRANSPORTE."},null,"SINAPI",{"$f":"VLOOKUP(A116,ORÇAMENTO!$A$10:$I$29,4)","v":96388},"UNIDADE: ",{"$f":"VLOOKUP(A116,ORÇAMENTO!$A$10:$I$29,5)","v":"M3"}]
[]
[null,"TIPO ITEM","CODIGO ITEM","DESCRIÇÃO ITEM","UNIDADE ITEM","COEFICIENTE","PRECO UNITARIO","CUSTO TOTAL"]
[null,"COMPOSICAO","5684","ROLO COMPACTADOR VIBRATÓRIO DE UM CILINDRO AÇO LISO, POTÊNCIA 80 HP, PESO OPERACIONAL MÁXIMO 8,1 T, IMPACTO DINÂMICO 16,15 / 9,5 T, LARGURA DE TRABALHO 1,68 M - CHP DIURNO. AF_06/2014","CHP","0,0030000","152,82",{"$f":"ROUNDDOWN(F121*G121,2)","v":0.45}]
[null,"COMPOSICAO","5685","ROLO COMPACTADOR VIBRATÓRIO DE UM CILINDRO AÇO LISO, POTÊNCIA 80 HP, PESO OPERACIONAL MÁXIMO 8,1 T, IMPACTO DINÂMICO 16,15 / 9,5 T, LARGURA DE TRABALHO 1,68 M - CHI DIURNO. AF_06/2014","CHI","0,0230000","50,98",1.17,{"$nulls":6},1.7214982000000003,null,{"$f":"SUM(O122:O134)","v":25.801498200000001}]
[null,"COMPOSICAO","5901","CAMINHÃO PIPA 10.000 L TRUCADO, PESO BRUTO TOTAL 23.000 KG, CARGA ÚTIL MÁXIMA 15.935 KG, DISTÂNCIA ENTRE EIXOS 4,8 M, POTÊNCIA 230 CV, INCLUSIVE TANQUE DE AÇO PARA TRANSPORTE DE ÁGUA - CHP DIURNO. AF_06/2014","CHP","0,0040000","326,66",1.3,{"$nulls":6},0.91]
[null,"COMPOSICAO","5903","CAMINHÃO PIPA 10.000 L TRUCADO, PESO BRUTO TOTAL 23.000 KG, CARGA ÚTIL MÁXIMA 15.935 KG, DISTÂNCIA ENTRE EIXOS 4,8 M, POTÊNCIA 230 CV, INCLUSIVE TANQUE DE AÇO PARA TRANSPORTE DE ÁGUA - CHI DIURNO. AF_06/2014","CHI","0,0220000","54,39",1.19,{"$nulls":6},0.04]
[null,"COMPOSICAO","5932","MOTONIVELADORA POTÊNCIA BÁSICA LÍQUIDA (PRIMEIRA MARCHA) 125 HP, PESO BRUTO 13032 KG, LARGURA DA LÂMINA DE 3,7 M - CHP DIURNO. AF_06/2014","CHP","0,0080000","256,86",2.0499999999999998,{"$nulls":6},0.18]
[null,"COMPOSICAO","5934","MOTONIVELADORA POTÊNCIA BÁSICA LÍQUIDA (PRIMEIRA MARCHA) 125 HP, PESO BRUTO 13032 KG, LARGURA DA LÂMINA DE 3,7 M - CHI DIURNO. AF_06/2014","CHI","0,0190000","83,44",1.58,{"$nulls":6},1.51]
[null,"COMPOSICAO","88316","SERVENTE COM ENCARGOS COMPLEMENTARES","H","0,0260000","18,02",0.46,{"$nulls":6},4.3]
[null,"COMPOSICAO","96463","ROLO COMPACTADOR DE PNEUS, ESTATICO, PRESSAO VARIAVEL, POTENCIA 110 HP, PESO SEM/COM LASTRO 10,8/27 T, LARGURA DE ROLAGEM 2,30 M - CHP DIURNO. AF_06/2017","CHP","0,0040000","202,77",0.81,{"$nulls":6},8]
[null,"COMPOSICAO","96464","ROLO COMPACTADOR DE PNEUS, ESTATICO, PRESSAO VARIAVEL, POTENCIA 110 HP, PESO SEM/COM LASTRO 10,8/27 T, LARGURA DE ROLAGEM 2,30 M - CHI DIURNO. AF_06/2017","CHI","0,0220000","70,94",1.56,{"$nulls":6},1.03]
[null,"PRODUÇÃO DA EQUIPE",null,null,1,"CUSTO ",null,{"$f":"SUM(H121:H129)","v":10.57},{"$nulls":6},0.97]
[null,"TOTAL",{"$nulls":5},{"$f":"H130/E130","v":10.57},{"$nulls":6},2.0099999999999998]
[null,"BDI                %",{"$nulls":5},{"$f":"1+$M$1","v":1.2115},{"$nulls":6},0.3]
[null,"TOTAL DO SERVIÇO - R$",{"$nulls":5},{"$f":"H131*H132","v":12.805555},{"$nulls":6},1.17]
[{"$nulls":14},3.66]
[10,"CODEVASF",null,null," COMPOSIÇÃO DE PREÇO UNITÁRIO",null,null,null,{"$f":"H150","v":1.0900000000000001},{"$f":"H152","v":1.320535}]
[null,"OBRA:  ",{"$f":"$C$2","v":" PAVIMENTAÇÃO ASFÁLTICA EM PMF - COMUNIDADE LAGOA DOURADA (TAIOBEIRAS-MG)"},null,null,null,"DATA: ",{"$f":"$H$2","v":"SETEMBRO DE 2022"}]
[null,"SERVIÇO:  ",{"$f":"VLOOKUP(A135,ORÇAMENTO!$A$10:$I$29,3)","v":"IMPRIMAÇÃO COM ASFALTO DILUIDO CM-30"},null,"SINAPI",{"$f":"VLOOKUP(A135,ORÇAMENTO!$A$10:$I$29,4)","v":96401},"UNIDADE: ",{"$f":"VLOOKUP(A135,ORÇAMENTO!$A$10:$I$29,5)","v":"M2"}]
[]
[null,"TIPO ITEM","CODIGO ITEM","DESCRIÇÃO ITEM","UNIDADE ITEM","COEFICIENTE","PRECO UNITARIO","CUSTO TOTAL"]
[null,"COMPOSICAO","5839","VASSOURA MECÂNICA REBOCÁVEL COM ESCOVA CILÍNDRICA, LARGURA ÚTIL DE VARRIMENTO DE 2,44 M ","CHP","0,0020000",11.36,{"$f":"ROUNDDOWN(F140*G140,2)","v":0.02}]
[null,"COMPOSICAO","5841","VASSOURA MECÂNICA REBOCÁVEL COM ESCOVA CILÍNDRICA, LARGURA ÚTIL DE VARRIMENTO DE 2,44 M ","CHI","0,0040000",5.4,0.02]
[null,"INSUMO",null,"ASFALTO DILUIDO DE PETROLEO CM-30 (FORNECIMENTO COM BDI DIFERENCIADO)","KG","1,2000000",null,0]
[null,"COMPOSICAO","83362","ESPARGIDOR DE ASFALTO PRESSURIZADO, TANQUE 6 M3 COM ISOLAÇÃO TÉRMICA, AQUECIDO COM 2 MAÇARICOS, COM BARRA ESPARGIDORA 3,60 M, MONTADO SOBRE CAMINHÃO  TOCO, PBT 14.300 KG, POTÊNCIA 185 CV","CHP","0,0010000",272.29000000000002,0.27]
[null,"COMPOSICAO","88316","SERVENTE COM ENCARGOS COMPLEMENTARES","H","0,0060000",18.02,0.1]
[null,"COMPOSICAO","89035","TRATOR DE PNEUS, POTÊNCIA 85 CV, TRAÇÃO 4X4, PESO COM LASTRO DE 4.675 KG ","CHP","0,0020000",136.1,0.27]
[null,"COMPOSICAO","89036","TRATOR DE PNEUS, POTÊNCIA 85 CV, TRAÇÃO 4X4, PESO COM LASTRO DE 4.675 KG ","CHI","0,0040000",40.130000000000003,0.16]
[null,"COMPOSICAO","91486","ESPARGIDOR DE ASFALTO PRESSURIZADO, TANQUE 6 M3 COM ISOLAÇÃO TÉRMICA, AQUECIDO COM 2 MAÇARICOS, COM BARRA ESPARGIDORA 3,60 M, MONTADO SOBRE CAMINHÃO  TOCO, PBT 14.300 KG, POTÊNCIA 185 CV","CHI","0,0050000",51.39,0.25]
[{"$nulls":7},0]
[null,"PRODUÇÃO DA EQUIPE",null,null,1,"CUSTO ",null,{"$f":"SUM(H140:H148)","v":1.0900000000000001}]
[null,"TOTAL",{"$nulls":5},{"$f":"H149/E149","v":1.0900000000000001}]
[null,"BDI                %",{"$nulls":5},{"$f":"1+$M$1","v":1.2115}]
[null,"TOTAL DO SERVIÇO - R$",{"$nulls":5},{"$f":"H150*H151","v":1.320535}]
[]
[11,"CODEVASF",null,null," COMPOSIÇÃO DE PREÇO UNITÁRIO",null,null,null,{"$f":"H169","v":0.87},{"$f":"H171","v":1.0540050000000001}]
[null,"OBRA:  ",{"$f":"$C$2","v":" PAVIMENTAÇÃO ASFÁLTICA EM PMF - COMUNIDADE LAGOA DOURADA (TAIOBEIRAS-MG)"},null,null,null,"DATA: ",{"$f":"$H$2","v":"SETEMBRO DE 2022"}]
[null,"SERVIÇO:  ",{"$f":"VLOOKUP(A154,ORÇAMENTO!$A$10:$I$29,3)","v":"PINTURA DE LIGAÇÃO COM EMULSÃO ASFÁLTICA RR-2C"},null,"SINAPI",{"$f":"VLOOKUP(A154,ORÇAMENTO!$A$10:$I$29,4)","v":96402},"UNIDADE: ",{"$f":"VLOOKUP(A154,ORÇAMENTO!$A$10:$I$29,5)","v":"M2"}]
[]
[null,"TIPO ITEM","CODIGO ITEM","DESCRIÇÃO ITEM","UNIDADE ITEM","COEFICIENTE","PRECO UNITARIO","CUSTO TOTAL"]
[null,"COMPOSICAO","5839","VASSOURA MECÂNICA REBOCÁVEL COM ESCOVA CILÍNDRICA, LARGURA ÚTIL DE VARRIMENTO DE 2,44 M - CHP DIURNO. AF_06/2014","CHP","0,0020000","11,36",{"$f":"ROUNDDOWN(F159*G159,2)","v":0.02}]
[null,"COMPOSICAO","5841","VASSOURA MECÂNICA REBOCÁVEL COM ESCOVA CILÍNDRICA, LARGURA ÚTIL DE VARRIMENTO DE 2,44 M - CHI DIURNO. AF_06/2014","CHI","0,0040000","5,40",0.02]
[null,"INSUMO",null,"EMULSAO ASFALTICA CATIONICA RR-2C PARA USO EM PAVIMENTACAO ASFALTICA (COLETADO CAIXA NA ANP ACRESCIDO DE ICMS)","KG","0,4500000",null,0]
[null,"COMPOSICAO","83362","ESPARGIDOR DE ASFALTO PRESSURIZADO, TANQUE 6 M3 COM ISOLAÇÃO TÉRMICA, AQUECIDO COM 2 MAÇARICOS, COM BARRA ESPARGIDORA 3,60 M, MONTADO SOBRE CAMINHÃO  TOCO, PBT 14.300 KG, POTÊNCIA 185 CV - CHP DIURNO. AF_08/2015","CHP","0,0004000","272,29",0.1]
[null,"COMPOSICAO","88316","SERVENTE COM ENCARGOS COMPLEMENTARES","H","0,0055000","18,02",0.09]
[null,"COMPOSICAO","89035","TRATOR DE PNEUS, POTÊNCIA 85 CV, TRAÇÃO 4X4, PESO COM LASTRO DE 4.675 KG - CHP DIURNO. AF_06/2014","CHP","0,0017000","136,10",0.23]
[null,"COMPOSICAO","89036","TRATOR DE PNEUS, POTÊNCIA 85 CV, TRAÇÃO 4X4, PESO COM LASTRO DE 4.675 KG - CHI DIURNO. AF_06/2014","CHI","0,0038000","40,13",0.15]
[null,"COMPOSICAO","91486","ESPARGIDOR DE ASFALTO PRESSURIZADO, TANQUE 6 M3 COM ISOLAÇÃO TÉRMICA, AQUECIDO COM 2 MAÇARICOS, COM BARRA ESPARGIDORA 3,60 M, MONTADO SOBRE CAMINHÃO  TOCO, PBT 14.300 KG, POTÊNCIA 185 CV - CHI DIURNO. AF_08/2015","CHI","0,0051000","51,39",0.26]
[{"$nulls":7},0]
[null,"PRODUÇÃO DA EQUIPE",null,null,1,"CUSTO ",null,{"$f":"SUM(H159:H167)","v":0.87}]
[null,"TOTAL",{"$nulls":5},{"$f":"H168/E168","v":0.87}]
[null,"BDI                %",{"$nulls":5},{"$f":"1+$M$1","v":1.2115}]
[null,"TOTAL DO SERVIÇO - R$",{"$nulls":5},{"$f":"H169*H170","v":1.0540050000000001}]
[]
[12,"CODEVASF",null,null," COMPOSIÇÃO DE PREÇO UNITÁRIO",null,null,null,{"$f":"H191","v":390.57},{"$f":"H193","v":473.17555499999997}]
[null,"OBRA:  ",{"$f":"$C$2","v":" PAVIMENTAÇÃO ASFÁLTICA EM PMF - COMUNIDADE LAGOA DOURADA (TAIOBEIRAS-MG)"},null,null,null,"DATA: ",{"$f":"$H$2","v":"SETEMBRO DE 2022"}]
[null,"SERVIÇO:  ",{"$f":"VLOOKUP(A173,ORÇAMENTO!$A$10:$I$29,3)","v":"EXECUÇÃO DE PAVIMENTO COM APLICAÇÃO DE PRÉ-MISTURADO A FRIO, CAMADA DE ROLAMENTO - EXCLUSIVE TRANSPORTE"},null,"SINAPI",{"$f":"VLOOKUP(A173,ORÇAMENTO!$A$10:$I$29,4)","v":100624},"UNIDADE: ",{"$f":"VLOOKUP(A173,ORÇAMENTO!$A$10:$I$29,5)","v":"M3"}]
[]
[null,"TIPO ITEM","CODIGO ITEM","DESCRIÇÃO ITEM","UNIDADE ITEM","COEFICIENTE","PRECO UNITARIO","CUSTO TOTAL"]
[null,"COMPOSICAO","5835","VIBROACABADORA DE ASFALTO SOBRE ESTEIRAS, LARGURA DE PAVIMENTAÇÃO 1,90 M A 5,30 M, POTÊNCIA 105 HP CAPACIDADE 450 T/H - CHP DIURNO. AF_11/2014","CHP","0,0280000","396,31",{"$f":"ROUNDDOWN(F178*G178,2)","v":11.09}]
[null,"COMPOSICAO","5837","VIBROACABADORA DE ASFALTO SOBRE ESTEIRAS, LARGURA DE PAVIMENTAÇÃO 1,90 M A 5,30 M, POTÊNCIA 105 HP CAPACIDADE 450 T/H - CHI DIURNO. AF_11/2014","CHI","0,0580000","137,39",7.96]
[null,"COMPOSICAO","88314","RASTELEIRO COM ENCARGOS COMPLEMENTARES","H","0,6860000","18,62",12.77]
[null,"COMPOSICAO","91386","CAMINHÃO BASCULANTE 10 M3, TRUCADO CABINE SIMPLES, PESO BRUTO TOTAL 23.000 KG, CARGA ÚTIL MÁXIMA 15.935 KG, DISTÂNCIA ENTRE EIXOS 4,80 M, POTÊNCIA 230 CV INCLUSIVE CAÇAMBA METÁLICA - CHP DIURNO. AF_06/2014","CHP","0,0280000","266,55",7.46]
[null,"COMPOSICAO","95631","ROLO COMPACTADOR VIBRATORIO TANDEM, ACO LISO, POTENCIA 125 HP, PESO SEM/COM LASTRO 10,20/11,65 T, LARGURA DE TRABALHO 1,73 M - CHP DIURNO. AF_11/2016","CHP","0,0460000","222,91",10.25]
[null,"COMPOSICAO","95632","ROLO COMPACTADOR VIBRATORIO TANDEM, ACO LISO, POTENCIA 125 HP, PESO SEM/COM LASTRO 10,20/11,65 T, LARGURA DE TRABALHO 1,73 M - CHI DIURNO. AF_11/2016","CHI","0,0400000","66,00",2.64]
[null,"COMPOSICAO","96155","TRATOR DE PNEUS COM POTÊNCIA DE 85 CV, TRAÇÃO 4X4, COM VASSOURA MECÂNICA ACOPLADA - CHI DIURNO. AF_02/2017","CHI","0,0520000","45,30",2.35]
[null,"COMPOSICAO","96157","TRATOR DE PNEUS COM POTÊNCIA DE 85 CV, TRAÇÃO 4X4, COM VASSOURA MECÂNICA ACOPLADA - CHP DIURNO. AF_03/2017","CHP","0,0340000","146,23",4.97]
[null,"COMPOSICAO","96463","ROLO COMPACTADOR DE PNEUS, ESTATICO, PRESSAO VARIAVEL, POTENCIA 110 HP, PESO SEM/COM LASTRO 10,8/27 T, LARGURA DE ROLAGEM 2,30 M - CHP DIURNO. AF_06/2017","CHP","0,0260000","202,77",5.27]
[null,"COMPOSICAO","96464","ROLO COMPACTADOR DE PNEUS, ESTATICO, PRESSAO VARIAVEL, POTENCIA 110 HP, PESO SEM/COM LASTRO 10,8/27 T, LARGURA DE ROLAGEM 2,30 M - CHI DIURNO. AF_06/2017","CHI","0,0600000","70,94",4.25]
[null,"COMPOSICAO","101027","USINAGEM DE PRÉ MISTURADO A FRIO, PARA CAMADA DE ROLAMENTO, PADRÃO DNIT FAIXA C. AF_03/2020_P","T","2,4480000",{"$f":"H215","v":131.36000000000001},321.56]
[{"$nulls":7},0]
[null,"PRODUÇÃO DA EQUIPE",null,null,1,"CUSTO ",null,{"$f":"SUM(H178:H189)","v":390.57}]
[null,"TOTAL",{"$nulls":5},{"$f":"H190/E190","v":390.57}]
[null,"BDI                %",{"$nulls":5},{"$f":"1+$M$1","v":1.2115}]
[null,"TOTAL DO SERVIÇO - R$",{"$nulls":5},{"$f":"H191*H192","v":473.17555499999997}]
[]
[null,"CODEVASF",null,null," COMPOSIÇÃO DE PREÇO UNITÁRIO"]
[null,"OBRA:  ",{"$f":"$C$2","v":" PAVIMENTAÇÃO ASFÁLTICA EM PMF - COMUNIDADE LAGOA DOURADA (TAIOBEIRAS-MG)"},null,null,null,"DATA: ",{"$f":"$H$2","v":"SETEMBRO DE 2022"}]
[null,"SERVIÇO:  ",{"$f":"D188","v":"USINAGEM DE PRÉ MISTURADO A FRIO, PARA CAMADA DE ROLAMENTO, PADRÃO DNIT FAIXA C. AF_03/2020_P"},null,"SINAPI",{"$f":"C188","v":"101027"},"UNIDADE: ",{"$f":"E188","v":"T"}]
[]
[null,"TIPO ITEM","CODIGO ITEM","DESCRIÇÃO ITEM","UNIDADE ITEM","COEFICIENTE","PRECO UNITARIO","CUSTO TOTAL"]
[null,"INSUMO","370","AREIA MEDIA - POSTO JAZIDA/FORNECEDOR (RETIRADO NA JAZIDA, SEM TRANSPORTE)","M3","0,1600000","100,00",{"$f":"ROUNDDOWN(F200*G200,2)","v":16}]
[null,"INSUMO","1106","CAL HIDRATADA CH-I PARA ARGAMASSAS","KG","36,9275000","0,97",35.81]
[null,"INSUMO","4720","PEDRA BRITADA N. 0, OU PEDRISCO (4,8 A 9,5 MM) POSTO PEDREIRA/FORNECEDOR, SEM FRETE","M3","0,2410000","121,25",29.22]
[null,"INSUMO","4721","PEDRA BRITADA N. 1 (9,5 a 19 MM) POSTO PEDREIRA/FORNECEDOR, SEM FRETE","M3","0,1897000","105,02",19.920000000000002]
[null,"COMPOSICAO","5940","PÁ CARREGADEIRA SOBRE RODAS, POTÊNCIA LÍQUIDA 128 HP, CAPACIDADE DA CAÇAMBA 1,7 A 2,8 M3, PESO OPERACIONAL 11632 KG - CHP DIURNO. AF_06/2014","CHP","0,0048000","211,10",1.01]
[null,"COMPOSICAO","5942","PÁ CARREGADEIRA SOBRE RODAS, POTÊNCIA LÍQUIDA 128 HP, CAPACIDADE DA CAÇAMBA 1,7 A 2,8 M3, PESO OPERACIONAL 11632 KG - CHI DIURNO. AF_06/2014","CHI","0,0253000","77,00",1.94]
[null,"COMPOSICAO","7030","TANQUE DE ASFALTO ESTACIONÁRIO COM SERPENTINA, CAPACIDADE 30.000 L - CHP DIURNO. AF_06/2014","CHP","0,0603000","317,95",19.170000000000002]
[null,"INSUMO","41904","EMULSAO ASFALTICA CATIONICA RL-1C PARA USO EM PAVIMENTACAO ASFALTICA (COLETADO CAIXA NA ANP ACRESCIDO DE ICMS)","T","0,0769000",null,0]
[null,"COMPOSICAO","88316","SERVENTE COM ENCARGOS COMPLEMENTARES","H","0,0603000","18,02",1.08]
[null,"COMPOSICAO","90776","ENCARREGADO GERAL COM ENCARGOS COMPLEMENTARES","H","0,0301000","39,80",1.19]
[null,"COMPOSICAO","93421","GRUPO GERADOR REBOCÁVEL, POTÊNCIA 66 KVA, MOTOR A DIESEL - CHP DIURNO. AF_03/2016","CHP","0,0234000","85,03",1.98]
[null,"COMPOSICAO","93422","GRUPO GERADOR REBOCÁVEL, POTÊNCIA 66 KVA, MOTOR A DIESEL - CHI DIURNO. AF_03/2016","CHI","0,0068000","2,59",0.01]
[null,"COMPOSICAO","93439","USINA DE ASFALTO À FRIO, CAPACIDADE DE 40 A 60 TON/HORA, ELÉTRICA POTÊNCIA 30 CV - CHP DIURNO. AF_03/2016","CHP","0,0234000","142,85",3.34]
[null,"COMPOSICAO","93440","USINA DE ASFALTO À FRIO, CAPACIDADE DE 40 A 60 TON/HORA, ELÉTRICA POTÊNCIA 30 CV - CHI DIURNO. AF_03/2016","CHI","0,0068000","101,78",0.69]
[{"$nulls":7},0]
[null,"PRODUÇÃO DA EQUIPE",null,null,1,"CUSTO ",null,{"$f":"SUM(H200:H214)","v":131.36000000000001}]
[null,"TOTAL",{"$nulls":5},{"$f":"H215/E215","v":131.36000000000001}]
[null,"BDI                %",{"$nulls":5},{"$f":"1+$M$1","v":1.2115}]
[null,"TOTAL DO SERVIÇO - R$",{"$nulls":5},{"$f":"H216*H217","v":159.14264000000003}]
[]
[13,"CODEVASF",null,null," COMPOSIÇÃO DE PREÇO UNITÁRIO",null,null,null,{"$f":"H229","v":1.0899999999999999},{"$f":"H231","v":1.3205349999999998}]
[null,"OBRA:  ",{"$f":"$C$2","v":" PAVIMENTAÇÃO ASFÁLTICA EM PMF - COMUNIDADE LAGOA DOURADA (TAIOBEIRAS-MG)"},null,null,null,"DATA: ",{"$f":"$H$2","v":"SETEMBRO DE 2022"}]
[null,"SERVIÇO:  ",{"$f":"VLOOKUP(A220,ORÇAMENTO!$A$10:$I$29,3)","v":"TRANSPORTE COM CAMINHÃO BASCULANTE, EM VIA URBANA EM REVESTIMENTO PRIMÁRIO"},null,"SINAPI",{"$f":"VLOOKUP(A220,ORÇAMENTO!$A$10:$I$29,4)","v":95426},"UNIDADE: ",{"$f":"VLOOKUP(A220,ORÇAMENTO!$A$10:$I$29,5)","v":"M3XKM"}]
[]
[null,"TIPO ITEM","CODIGO ITEM","DESCRIÇÃO ITEM","UNIDADE ITEM","COEFICIENTE","PRECO UNITARIO","CUSTO TOTAL"]
[null,"COMPOSICAO","89883","CAMINHÃO BASCULANTE 18 M3, COM CAVALO MECÂNICO DE CAPACIDADE MÁXIMA DE TRAÇÃO COMBINADO DE 45000 KG, POTÊNCIA 330 CV, INCLUSIVE SEMIREBOQUE COM CAÇAMBA METÁLICA","CHP",2.5000000000000001E-3,"378,01",{"$f":"ROUNDDOWN(F225*G225,2)","v":0.94}]
[null,"COMPOSICAO","89884","CAMINHÃO BASCULANTE 18 M3, COM CAVALO MECÂNICO DE CAPACIDADE MÁXIMA DE TRAÇÃO COMBINADO DE 45000 KG, POTÊNCIA 330 CV, INCLUSIVE SEMIREBOQUE COM CAÇAMBA METÁLICA","CHI","0,0022000","70,93",0.15]
[{"$nulls":7},0]
[null,"PRODUÇÃO DA EQUIPE",null,null,1,"CUSTO ",null,{"$f":"SUM(H225:H227)","v":1.0899999999999999}]
[null,"TOTAL",{"$nulls":5},{"$f":"H228/E228","v":1.0899999999999999}]
[null,"BDI                %",{"$nulls":5},{"$f":"1+$M$1","v":1.2115}]
[null,"TOTAL DO SERVIÇO - R$",{"$nulls":5},{"$f":"H229*H230","v":1.3205349999999998}]
[]
[22,"CODEVASF",null,null," COMPOSIÇÃO DE PREÇO UNITÁRIO",null,null,null,{"$f":"H242","v":1.96},{"$f":"H244","v":2.3745400000000001}]
[null,"OBRA:  ",{"$f":"$C$2","v":" PAVIMENTAÇÃO ASFÁLTICA EM PMF - COMUNIDADE LAGOA DOURADA (TAIOBEIRAS-MG)"},null,null,null,"DATA: ",{"$f":"$H$2","v":"SETEMBRO DE 2022"}]
[null,"SERVIÇO:  ",{"$f":"VLOOKUP(A233,ORÇAMENTO!$A$10:$I$29,3,0)","v":"TRANSPORTE COM CAMINHÃO BASCULANTE, EM VIA URBANA EM LEITO NATURAL"},null,"SINAPI",{"$f":"VLOOKUP(A233,ORÇAMENTO!$A$10:$I$29,4,0)","v":95425},"UNIDADE: ",{"$f":"VLOOKUP(A233,ORÇAMENTO!$A$10:$I$29,5,0)","v":"M3XKM"}]
[]
[null,"TIPO ITEM","CODIGO ITEM","DESCRIÇÃO ITEM","UNIDADE ITEM","COEFICIENTE","PRECO UNITARIO","CUSTO TOTAL"]
[null,"COMPOSICAO","89883","CAMINHÃO BASCULANTE 18 M3, COM CAVALO MECÂNICO DE CAPACIDADE MÁXIMA DE TRAÇÃO COMBINADO DE 45000 KG, POTÊNCIA 330 CV, INCLUSIVE SEMIREBOQUE COM CAÇAMBA METÁLICA - CHP DIURNO. AF_12/2014","CHP",4.7999999999999996E-3,"378,01",{"$f":"ROUNDDOWN(F238*G238,2)","v":1.81}]
[null,"COMPOSICAO","89884","CAMINHÃO BASCULANTE 18 M3, COM CAVALO MECÂNICO DE CAPACIDADE MÁXIMA DE TRAÇÃO COMBINADO DE 45000 KG, POTÊNCIA 330 CV, INCLUSIVE SEMIREBOQUE COM CAÇAMBA METÁLICA - CHI DIURNO. AF_12/2014","CHI",2.2000000000000001E-3,"70,93",0.15]
[{"$nulls":7},0]
[null,"PRODUÇÃO DA EQUIPE",null,null,1,"CUSTO ",null,{"$f":"SUM(H238:H240)","v":1.96}]
[null,"TOTAL",{"$nulls":5},{"$f":"H241/E241","v":1.96}]
[null,"BDI                %",{"$nulls":5},{"$f":"1+$M$1","v":1.2115}]
[null,"TOTAL DO SERVIÇO - R$",{"$nulls":5},{"$f":"H242*H243","v":2.3745400000000001}]
[]
[20,"CODEVASF",null,null," COMPOSIÇÃO DE PREÇO UNITÁRIO",null,null,null,{"$f":"H255","v":0.76},{"$f":"H257","v":0.92074}]
[null,"OBRA:  ",{"$f":"$C$2","v":" PAVIMENTAÇÃO ASFÁLTICA EM PMF - COMUNIDADE LAGOA DOURADA (TAIOBEIRAS-MG)"},null,null,null,"DATA: ",{"$f":"$H$2","v":"SETEMBRO DE 2022"}]
[null,"SERVIÇO:  ",{"$f":"VLOOKUP(A246,ORÇAMENTO!$A$10:$I$37,3,0)","v":"TRANSPORTE COM CAMINHÃO BASCULANTE, EM VIA URBANA PAVIMENTADA"},null,"SINAPI",{"$f":"VLOOKUP(A246,ORÇAMENTO!$A$10:$I$29,4,0)","v":95427},"UNIDADE: ",{"$f":"VLOOKUP(A246,ORÇAMENTO!$A$10:$I$29,5,0)","v":"M3XKM"}]
[]
[null,"TIPO ITEM","CODIGO ITEM","DESCRIÇÃO ITEM","UNIDADE ITEM","COEFICIENTE","PRECO UNITARIO","CUSTO TOTAL"]
[null,"COMPOSICAO","89883","CAMINHÃO BASCULANTE 18 M3, COM CAVALO MECÂNICO DE CAPACIDADE MÁXIMA DE TRAÇÃO COMBINADO DE 45000 KG, POTÊNCIA 330 CV, INCLUSIVE SEMIREBOQUE COM CAÇAMBA METÁLICA - CHP DIURNO. AF_12/2014","CHP","0,0019000","378,01",{"$f":"ROUNDDOWN(F251*G251,2)","v":0.71}]
[null,"COMPOSICAO","89884","CAMINHÃO BASCULANTE 18 M3, COM CAVALO MECÂNICO DE CAPACIDADE MÁXIMA DE TRAÇÃO COMBINADO DE 45000 KG, POTÊNCIA 330 CV, INCLUSIVE SEMIREBOQUE COM CAÇAMBA METÁLICA - CHI DIURNO. AF_12/2014","CHI","0,0008000","70,93",0.05]
[{"$nulls":7},0]
[null,"PRODUÇÃO DA EQUIPE",null,null,1,"CUSTO ",null,{"$f":"SUM(H251:H253)","v":0.76}]
[null,"TOTAL",{"$nulls":5},{"$f":"H254/E254","v":0.76}]
[null,"BDI                %",{"$nulls":5},{"$f":"1+$M$1","v":1.2115}]
[null,"TOTAL DO SERVIÇO - R$",{"$nulls":5},{"$f":"H255*H256","v":0.92074}]
[]
[15,"CODEVASF",null,null," COMPOSIÇÃO DE PREÇO UNITÁRIO",null,null,null,{"$f":"H274","v":55.6},{"$f":"H276","v":67.359400000000008}]
[null,"OBRA:  ",{"$f":"$C$2","v":" PAVIMENTAÇÃO ASFÁLTICA EM PMF - COMUNIDADE LAGOA DOURADA (TAIOBEIRAS-MG)"},null,null,null,"DATA: ",{"$f":"$H$2","v":"SETEMBRO DE 2022"}]
[null,"SERVIÇO:  ",{"$f":"VLOOKUP(A259,ORÇAMENTO!$A$10:$I$29,3,0)","v":"GUIA (MEIO-FIO) E SARJETA CONJUGADOS DE CONCRETO, MOLDADA  IN LOCO  EM TRECHO RETO COM EXTRUSORA, 45 CM BASE (15 CM BASE DA GUIA + 30 CM BASE DA SARJETA) X 22 CM ALTURA"},null,"SINAPI",{"$f":"VLOOKUP(A259,ORÇAMENTO!$A$10:$I$29,4,0)","v":94267},"UNIDADE: ",{"$f":"VLOOKUP(A259,ORÇAMENTO!$A$10:$I$29,5,0)","v":"M"}]
[]
[null,"TIPO ITEM","CODIGO ITEM","DESCRIÇÃO ITEM","UNIDADE ITEM","COEFICIENTE","PRECO UNITARIO","CUSTO TOTAL"]
[null,"INSUMO","370","AREIA MEDIA - POSTO JAZIDA/FORNECEDOR (RETIRADO NA JAZIDA, SEM TRANSPORTE)","M3","0,0150000","100,00",{"$f":"ROUNDDOWN(F264*G264,2)","v":1.5}]
[null,"INSUMO","34492","CONCRETO USINADO BOMBEAVEL, CLASSE DE RESISTENCIA C20, COM BRITA 0 E 1, SLUMP = 100 +/- 20 MM, EXCLUI SERVICO DE BOMBEAMENTO (NBR 8953)","M3","0,0630000","548,00",34.520000000000003]
[null,"COMPOSICAO","88243","AJUDANTE ESPECIALIZADO COM ENCARGOS COMPLEMENTARES","H","0,1090000","19,92",2.17]
[null,"COMPOSICAO","88309","PEDREIRO COM ENCARGOS COMPLEMENTARES","H","0,2440000","25,14",6.13]
[null,"COMPOSICAO","88316","SERVENTE COM ENCARGOS COMPLEMENTARES","H","0,4870000","18,02",8.77]
[null,"COMPOSICAO","88631","ARGAMASSA TRAÇO 1:4 (EM VOLUME DE CIMENTO E AREIA MÉDIA ÚMIDA), PREPARO MANUAL. AF_08/2019","M3","0,0030000","564,32",1.69]
[null,"COMPOSICAO","92960","MÁQUINA EXTRUSORA DE CONCRETO PARA GUIAS E SARJETAS, MOTOR A DIESEL, POTÊNCIA 14 CV - CHP DIURNO. AF_12/2015","CHP","0,0180000","21,09",0.37]
[null,"COMPOSICAO","92961","MÁQUINA EXTRUSORA DE CONCRETO PARA GUIAS E SARJETAS, MOTOR A DIESEL, POTÊNCIA 14 CV - CHI DIURNO. AF_12/2015","CHI","0,0910000","5,04",0.45]
[{"$nulls":7},0]
[null,"PRODUÇÃO DA EQUIPE",null,null,1,"CUSTO ",null,{"$f":"SUM(H264:H271)","v":55.6}]
[null,"TOTAL",{"$nulls":5},{"$f":"H273/E273","v":55.6}]
[null,"BDI                %",{"$nulls":5},{"$f":"1+$M$1","v":1.2115}]
[null,"TOTAL DO SERVIÇO - R$",{"$nulls":5},{"$f":"H274*H275","v":67.359400000000008}]
[]
[14,"CODEVASF",null,null," COMPOSIÇÃO DE PREÇO UNITÁRIO",null,null,null,{"$f":"H286","v":0.57000000000000006},{"$f":"H288","v":0.65549999999999997}]
[null,"OBRA:  ",{"$f":"$C$2","v":" PAVIMENTAÇÃO ASFÁLTICA EM PMF - COMUNIDADE LAGOA DOURADA (TAIOBEIRAS-MG)"},null,null,null,"DATA: ",{"$f":"$H$2","v":"SETEMBRO DE 2022"}]
[null,"SERVIÇO:  ",{"$f":"VLOOKUP(A278,ORÇAMENTO!A10:I37,3)","v":"TRANSPORTE COM CAMINHÃO TANQUE DE TRANSPORTE DE MATERIAL ASFÁLTICO DE 30000 L, EM VIA URBANA PAVIMENTADA"},null,"SINAPI",{"$f":"VLOOKUP(A278,ORÇAMENTO!$A$10:$I$37,4)","v":102331},"UNIDADE: ",{"$f":"VLOOKUP(A278,ORÇAMENTO!$A$10:$I$37,5)","v":"TXKM"}]
[]
[null,"TIPO ITEM","CODIGO ITEM","DESCRIÇÃO ITEM","UNIDADE ITEM","COEFICIENTE","PRECO UNITARIO","CUSTO TOTAL"]
[null,"COMPOSICAO","91645","CAMINHÃO DE TRANSPORTE DE MATERIAL ASFÁLTICO 30.000 L, COM CAVALO MECÂNICO DE CAPACIDADE MÁXIMA DE TRAÇÃO COMBINADO DE 66.000 KG, POTÊNCIA 360 CV, INCLUSIVE TANQUE DE ASFALTO COM SERPENTINA - CHP DIURNO. AF_08/2015","CHP","0,0011000","495,77",{"$f":"ROUNDDOWN(F283*G283,2)","v":0.54}]
[null,"COMPOSICAO","91646","CAMINHÃO DE TRANSPORTE DE MATERIAL ASFÁLTICO 30.000 L, COM CAVALO MECÂNICO DE CAPACIDADE MÁXIMA DE TRAÇÃO COMBINADO DE 66.000 KG, POTÊNCIA 360 CV, INCLUSIVE TANQUE DE ASFALTO COM SERPENTINA - CHI DIURNO. AF_08/2015","CHI","0,0005000","74,56",0.03]
[null,"PRODUÇÃO DA EQUIPE",null,null,1,"CUSTO ",null,{"$f":"SUM(H283:H284)","v":0.57000000000000006}]
[null,"TOTAL",{"$nulls":5},{"$f":"H285/E285","v":0.57000000000000006}]
[null,"BDI                %",{"$nulls":5},{"$f":"1+$M$2","v":1.1499999999999999}]
[null,"TOTAL DO SERVIÇO - R$",{"$nulls":5},{"$f":"H286*H287","v":0.65549999999999997}]
[]
[21,"CODEVASF",null,null," COMPOSIÇÃO DE PREÇO UNITÁRIO",null,null,null,{"$f":"H298","v":0.48},{"$f":"H300","v":0.55199999999999994}]
[null,"OBRA:  ",{"$f":"$C$2","v":" PAVIMENTAÇÃO ASFÁLTICA EM PMF - COMUNIDADE LAGOA DOURADA (TAIOBEIRAS-MG)"},null,null,null,"DATA: ",{"$f":"$H$2","v":"SETEMBRO DE 2022"}]
[null,"SERVIÇO:  ",{"$f":"VLOOKUP(A290,ORÇAMENTO!$A$10:$I$37,3,0)","v":"TRANSPORTE COM CAMINHÃO BASCULANTE, EM VIA URBANA PAVIMENTADA"},null,"SINAPI",{"$f":"VLOOKUP(A290,ORÇAMENTO!$A$10:$I$37,4,0)","v":95430},"UNIDADE: ",{"$f":"VLOOKUP(A290,ORÇAMENTO!$A$10:$I$37,5,0)","v":"TXKM"}]
[]
[null,"TIPO ITEM","CODIGO ITEM","DESCRIÇÃO ITEM","UNIDADE ITEM","COEFICIENTE","PRECO UNITARIO","CUSTO TOTAL"]
[null,"COMPOSICAO","89883","CAMINHÃO BASCULANTE 18 M3, COM CAVALO MECÂNICO DE CAPACIDADE MÁXIMA DE TRAÇÃO COMBINADO DE 45000 KG, POTÊNCIA 330 CV, INCLUSIVE SEMIREBOQUE COM CAÇAMBA METÁLICA - CHP DIURNO. AF_12/2014","CHP","0,0012000","378,01",{"$f":"ROUNDDOWN(F295*G295,2)","v":0.45}]
[null,"COMPOSICAO","89884","CAMINHÃO BASCULANTE 18 M3, COM CAVALO MECÂNICO DE CAPACIDADE MÁXIMA DE TRAÇÃO COMBINADO DE 45000 KG, POTÊNCIA 330 CV, INCLUSIVE SEMIREBOQUE COM CAÇAMBA METÁLICA - CHI DIURNO. AF_12/2014","CHI","0,0005000","70,93",0.03]
[null,"PRODUÇÃO DA EQUIPE",null,null,1,"CUSTO ",null,{"$f":"SUM(H295:H296)","v":0.48}]
[null,"TOTAL",{"$nulls":5},{"$f":"H297/E297","v":0.48}]
[null,"BDI                %",{"$nulls":5},{"$f":"1+$M$2","v":1.1499999999999999}]
[null,"TOTAL DO SERVIÇO - R$",{"$nulls":5},{"$f":"H298*H299","v":0.55199999999999994}]
[]
[17,"CODEVASF",null,null," COMPOSIÇÃO DE PREÇO UNITÁRIO",null,null,null,{"$f":"H309","v":6754.08},{"$f":"H311","v":7767.1919999999991}]
[null,"OBRA:  ",{"$f":"$C$2","v":" PAVIMENTAÇÃO ASFÁLTICA EM PMF - COMUNIDADE LAGOA DOURADA (TAIOBEIRAS-MG)"},null,null,null,"DATA: ",{"$f":"$H$2","v":"SETEMBRO DE 2022"}]
[null,"SERVIÇO:  ",{"$f":"VLOOKUP(A302,ORÇAMENTO!$A$10:$I$44,3,0)","v":"AQUISIÇÃO DE ASFALTO DILUIDO DE PETROLEO CM-30 - EXCLUSIVE TRANSPORTE"},null,"SINAPI",{"$f":"VLOOKUP(A302,ORÇAMENTO!$A$10:$I$44,4,0)","v":"CPU.4"},"UNIDADE: ",{"$f":"VLOOKUP(A302,ORÇAMENTO!$A$10:$I$44,5,0)","v":"T"}]
[]
[null,"TIPO ITEM","CODIGO ITEM","DESCRIÇÃO ITEM","UNIDADE ITEM","COEFICIENTE","PRECO UNITARIO","CUSTO TOTAL"]
[null,"INSUMO","ANP","ASFALTO DILUIDO CM-30 (COLETA ANP INCLUINDO ICMS)","T",1,{"$f":"5.53835*1000*1.2195122","v":6754.0853928700008},{"$f":"ROUNDDOWN(F307*G307,2)","v":6754.08}]
[null,"PRODUÇÃO DA EQUIPE",null,null,1,"CUSTO ",null,{"$f":"SUM(H307:H307)","v":6754.08}]
[null,"TOTAL",{"$nulls":5},{"$f":"H308/E308","v":6754.08}]
[null,"BDI                %",{"$nulls":5},{"$f":"1+$M$2","v":1.1499999999999999}]
[null,"TOTAL DO SERVIÇO - R$",{"$nulls":5},{"$f":"H309*H310","v":7767.1919999999991}]
[]
[18,"CODEVASF",null,null," COMPOSIÇÃO DE PREÇO UNITÁRIO",null,null,null,{"$f":"H320","v":4222.34},{"$f":"H322","v":4855.6909999999998}]
[null,"OBRA:  ",{"$f":"$C$2","v":" PAVIMENTAÇÃO ASFÁLTICA EM PMF - COMUNIDADE LAGOA DOURADA (TAIOBEIRAS-MG)"},null,null,null,"DATA: ",{"$f":"$H$2","v":"SETEMBRO DE 2022"}]
[null,"SERVIÇO:  ",{"$f":"VLOOKUP(A313,ORÇAMENTO!$A$10:$I$44,3,0)","v":"AQUISIÇÃO DE EMULSAO ASFALTICA CATIONICA RR-2C - EXCLUSIVE TRANSPORTE"},null,"SINAPI",{"$f":"VLOOKUP(A313,ORÇAMENTO!$A$10:$I$44,4,0)","v":"CPU.5"},"UNIDADE: ",{"$f":"VLOOKUP(A313,ORÇAMENTO!$A$10:$I$44,5,0)","v":"T"}]
[]
[null,"TIPO ITEM","CODIGO ITEM","DESCRIÇÃO ITEM","UNIDADE ITEM","COEFICIENTE","PRECO UNITARIO","CUSTO TOTAL"]
[null,"INSUMO","ANP","EMULSÃO ASFÁLTICA CATIÔNICA RR-2C (COLETA ANP INCLUINDO ICMS)","T",1,{"$f":"3.46232155755469*1000*1.2195122","v":4222.3433797609468},{"$f":"ROUNDDOWN(F318*G318,2)","v":4222.34}]
[null,"PRODUÇÃO DA EQUIPE",null,null,1,"CUSTO ",null,{"$f":"SUM(H318:H318)","v":4222.34}]
[null,"TOTAL",{"$nulls":5},{"$f":"H319/E319","v":4222.34}]
[null,"BDI                %",{"$nulls":5},{"$f":"1+$M$2","v":1.1499999999999999}]
[null,"TOTAL DO SERVIÇO - R$",{"$nulls":5},{"$f":"H320*H321","v":4855.6909999999998}]
[]
[19,"CODEVASF",null,null," COMPOSIÇÃO DE PREÇO UNITÁRIO",null,null,null,{"$f":"H331","v":3859.3},{"$f":"H333","v":4438.1949999999997}]
[null,"OBRA:  ",{"$f":"$C$2","v":" PAVIMENTAÇÃO ASFÁLTICA EM PMF - COMUNIDADE LAGOA DOURADA (TAIOBEIRAS-MG)"},null,null,null,"DATA: ",{"$f":"$H$2","v":"SETEMBRO DE 2022"}]
[null,"SERVIÇO:  ",{"$f":"VLOOKUP(A324,ORÇAMENTO!$A$10:$I$44,3,0)","v":"AQUISIÇÃO DE EMULSAO ASFALTICA CATIONICA RL-1C  - EXCLUSIVE TRANSPORTE"},null,"SINAPI",{"$f":"VLOOKUP(A324,ORÇAMENTO!$A$10:$I$44,4,0)","v":"CPU.6"},"UNIDADE: ",{"$f":"VLOOKUP(A324,ORÇAMENTO!$A$10:$I$44,5,0)","v":"T"}]
[]
[null,"TIPO ITEM","CODIGO ITEM","DESCRIÇÃO ITEM","UNIDADE ITEM","COEFICIENTE","PRECO UNITARIO","CUSTO TOTAL"]
[null,"INSUMO","ANP","EMULSAO ASFALTICA CATIONICA RL-1C PARA USO EM PAVIMENTACAO ASFALTICA (COLETADO ANP ACRESCIDO DE ICMS)","T",1,{"$f":"3.16462882351293*1.2195122*1000","v":3859.303458745665},{"$f":"ROUNDDOWN(F329*G329,2)","v":3859.3}]
[null,"PRODUÇÃO DA EQUIPE",null,null,1,"CUSTO ",null,{"$f":"SUM(H329:H329)","v":3859.3}]
[null,"TOTAL",{"$nulls":5},{"$f":"H330/E330","v":3859.3}]
[null,"BDI                %",{"$nulls":5},{"$f":"1+$M$2","v":1.1499999999999999}]
[null,"TOTAL DO SERVIÇO - R$",{"$nulls":5},{"$f":"H331*H332","v":4438.1949999999997}]

{"sheet":"BDI SERV","index":2,"n_rows":37,"n_cols":5,"rows_kept":37,"cut":false,"hidden":false,"merged":[[36,0,36,5],[3,1,4,1],[3,2,4,2],[0,1,2,4],[32,0,34,5],[28,0,28,5],[30,1,30,2],[31,1,31,2]]}
[null,"DETALHAMENTO DO BDI - SERVIÇOS"]
[]
[]
[null,"Item","Descrição dos Serviços","%","%"]
[null,null,null,"PV","CD"]
[]
[null,1,"ADMINISTRAÇÃO CENTRAL"," ",4]
[null,"1.1","ESCRITÓRIO CENTRAL"," "," "]
[null,"1.2","VIAGENS"," "," "]
[null,"1.3","OUTROS"," "," "]
[null," "," "," "," "]
[null,2,"IMPOSTOS E TAXAS",{"$f":"SUM(D13:D16)","v":6.65},{"$f":"SUM(E13:E16)","v":8.31}]
[null,"2.1","ISS (*)",3,{"$f":"ROUND(D13*1.2515,2)","v":3.75}]
[null,"2.2","PIS",0.65,0.81]
[null,"2.3","Cofins",3,3.75]
[null,"2.4","CONTRIBUIÇÃO PREVIDENCIÁRIA SOBRE A RENDA BRUTA",0,0]
[]
[null,3,"TAXA DE RISCO"," ",{"$f":"SUM(E19:E22)","v":0.82000000000000006}]
[null,"3.1","SEGURO",null,0.16]
[null,"3.2","RISCO",null,0.5]
[null,"3.3","GARANTIA",null,0.16]
[]
[null,4,"DESPESAS FINANCEIRAS"," ",1.02]
[]
[null,5,"LUCRO",null,6.8]
[]
[null," ","BDI - CALCULADO"," ",{"$f":"ROUND((((1+(E7+E18)/100)*(1+E23/100)*(1+E25/100)/(1-D12/100)-1)*100),2)","v":21.15}]
[]
["BDI = ((1+((AC+S+R+G)/100))x(1+DF/100)x(1+L/100)/(1-I/100)-1)*100"]
[]
[null,"BDI (CALCULADO):",null,{"$f":"ROUND((((1+((E7+E18)/100))*(1+E23/100)*(1+E25/100))/(1-D12/100)-1)*100,2)","v":21.15},"%"]
[null," "]
["(*) ISS CONFORME LEI COMPLEMENTAR Nº 009 DE 28 DE DEZEMBRO DE 2009, DE ACORDO COM DECLARAÇÃO EM ANEXO\n"]
[]
[]
[]
["BDI EM CONFORMIDADE COM OS ACÓRDÃOS Nº 2369/2011 e ACÓRDÃO Nº 2.622/2013 - TCU - PLENÁRIO"]

{"sheet":"BDI FORN","index":3,"n_rows":37,"n_cols":5,"rows_kept":37,"cut":false,"hidden":false,"merged":[[32,0,34,5],[36,0,36,5],[0,1,2,4],[3,1,4,1],[3,2,4,2],[28,0,28,5],[30,1,30,2],[31,1,31,2]]}
[null,"DETALHAMENTO DO BDI - FORNECIMENTO \n(MATERIAL ASFÁLTICO)"]
[]
[]
[null,"Item","Descrição dos Serviços","%","%"]
[null,null,null,"PV","CD"]
[]
[null,1,"ADMINISTRAÇÃO CENTRAL"," ",3.72]
[null,"1.1","ESCRITÓRIO CENTRAL"," "," "]
[null,"1.2","VIAGENS"," "," "]
[null,"1.3","OUTROS"," "," "]
[null," "," "," "," "]
[null,2,"IMPOSTOS E TAXAS",{"$f":"SUM(D13:D16)","v":3.65},{"$f":"SUM(E13:E16)","v":4.5600000000000005}]
[null,"2.1","ISS (*)",null,{"$f":"ROUND(D13*1.2515,2)","v":0}]
[null,"2.2","PIS",0.65,0.81]
[null,"2.3","Cofins",3,3.75]
[null,"2.4","CONTRIBUIÇÃO PREVIDENCIÁRIA SOBRE A RENDA BRUTA",0,0]
[]
[null,3,"TAXA DE RISCO"," ",{"$f":"SUM(E19:E22)","v":0.92}]
[null,"3.1","SEGURO",null,0.16]
[null,"3.2","RISCO",null,0.6]
[null,"3.3","GARANTIA",null,0.16]
[]
[null,4,"DESPESAS FINANCEIRAS"," ",0.85]
[]
[null,5,"LUCRO",null,5]
[]
[null," ","BDI - CALCULADO"," ",{"$f":"ROUND((((1+(E7+E18)/100)*(1+E23/100)*(1+E25/100)/(1-D12/100)-1)*100),2)","v":15}]
[]
["BDI = ((1+((AC+S+R+G)/100))x(1+DF/100)x(1+L/100)/(1-I/100)-1)*100"]
[]
[null,"BDI (CALCULADO):",null,{"$f":"ROUND((((1+((E7+E18)/100))*(1+E23/100)*(1+E25/100))/(1-D12/100)-1)*100,2)","v":15},"%"]
[null," "]
[]
[]
[]
[]
["BDI EM CONFORMIDADE COM OS ACÓRDÃOS Nº 2369/2011 e ACÓRDÃO Nº 2.622/2013 - TCU - PLENÁRIO"]

{"sheet":"CRONOGRAMA","index":4,"n_rows":21,"n_cols":9,"rows_kept":21,"cut":false,"hidden":false,"merged":[[7,0,8,0],[9,0,10,0],[11,0,12,0],[0,1,0,8],[1,6,1,8],[2,6,2,8],[3,1,3,6],[5,0,6,0],[5,2,6,2],[1,1,2,1],[5,1,6,1],[1,2,2,4],[7,2,8,2],[9,2,10,2],[11,2,12,2],[7,1,8,1],[20,1,24,8],[9,1,10,1],[11,1,12,1],[15,1,16,1],[15,2,16,2],[15,0,16,0],[13,1,14,1],[13,0,14,0],[13,2,14,2],[17,1,18,2]]}
[null,"CRONOGRAMA FÍSICO-FINANCEIRO"]
[null,"OBRA: ",{"$f":"ORÇAMENTO!C5","v":" PAVIMENTAÇÃO ASFÁLTICA EM PMF - COMUNIDADE LAGOA DOURADA (TAIOBEIRAS-MG)"},null,null,"VALOR:",{"$f":"ORÇAMENTO!I37","v":294975.77}]
[{"$nulls":5},"PRAZO: ","90 DIAS "]
[]
[null,"ITEM","ETAPAS/DESCRIÇAO","FISICO/  FINANCEIRO","TOTAL    ETAPAS","MÊS 1","MÊS 2","MÊS 3","TOTAL"]
["A",{"$f":"VLOOKUP(A6,ORÇAMENTO!$A$9:$I$37,2)","v":1},{"$f":"VLOOKUP(A6,ORÇAMENTO!$A$9:$I$37,3)","v":"SERVIÇOS PRELIMINARES "},"FISICO ",{"$f":"ROUND(E7/$G$2,4)","v":0.10929999999999999},0.35,0.3,0.35,{"$f":"SUM(F6:H6)","v":0.99999999999999989}]
[null,null,null,"FINANCEIRO",{"$f":"ORÇAMENTO!I9","v":32228.73},{"$f":"ROUND($E$7*F6,2)","v":11280.06},9668.6200000000008,11280.06,{"$f":"SUM(F7:H7)-0.01","v":32228.73}]
["B",{"$f":"VLOOKUP(A8,ORÇAMENTO!$A$9:$I$37,2)","v":2},{"$f":"VLOOKUP(A8,ORÇAMENTO!$A$9:$I$37,3)","v":"PAVIMENTAÇÃO"},"FISICO ",{"$f":"ROUND(E9/$G$2,4)","v":0.22900000000000001},0.3,0.5,0.2,{"$f":"SUM(F8:H8)","v":1}]
[null,null,null,"FINANCEIRO",{"$f":"ORÇAMENTO!I15","v":67550.3},{"$f":"ROUND($E$9*F8,2)","v":20265.09},33775.15,13510.06,67550.3]
["C",{"$f":"VLOOKUP(A10,ORÇAMENTO!$A$9:$I$37,2)","v":3},{"$f":"VLOOKUP(A10,ORÇAMENTO!$A$9:$I$37,3)","v":"TRANSPORTE DE MATERIAIS"},"FISICO ",{"$f":"ROUND(E11/$G$2,4)","v":6.6799999999999998E-2},0.5,0.3,0.2,1]
[null,null,null,"FINANCEIRO",{"$f":"ORÇAMENTO!I24","v":19711.109999999997},{"$f":"ROUND($E$11*F10,2)","v":9855.56},{"$f":"ROUND($E$11*G10,2)","v":5913.33},3942.22,19711.11]
["E",{"$f":"VLOOKUP(A12,ORÇAMENTO!$A$9:$I$37,2)","v":4},{"$f":"VLOOKUP(A12,ORÇAMENTO!$A$9:$I$37,3)","v":"OBRAS COMPLEMENTARES"},"FISICO ",{"$f":"ROUND(E13/$G$2,4)","v":0.2329},null,0.2,0.8,1]
[null,null,null,"FINANCEIRO",{"$f":"ORÇAMENTO!I28","v":68706.59},{"$f":"ROUND($E$13*F12,2)","v":0},13741.32,54965.27,68706.59]
["F",{"$f":"VLOOKUP(A14,ORÇAMENTO!$A$9:$I$37,2)","v":5},{"$f":"VLOOKUP(A14,ORÇAMENTO!$A$9:$I$37,3)","v":"TRANSPORTE DE MATERIAL ASFÁLTICO (BDI DIFERENCIADO)"},"FISICO ",{"$f":"ROUND(E15/$G$2,4)","v":3.4200000000000001E-2},null,0.7,0.3,1]
[null,null,null,"FINANCEIRO",{"$f":"ORÇAMENTO!I30","v":10098.15},{"$f":"ROUND($E$15*F14,2)","v":0},{"$f":"ROUND($E$15*G14,2)","v":7068.71},{"$f":"ROUND($E$15*H14,2)","v":3029.45},10098.16]
["G",{"$f":"VLOOKUP(A16,ORÇAMENTO!$A$9:$I$37,2)","v":6},{"$f":"VLOOKUP(A16,ORÇAMENTO!$A$9:$I$37,3)","v":"FORNECIMENTOS - MATERIAL ASFÁLTICO (BDI DIFERENCIADO)"},"FISICO ",{"$f":"ROUND(E17/$G$2,4)","v":0.32779999999999998},null,0.7,0.3,{"$f":"SUM(F16:H16)","v":1}]
[null,null,null,"FINANCEIRO",{"$f":"ORÇAMENTO!I33","v":96680.890000000014},{"$f":"ROUND($E$13*F16,2)","v":0},{"$f":"ROUND($E$17*G16,2)","v":67676.62},{"$f":"ROUND($E$17*H16,2)","v":29004.27},96680.89]
[null,"TOTAL",null,"FISICO ",{"$f":"SUM(F18:H18)","v":0.99999999999999989},{"$f":"F19/E19","v":0.14035291780067222},{"$f":"G19/E19","v":0.4673052976520749},{"$f":"H19/E19","v":0.39234178454725277},0.99999999999999989]
[null,null,null,"FINANCEIRO",{"$f":"E11+E9+E7+E13+E17+E15","v":294975.77},{"$f":"F11+F9+F7+F13+F17+F15","v":41400.71},{"$f":"G11+G9+G7+G13+G17+G15-0.01","v":137843.74},{"$f":"H11+H9+H7+H13+H17+H15-0.01","v":115731.31999999999},{"$f":"SUM(F19:H19)","v":294975.76999999996}]
[]
[null,"OBSERVAÇÕES:"]