{"text_format":"2","workbook":"xlsx","n_sheets":4,"sheets":["ORÇAMENTO","CPU","BDI SERV","CRONOGRAMA"],"not_rendered":{"charts":0,"images":2,"macros":0,"external_links":0,"defined_names":4,"comments":1,"pivot_tables":0},"unopened":[],"bounds":{"document_bytes":16777216,"sheet_cells":100000,"run_cost":"one","rows_first":2000,"rows_last":500,"rows_between":2000,"halvings":0,"cell_chars":16384,"cell_head_chars":4096},"cells_cut":0,"cells_raw":0,"read":"whole","date_system":"1900"}

{"sheet":"ORÇAMENTO","index":0,"n_rows":33,"n_cols":10,"rows_kept":33,"cut":false,"hidden":false,"merged":[[6,6,6,7],[32,1,32,2],[0,0,7,0],[0,2,0,8],[1,2,1,8],[2,2,2,8],[4,2,4,8],[5,6,5,7],[18,6,18,7]]}
["<---- NUMERAR SERVIÇOS PARA CPU",null,"Ministério do Desenvolvimento Regional"]
[null,null,"Companhia de Desenvolvimento dos Vales do São Francisco e do Parnaíba"]
[null,null,"1ª Superintendência Regional"]
[]
[null,"OBRA: ","PAVIMENTAÇÃO EM POLIÉDRICO - RUA PEQUIRA E RUA PARÁ DE MINAS - CONCEIÇÃO DO PARÁ / MG"]
[null,"DATA:","OUTUBRO/2022",null,null,null,"BDI Serviços:",null,{"$f":"'BDI SERV'!D31/100","v":0.21050000000000002}]
[null,"PRAZO DE EXECUÇÃO:     90 DIAS"]
[null,"ITEM","DISCRIMINAÇÃO","REFER.","UNID.","QUANT.","P. UNITÁRIO","P.UNIT.C/ BDI","P. TOTAL",{"$f":"I33","v":298750.43}]
["A",1,"SERVIÇOS PRELIMINARES ",{"$nulls":5},{"$f":"SUM(I10:I14)","v":29068.890000000003},{"$f":"I9/I33","v":9.7301583800230865E-2}]
[1,"1.1","MOBILIZAÇÃO E DESMOBILIZAÇÃO","CPU","GL",1,{"$f":"VLOOKUP(A10,CPU!$A$1:$N$4479,9)","v":2163.84},{"$f":"VLOOKUP(A10,CPU!$A$1:$N$4479,10)","v":2619.3283200000005},{"$f":"ROUND(F10*H10,2)","v":2619.33},{"$f":"I10/$I$33","v":8.7676191796610976E-3}]
[2,"1.2","ADMINISTRAÇÃO LOCAL","CPU","GL",1,{"$f":"VLOOKUP(A11,CPU!$A$1:$N$4479,9)","v":17686.016860168602},{"$f":"VLOOKUP(A11,CPU!$A$1:$N$4479,10)","v":21408.933409234094},{"$f":"ROUND(F11*H11,2)","v":21408.93},{"$f":"I11/I33","v":7.1661587231857712E-2}]
[3,"1.3","CANTEIRO DE OBRAS","CPU","GL",1,{"$f":"VLOOKUP(A12,CPU!$A$1:$N$4479,9)","v":2758.5},{"$f":"VLOOKUP(A12,CPU!$A$1:$N$4479,10)","v":3339.1642500000003},{"$f":"ROUND(F12*H12,2)","v":3339.16},{"$f":"I12/$I$33","v":1.1177088514985568E-2}]
[4,"1.4","PLACA DE OBRA EM CHAPA DE AÇO GALVANIZADO","74209/001","M2",2,{"$f":"VLOOKUP(A13,CPU!$A$1:$N$4479,9)","v":594},{"$f":"VLOOKUP(A13,CPU!$A$1:$N$4479,10)","v":719.03700000000003},{"$f":"ROUND(F13*H13,2)","v":1438.07},4.8136165025770838E-3]
[5,"1.5","LOCAÇÃO DE PAVIMENTAÇÃO",99064,"M",340,{"$f":"VLOOKUP(A14,CPU!$A$1:$N$4479,9)","v":0.64},{"$f":"VLOOKUP(A14,CPU!$A$1:$N$4479,10)","v":0.77472000000000008},{"$f":"ROUND(F14*H14,2)","v":263.39999999999998},8.8167237114939042E-4]
["B",2,"PAVIMENTAÇÃO",{"$nulls":5},{"$f":"SUM(I16:I21)","v":119458.68},0.39986111484425307]
[6,"2.1","ESCAVAÇÃO HORIZONTAL EM SOLO DE 1A CATEGORIA COM TRATOR DE ESTEIRAS",101116,"M3",380.00252999999998,{"$f":"VLOOKUP(A16,CPU!$A$1:$N$4479,9)","v":2.14},{"$f":"VLOOKUP(A16,CPU!$A$1:$N$4479,10)","v":2.5904700000000003},{"$f":"ROUND(F16*H16,2)","v":984.39},3.2950245460734565E-3]
[7,"2.2","CARGA, MANOBRA E DESCARGA DE SOLOS E MATERIAIS GRANULARES EM CAMINHÃO BASCULANTE - DESCARGA LIVRE",100976,"M3",380.00252999999998,{"$f":"VLOOKUP(A17,CPU!$A$1:$N$4479,9)","v":3.83},{"$f":"VLOOKUP(A17,CPU!$A$1:$N$4479,10)","v":4.6362150000000009},{"$f":"ROUND(F17*H17,2)","v":1761.77},5.897129587395071E-3]
[8,"2.3","REGULARIZAÇÃO E COMPACTAÇÃO DE SUBLEITO",100576,"M2",2420.0001999999999,{"$f":"VLOOKUP(A18,CPU!$A$1:$N$4479,9)","v":2.2200000000000002},{"$f":"VLOOKUP(A18,CPU!$A$1:$N$4479,10)","v":2.6873100000000005},{"$f":"ROUND(F18*H18,2)","v":6503.29},2.1768303396249505E-2]
[null,"2.4","AQUISIÇÃO DE CASCALHO PARA EXECUÇÃO DA BASE","-","M3",380.00252999999998,"A CARGO DA PREFEITURA",null,0,0]
[9,"2.5","EXECUÇÃO E COMPACTAÇÃO DE BASE E OU SUB BASE PARA PAVIMENTAÇÃO DE CASCALHO - EXCLUSIVE SOLO, ESCAVAÇÃO, CARGA E TRANSPORTE. ",96388,"M3",320.00187999999991,{"$f":"VLOOKUP(A20,CPU!$A$1:$N$4479,9)","v":10.57},{"$f":"VLOOKUP(A20,CPU!$A$1:$N$4479,10)","v":12.794985000000002},{"$f":"ROUND(F20*H20,2)","v":4094.42},1.3705151821873528E-2]
[10,"2.6","EXECUÇÃO DE PAVIMENTO EM PEDRAS POLIÉDRICAS, REJUNTAMENTO COM PÓ DE PEDRA",101170,"M2",2119.9991999999997,{"$f":"VLOOKUP(A21,CPU!$A$1:$N$4479,9)","v":41.35},{"$f":"VLOOKUP(A21,CPU!$A$1:$N$4479,10)","v":50.054175000000008},106114.81,0.35519550549266155]
["C",3,"TRANSPORTE DE MATERIAIS",{"$nulls":5},{"$f":"SUM(I23:I24)","v":32149.67},{"$f":"I22/I33","v":0.10761380326716181}]
[11,"3.1","TRANSPORTE COM CAMINHÃO BASCULANTE, EM VIA EM REVESTIMENTO PRIMÁRIO",95426,"M3XKM",6500.004283199999,{"$f":"VLOOKUP(A23,CPU!$A$1:$N$4479,9)","v":1.02},{"$f":"VLOOKUP(A23,CPU!$A$1:$N$4479,10)","v":1.2347100000000002},{"$f":"ROUND(F23*H23,2)","v":8025.62},{"$f":"I23/$I$33","v":2.6863961333879922E-2}]
[12,"3.2","TRANSPORTE COM CAMINHÃO BASCULANTE, EM VIA PAVIMENTADA",95427,"M3XKM",27299.996132300799,{"$f":"VLOOKUP(A24,CPU!$A$1:$N$4479,9)","v":0.73000000000000009},{"$f":"VLOOKUP(A24,CPU!$A$1:$N$4479,10)","v":0.88366500000000026},{"$f":"ROUND(F24*H24,2)","v":24124.05}]
["D",4,"DRENAGEM E OBRAS COMPLEMENTARES",{"$nulls":5},{"$f":"SUM(I26:I32)","v":118073.19},{"$f":"I25/I33","v":0.39522349808835422}]
[13,"4.1","GUIA (MEIO-FIO) E SARJETA CONJUGADOS DE CONCRETO, MOLDADA  IN LOCO COM EXTRUSORA, 45 CM BASE (15 CM DA GUIA + 30 CM DA SARJETA) X 22 CM ALTURA",94267,"M",1640,{"$f":"VLOOKUP(A26,CPU!$A$1:$N$4479,9)","v":50.220000000000006},{"$f":"VLOOKUP(A26,CPU!$A$1:$N$4479,10)","v":60.791310000000017},{"$f":"ROUND(F26*H26,2)","v":99697.75},{"$f":"I26/$I$33","v":0.33371583766423368}]
[14,"4.2","CAIXA PARA BOCA DE LOBO SIMPLES RETANGULAR, EM CONCRETO PRÉ-MOLDADO, DIMENSÕES CONFORME PROJETO",97935,"UNID.",2,{"$f":"VLOOKUP(A27,CPU!$A$1:$N$4479,9)","v":899.75},{"$f":"VLOOKUP(A27,CPU!$A$1:$N$4479,10)","v":1089.147375},{"$f":"ROUND(F27*H27,2)","v":2178.29},{"$f":"I27/$I$33","v":7.2913367856909861E-3}]
[15,"4.3","ESCAVAÇÃO MECANIZADA DE VALA COM PROF. ATÉ 1,5 M, EM SOLO DE 1A CATEGORIA, LOCAIS COM BAIXO NÍVEL DE INTERFERÊNCIA",90092,"M3",36,{"$f":"VLOOKUP(A28,CPU!$A$1:$N$4479,9)","v":6.13},{"$f":"VLOOKUP(A28,CPU!$A$1:$N$4479,10)","v":7.4203650000000003},{"$f":"ROUND(F28*H28,2)","v":267.13},{"$f":"I28/$I$33","v":8.9415770882739817E-4}]
[16,"4.4","PREPARO DE FUNDO DE VALA COM LARGURA MENOR QUE 1,5 M (ACERTO DO SOLO NATURAL)",101616,"M2",24,{"$f":"VLOOKUP(A29,CPU!$A$1:$N$4479,9)","v":5.53},{"$f":"VLOOKUP(A29,CPU!$A$1:$N$4479,10)","v":6.694065000000001},160.66,5.3777328454389167E-4]
[17,"4.5","TUBO DE CONCRETO PARA REDES COLETORAS DE ÁGUAS PLUVIAIS, DIÂMETRO DE 600 MM, JUNTA RÍGIDA - FORNECIMENTO E ASSENTAMENTO",92212,"M",30,{"$f":"VLOOKUP(A30,CPU!$A$1:$N$4479,9)","v":317.27999999999997},{"$f":"VLOOKUP(A30,CPU!$A$1:$N$4479,10)","v":384.06744000000003},11522.02,3.8567375451141611E-2]
[18,"4.6","REATERRO MANUAL DE VALAS COM COMPACTAÇÃO MECANIZADA",93382,"M3",28.001999999999999,{"$f":"VLOOKUP(A31,CPU!$A$1:$N$4479,9)","v":30.310000000000002},{"$f":"VLOOKUP(A31,CPU!$A$1:$N$4479,10)","v":36.690255000000008},1027.4000000000001,3.438990866054988E-3]
[19,"4.7","DESCIDA D´ÁGUA TIPO DEGRAU DN 600","ED-48665","M",3,{"$f":"VLOOKUP(A32,CPU!$A$1:$N$4479,9)","v":886.67},{"$f":"VLOOKUP(A32,CPU!$A$1:$N$4479,10)","v":1073.3140350000001},3219.94,1.0778026327861687E-2]
[null,"TOTAL GERAL DA OBRA COM BDI ",{"$nulls":6},{"$f":"SUM(I9,I15,I22,I25)","v":298750.43}]

{"sheet":"CPU","index":1,"n_rows":289,"n_cols":13,"rows_kept":289,"cut":false,"hidden":false,"merged":[[275,0,289,0],[275,1,275,3],[275,4,275,7],[275,10,275,11],[276,2,276,5],[277,2,277,3],[278,1,278,7],[285,1,285,3],[285,5,285,6],[286,1,286,6],[287,1,287,6],[288,1,288,6],[239,1,239,6],[260,0,274,0],[260,1,260,3],[260,4,260,7],[260,10,260,11],[261,2,261,5],[262,2,262,3],[263,1,263,7],[270,1,270,3],[270,5,270,6],[271,1,271,6],[272,1,272,6],[273,1,273,6],[192,0,213,0],[240,1,240,6],[241,1,241,6],[228,0,241,0],[243,0,259,0],[243,1,243,3],[243,4,243,7],[243,10,243,11],[244,2,244,5],[245,2,245,3],[246,1,246,7],[255,1,255,3],[255,5,255,6],[256,1,256,6],[257,1,257,6],[258,1,258,6],[228,1,228,3],[228,4,228,7],[228,10,228,11],[229,2,229,5],[230,2,230,3],[231,1,231,7],[238,1,238,3],[238,5,238,6],[209,1,209,3],[209,5,209,6],[210,1,210,6],[211,1,211,6],[212,1,212,6],[174,1,174,3],[174,4,174,7],[170,1,170,6],[171,1,171,6],[172,1,172,6],[192,1,192,3],[192,4,192,7],[193,2,193,5],[194,2,194,3],[195,1,195,7],[214,0,227,0],[214,1,214,3],[214,4,214,7],[214,10,214,11],[215,2,215,5],[216,2,216,3],[217,1,217,7],[223,1,223,3],[223,5,223,6],[224,1,224,6],[225,1,225,6],[226,1,226,6],[26,1,26,6],[27,1,27,6],[28,1,28,6],[30,1,30,3],[30,4,30,7],[41,1,41,3],[41,4,41,7],[77,5,77,6],[78,1,78,6],[42,2,42,5],[43,2,43,3],[44,1,44,7],[53,1,53,3],[53,5,53,6],[79,1,79,6],[80,1,80,6],[96,0,111,0],[113,0,130,0],[162,1,162,3],[162,4,162,7],[163,2,163,5],[164,2,164,3],[165,1,165,7],[113,1,113,3],[113,4,113,7],[114,2,114,5],[115,2,115,3],[116,1,116,7],[97,2,97,5],[98,2,98,3],[99,1,99,7],[108,1,108,3],[108,5,108,6],[109,1,109,6],[110,1,110,6],[111,1,111,6],[96,1,96,3],[96,4,96,7],[13,1,13,3],[13,4,13,7],[151,2,151,3],[152,1,152,7],[157,5,157,6],[158,1,158,6],[159,1,159,6],[160,1,160,6],[13,10,13,11],[14,2,14,5],[15,2,15,3],[16,1,16,7],[25,1,25,3],[25,5,25,6],[30,10,30,11],[31,2,31,5],[32,2,32,3],[33,1,33,7],[36,1,36,3],[36,5,36,6],[37,1,37,6],[38,1,38,6],[39,1,39,6],[41,10,41,11],[174,0,191,0],[169,1,169,3],[169,5,169,6],[149,0,161,0],[162,0,172,0],[127,5,127,6],[128,1,128,6],[129,1,129,6],[130,1,130,6],[135,1,135,7],[144,1,144,3],[144,5,144,6],[145,1,145,6],[127,1,127,3],[133,2,133,5],[134,2,134,3],[0,10,0,11],[1,2,1,5],[2,2,2,3],[3,1,3,7],[8,1,8,3],[8,5,8,6],[9,1,9,6],[10,1,10,6],[11,1,11,6],[69,10,69,11],[70,2,70,5],[54,1,54,6],[55,1,55,6],[56,1,56,6],[58,1,58,3],[58,4,58,7],[58,10,58,11],[59,2,59,5],[60,2,60,3],[61,1,61,7],[64,1,64,3],[64,5,64,6],[65,1,65,6],[66,1,66,6],[67,1,67,6],[69,1,69,3],[69,4,69,7],[141,10,141,14],[190,1,190,6],[149,10,149,11],[150,2,150,5],[0,0,12,0],[13,0,29,0],[30,0,40,0],[41,0,57,0],[58,0,68,0],[132,0,148,0],[157,1,157,3],[146,1,146,6],[147,1,147,6],[149,1,149,3],[149,4,149,7],[132,1,132,3],[132,4,132,7],[71,2,71,3],[72,1,72,7],[77,1,77,3],[0,1,0,3],[0,4,0,7],[132,10,132,11],[96,10,96,11],[141,8,141,9],[137,8,137,9],[192,10,192,11],[94,1,94,6],[69,0,80,0],[82,0,94,0],[82,1,82,3],[82,4,82,7],[83,2,83,5],[84,2,84,3],[85,1,85,7],[91,1,91,3],[91,5,91,6],[92,1,92,6],[93,1,93,6],[174,10,174,11],[175,2,175,5],[176,2,176,3],[177,1,177,7],[187,1,187,3],[187,5,187,6],[188,1,188,6],[189,1,189,6],[138,8,138,9]]}
[1,"CODEVASF",null,null," COMPOSIÇÃO DE PREÇO UNITÁRIO",null,null,null,{"$f":"H10","v":2163.84},{"$f":"H12","v":2619.3283200000005},"BDI CALCULADO:",null,{"$f":"ORÇAMENTO!I6","v":0.21050000000000002}]
[null,"OBRA:  ",{"$f":"ORÇAMENTO!C5","v":"PAVIMENTAÇÃO EM POLIÉDRICO - RUA PEQUIRA E RUA PARÁ DE MINAS - CONCEIÇÃO DO PARÁ / MG"},null,null,null,"DATA: ",{"$f":"ORÇAMENTO!C6","v":"OUTUBRO/2022"}]
[null,"SERVIÇO:  ",{"$f":"VLOOKUP(A1,ORÇAMENTO!A10:I27,3)","v":"MOBILIZAÇÃO E DESMOBILIZAÇÃO"},null,"Referência:",{"$f":"VLOOKUP(A1,ORÇAMENTO!A10:I27,4)","v":"CPU"},"UNIDADE: ",{"$f":"VLOOKUP(A1,ORÇAMENTO!A10:I27,5)","v":"GL"}]
[]
[null,"TIPO ITEM","CODIGO ITEM","DESCRIÇÃO ITEM","UNIDADE ITEM","COEFICIENTE","PRECO UNITARIO","CUSTO TOTAL"]
[null,"COMPOSICAO","5824","CAMINHÃO TOCO, PBT 16.000 KG, CARGA ÚTIL MÁX. 10.685 KG, DIST. ENTRE EIXOS 4,8 M, POTÊNCIA 189 CV, INCLUSIVE CARROCERIA FIXA ABERTA DE MADEIRA P/ TRANSPORTE GERAL DE CARGA SECA ","CHP",8,215.9,{"$f":"ROUNDDOWN(F6*G6,2)","v":1727.2}]
[null,"COMPOSICAO","5826","CAMINHÃO TOCO, PBT 16.000 KG, CARGA ÚTIL MÁX. 10.685 KG, DIST. ENTRE EIXOS 4,8 M, POTÊNCIA 189 CV, INCLUSIVE CARROCERIA FIXA ABERTA DE MADEIRA P/ TRANSPORTE GERAL DE CARGA SECA ","CHI",8,45.57,{"$f":"ROUNDDOWN(F7*G7,2)","v":364.56}]
[null,"COMPOSIÇÃO",88316,"SERVENTE COM ENCARGOS COMPLEMENTARES","H",4,18.02,72.08]
[null,"PRODUÇÃO DA EQUIPE",null,null,1,"CUSTO ",null,{"$f":"SUM(H6:H8)","v":2163.84}]
[null,"TOTAL",{"$nulls":5},{"$f":"H9/E9","v":2163.84}]
[null,"BDI                %",{"$nulls":5},{"$f":"1+$M$1","v":1.2105000000000001}]
[null,"TOTAL DO SERVIÇO - R$",{"$nulls":5},{"$f":"H10*H11","v":2619.3283200000005}]
[]
[{"$f":"A1+1","v":2},"CODEVASF",null,null," COMPOSIÇÃO DE PREÇO UNITÁRIO",null,null,null,{"$f":"H27","v":17686.016860168602},{"$f":"H29","v":21408.933409234094}]
[null,"OBRA:  ",{"$f":"$C$2","v":"PAVIMENTAÇÃO EM POLIÉDRICO - RUA PEQUIRA E RUA PARÁ DE MINAS - CONCEIÇÃO DO PARÁ / MG"},null,null,null,"DATA: ",{"$f":"$H$2","v":"OUTUBRO/2022"}]
[null,"SERVIÇO:  ",{"$f":"VLOOKUP(A14,ORÇAMENTO!$A$10:$I$27,3)","v":"ADMINISTRAÇÃO LOCAL"},null,"SINAPI","CPU","UNIDADE: ",{"$f":"VLOOKUP(A14,ORÇAMENTO!$A$10:$I$27,5)","v":"GL"}]
[]
[null,"TIPO ITEM","CODIGO ITEM","DESCRIÇÃO ITEM","UNIDADE ITEM","COEFICIENTE","PRECO UNITARIO","CUSTO TOTAL"]
[null,"INSUMO",14250,"ENERGIA ELÉTRICA","kwh",72,0.74875000000000003,{"$f":"ROUNDDOWN(F19*G19,2)","v":53.91}]
[null,"INSUMO",14583,"ÁGUA/ESGOTO ","m³",4,21.999500000000001,{"$f":"ROUNDDOWN(F20*G20,2)","v":87.99}]
[null,"COTAÇÃO","MERC.","TELEFONE (PLANO CONTROLE)","UNID",1,60,60]
[null,"COMPOSICAO",90777,"Engenheiro Civil Júnior com encargos complementares","H",22,100.51,2211.2199999999998]
[null,"COMPOSICAO",90776,"Encarregado Geral com encargos complementares","H",55,39.799999999999997,2189]
[null,"COMPOSICAO",88321,"Tecnico de Laboratório com encargos complementares","H",22,38.64,850.08]
[null,"COMPOSICAO",90772,"Auxiliar de escritório com encargos complementares","H",22,20.14,443.08]
[null,"PRODUÇÃO DA EQUIPE",null,null,0.33333000000000002,"CUSTO ",null,{"$f":"SUM(H19:H25)","v":5895.28}]
[null,"TOTAL",{"$nulls":5},{"$f":"H26/E26","v":17686.016860168602}]
[null,"BDI                %",{"$nulls":5},{"$f":"1+$M$1","v":1.2105000000000001}]
[null,"TOTAL DO SERVIÇO - R$",{"$nulls":5},{"$f":"H27*H28+0.01","v":21408.933409234094}]
[]
[{"$f":"A14+1","v":3},"CODEVASF",null,null," COMPOSIÇÃO DE PREÇO UNITÁRIO",null,null,null,{"$f":"H38","v":2758.5},{"$f":"H40","v":3339.1642500000003}]
[null,"OBRA:  ",{"$f":"$C$2","v":"PAVIMENTAÇÃO EM POLIÉDRICO - RUA PEQUIRA E RUA PARÁ DE MINAS - CONCEIÇÃO DO PARÁ / MG"},null,null,null,"DATA: ",{"$f":"$H$2","v":"OUTUBRO/2022"}]
[null,"SERVIÇO:  ",{"$f":"VLOOKUP(A31,ORÇAMENTO!$A$10:$I$27,3)","v":"CANTEIRO DE OBRAS"},null,"SINAPI",{"$f":"VLOOKUP(A31,ORÇAMENTO!$A$10:$I$27,4)","v":"CPU"},"UNIDADE: ",{"$f":"VLOOKUP(A31,ORÇAMENTO!$A$10:$I$27,5)","v":"GL"}]
[]
[null,"TIPO ITEM","CODIGO ITEM","DESCRIÇÃO ITEM","UNIDADE ITEM","COEFICIENTE","PRECO UNITARIO","CUSTO TOTAL"]
[null,"COTAÇÃO",10775,"ALUGUEL DE IMÓVEL OU CONTEINER QUE ATENDA AOS REQUISITOS MÍNIMOS PARA INSTALAÇÃO DO CANTEIRO DE OBRAS ","MÊS",3,919.5,{"$f":"ROUNDDOWN(F36*G36,2)","v":2758.5}]
[null,"PRODUÇÃO DA EQUIPE",null,null,1,"CUSTO ",null,{"$f":"SUM(H36:H36)","v":2758.5}]
[null,"TOTAL",{"$nulls":5},{"$f":"H37/E37","v":2758.5}]
[null,"BDI                %",{"$nulls":5},{"$f":"1+$M$1","v":1.2105000000000001}]
[null,"TOTAL DO SERVIÇO - R$",{"$nulls":5},{"$f":"H38*H39","v":3339.1642500000003}]
[]
[{"$f":"A31+1","v":4},"CODEVASF",null,null," COMPOSIÇÃO DE PREÇO UNITÁRIO",null,null,null,{"$f":"H55","v":594},{"$f":"H57","v":719.03700000000003}]
[null,"OBRA:  ",{"$f":"$C$2","v":"PAVIMENTAÇÃO EM POLIÉDRICO - RUA PEQUIRA E RUA PARÁ DE MINAS - CONCEIÇÃO DO PARÁ / MG"},null,null,null,"DATA: ",{"$f":"$H$2","v":"OUTUBRO/2022"}]
[null,"SERVIÇO:  ",{"$f":"VLOOKUP(A42,ORÇAMENTO!$A$10:$I$27,3)","v":"PLACA DE OBRA EM CHAPA DE AÇO GALVANIZADO"},null,"SINAPI",{"$f":"VLOOKUP(A42,ORÇAMENTO!$A$10:$I$27,4)","v":"74209/001"},"UNIDADE: ",{"$f":"VLOOKUP(A42,ORÇAMENTO!$A$10:$I$27,5)","v":"M2"}]
[]
[null,"TIPO ITEM","CODIGO ITEM","DESCRIÇÃO ITEM","UNIDADE ITEM","COEFICIENTE","PRECO UNITARIO","CUSTO TOTAL"]
[null,"INSUMO","4417","SARRAFO DE MADEIRA NAO APARELHADA *2,5 X 7* CM, MACARANDUBA, ANGELIM OU EQUIVALENTE DA REGIAO","M","1,0000000",12.458,{"$f":"ROUNDDOWN(F47*G47,2)","v":12.45}]
[null,"INSUMO","4491","PONTALETE DE MADEIRA NAO APARELHADA *7,5 X 7,5* CM (3 X 3 \") PINUS, MISTA OU EQUIVALENTE DA REGIAO","M","4,0000000",8.57,{"$f":"ROUNDDOWN(F48*G48,2)","v":34.28}]
[null,"INSUMO","4813","PLACA DE OBRA (PARA CONSTRUCAO CIVIL) EM CHAPA GALVANIZADA *N. 22*, ADESIVADA, DE *2,4 X 1,2* M","M2","1,0000000",480,480]
[null,"INSUMO","5075","PREGO DE ACO POLIDO COM CABECA 18 X 30 (2 3/4 X 10)","KG","0,1100000",23.4,2.57]
[null,"COMPOSICAO","88262","CARPINTEIRO DE FORMAS COM ENCARGOS COMPLEMENTARES","H","1,0000000",24.86,24.86]
[null,"COMPOSICAO","88316","SERVENTE COM ENCARGOS COMPLEMENTARES","H","2,0000000",18.02,36.04]
[null,"COMPOSICAO","94962","CONCRETO MAGRO PARA LASTRO, TRAÇO 1:4,5:4,5 (CIMENTO/ AREIA MÉDIA/ BRITA 1)  - PREPARO MECÂNICO COM BETONEIRA 400 L","M3","0,0100000",380.33,3.8]
[null,"PRODUÇÃO DA EQUIPE",null,null,1,"CUSTO ",null,{"$f":"SUM(H47:H53)","v":594}]
[null,"TOTAL",{"$nulls":5},{"$f":"H54/E54","v":594}]
[null,"BDI                %",{"$nulls":5},{"$f":"1+$M$1","v":1.2105000000000001}]
[null,"TOTAL DO SERVIÇO - R$",{"$nulls":5},{"$f":"H55*H56","v":719.03700000000003}]
[]
[{"$f":"A42+1","v":5},"CODEVASF",null,null," COMPOSIÇÃO DE PREÇO UNITÁRIO",null,null,null,{"$f":"H66","v":0.64},{"$f":"H68","v":0.77472000000000008}]
[null,"OBRA:  ",{"$f":"$C$2","v":"PAVIMENTAÇÃO EM POLIÉDRICO - RUA PEQUIRA E RUA PARÁ DE MINAS - CONCEIÇÃO DO PARÁ / MG"},null,null,null,"DATA: ",{"$f":"$H$2","v":"OUTUBRO/2022"}]
[null,"SERVIÇO:  ",{"$f":"VLOOKUP(A59,ORÇAMENTO!$A$10:$I$27,3)","v":"LOCAÇÃO DE PAVIMENTAÇÃO"},null,"SINAPI",{"$f":"VLOOKUP(A59,ORÇAMENTO!$A$10:$I$27,4)","v":99064},"UNIDADE: ",{"$f":"VLOOKUP(A59,ORÇAMENTO!$A$10:$I$27,5)","v":"M"}]
[]
[null,"TIPO ITEM","CODIGO ITEM","DESCRIÇÃO ITEM","UNIDADE ITEM","COEFICIENTE","PRECO UNITARIO","CUSTO TOTAL"]
[null,"COMPOSICAO","99058","LOCAÇÃO DE PONTO PARA REFERÊNCIA TOPOGRÁFICA","UN","0,0500000",12.96,{"$f":"ROUNDDOWN(F64*G64,2)","v":0.64}]
[null,"PRODUÇÃO DA EQUIPE",null,null,1,"CUSTO ",null,{"$f":"SUM(H64:H64)","v":0.64}]
[null,"TOTAL",{"$nulls":5},{"$f":"H65/E65","v":0.64}]
[null,"BDI                %",{"$nulls":5},{"$f":"1+$M$1","v":1.2105000000000001}]
[null,"TOTAL DO SERVIÇO - R$",{"$nulls":5},{"$f":"H66*H67","v":0.77472000000000008}]
[]
[{"$f":"A59+1","v":6},"CODEVASF",null,null," COMPOSIÇÃO DE PREÇO UNITÁRIO",null,null,null,{"$f":"H79","v":2.14},{"$f":"H81","v":2.5904700000000003}]
[null,"OBRA:  ",{"$f":"$C$2","v":"PAVIMENTAÇÃO EM POLIÉDRICO - RUA PEQUIRA E RUA PARÁ DE MINAS - CONCEIÇÃO DO PARÁ / MG"},null,null,null,"DATA: ",{"$f":"$H$2","v":"OUTUBRO/2022"},null,{"$f":"H96","v":0}]
[null,"SERVIÇO:  ",{"$f":"VLOOKUP(A70,ORÇAMENTO!$A$10:$I$27,3)","v":"ESCAVAÇÃO HORIZONTAL EM SOLO DE 1A CATEGORIA COM TRATOR DE ESTEIRAS"},null,"SINAPI",{"$f":"VLOOKUP(A70,ORÇAMENTO!$A$10:$I$27,4)","v":101116},"UNIDADE: ",{"$f":"VLOOKUP(A70,ORÇAMENTO!$A$10:$I$27,5)","v":"M3"}]
[]
[null,"TIPO ITEM","CODIGO ITEM","DESCRIÇÃO ITEM","UNIDADE ITEM","COEFICIENTE","PRECO UNITARIO","CUSTO TOTAL"]
[null,"COMPOSICAO","5847","TRATOR DE ESTEIRAS, POTÊNCIA 170 HP, PESO OPERACIONAL 19 T, CAÇAMBA 5,2 M3 - CHP DIURNO","CHP","0,0048000","274,81",{"$f":"ROUNDDOWN(F75*G75,2)","v":1.31}]
[null,"COMPOSICAO","5849","TRATOR DE ESTEIRAS, POTÊNCIA 170 HP, PESO OPERACIONAL 19 T, CAÇAMBA 5,2 M3 - CHI DIURNO","CHI","0,0082000","74,36",0.6]
[null,"COMPOSICAO","88316","SERVENTE COM ENCARGOS COMPLEMENTARES","H","0,0131000","18,02",0.23]
[null,"PRODUÇÃO DA EQUIPE",null,null,1,"CUSTO ",null,{"$f":"SUM(H75:H77)","v":2.14}]
[null,"TOTAL",{"$nulls":5},{"$f":"H78/E78","v":2.14}]
[null,"BDI                %",{"$nulls":5},{"$f":"1+$M$1","v":1.2105000000000001}]
{"$rows_left_out":210}
{"sheet":"BDI SERV","index":2,"n_rows":37,"n_cols":5,"rows_kept":37,"cut":false,"hidden":false,"merged":[[7,7,18,12],[36,0,36,5],[3,1,4,1],[3,2,4,2],[0,1,2,4],[32,0,34,5],[28,0,28,5],[30,1,30,2],[31,1,31,2]]}
[null,"DETALHAMENTO DO BDI - SERVIÇOS"]
[]
[]
[null,"Item","Descrição dos Serviços","%","%"]
[null,null,null,"PV","CD"]
[]
[null,1,"ADMINISTRAÇÃO CENTRAL"," ",3.8]
[null,"1.1","ESCRITÓRIO CENTRAL"," "," "]
[null,"1.2","VIAGENS"," "," "]
[null,"1.3","OUTROS"," "," "]
[null," "," "," "," "]
[null,2,"IMPOSTOS E TAXAS",{"$f":"SUM(D13:D16)","v":6.65},{"$f":"SUM(E13:E16)","v":8.31}]
[null,"2.1","ISS (*)",3,{"$f":"ROUND(D13*1.2515,2)","v":3.75}]
[null,"2.2","PIS",0.65,0.81]
[null,"2.3","Cofins",3,3.75]
[null,"2.4","CONTRIBUIÇÃO PREVIDENCIÁRIA SOBRE A RENDA BRUTA",0,0]
[]
[null,3,"TAXA DE RISCO"," ",{"$f":"SUM(E19:E22)","v":0.82000000000000006}]
[null,"3.1","SEGURO",null,0.16]
[null,"3.2","RISCO",null,0.5]
[null,"3.3","GARANTIA",null,0.16]
[]
[null,4,"DESPESAS FINANCEIRAS"," ",0.94]
[]
[null,5,"LUCRO",null,7]
[]
[null," ","BDI - CALCULADO"," ",{"$f":"ROUND((((1+(E7+E18)/100)*(1+E23/100)*(1+E25/100)/(1-D12/100)-1)*100),2)","v":21.05}]
[]
["BDI = ((1+((AC+S+R+G)/100))x(1+DF/100)x(1+L/100)/(1-I/100)-1)*100"]
[]
[null,"BDI (CALCULADO):",null,{"$f":"ROUND((((1+((E7+E18)/100))*(1+E23/100)*(1+E25/100))/(1-D12/100)-1)*100,2)","v":21.05},"%"]
[null," "]
["(*) ISS CONFORME DECLARAÇÃO DO MUNICÍPIO (EM ANEXO) "]
[]
[]
[" "]
["BDI EM CONFORMIDADE COM OS ACÓRDÃOS Nº 2369/2011 e ACÓRDÃO Nº 2.622/2013 - TCU - PLENÁRIO"]

{"sheet":"CRONOGRAMA","index":3,"n_rows":17,"n_cols":9,"rows_kept":17,"cut":false,"hidden":false,"merged":[[7,0,8,0],[9,0,10,0],[11,0,12,0],[0,1,0,8],[1,6,1,8],[2,6,2,8],[3,1,3,6],[5,0,6,0],[5,2,6,2],[1,1,2,1],[5,1,6,1],[1,2,2,4],[13,1,14,2],[16,1,20,8],[7,2,8,2],[9,2,10,2],[11,2,12,2],[7,1,8,1],[9,1,10,1],[11,1,12,1]]}
[null,"CRONOGRAMA FÍSICO-FINANCEIRO"]
[null,"OBRA: ",{"$f":"ORÇAMENTO!C5","v":"PAVIMENTAÇÃO EM POLIÉDRICO - RUA PEQUIRA E RUA PARÁ DE MINAS - CONCEIÇÃO DO PARÁ / MG"},null,null,"VALOR:",{"$f":"ORÇAMENTO!I33","v":298750.43}]
[{"$nulls":5},"PRAZO: ","90 DIAS "]
[]
[null,"ITEM","ETAPAS/DESCRIÇAO","FISICO/  FINANCEIRO","TOTAL    ETAPAS","MÊS 1","MÊS 2","MÊS 3","TOTAL"]
["A",{"$f":"VLOOKUP(A6,ORÇAMENTO!$A$9:$I$33,2)","v":1},{"$f":"VLOOKUP(A6,ORÇAMENTO!$A$9:$I$33,3)","v":"SERVIÇOS PRELIMINARES "},"FISICO ",{"$f":"ROUND(E7/$G$2,4)","v":9.7299999999999998E-2},0.4,0.3,0.3,{"$f":"SUM(F6:H6)","v":1}]
[null,null,null,"FINANCEIRO",{"$f":"ORÇAMENTO!I9","v":29068.890000000003},{"$f":"ROUND($E$7*F6,2)","v":11627.56},8720.67,8720.67,{"$f":"SUM(F7:H7)","v":29068.9}]
["B",{"$f":"VLOOKUP(A8,ORÇAMENTO!$A$9:$I$33,2)","v":2},{"$f":"VLOOKUP(A8,ORÇAMENTO!$A$9:$I$33,3)","v":"PAVIMENTAÇÃO"},"FISICO ",{"$f":"ROUND(E9/$G$2,4)","v":0.39989999999999998},0.3,0.4,0.3,{"$f":"SUM(F8:H8)","v":1}]
[null,null,null,"FINANCEIRO",{"$f":"ORÇAMENTO!I15","v":119458.68},{"$f":"ROUND($E$9*F8,2)","v":35837.599999999999},47783.47,35837.599999999999,119458.67000000001]
["C",{"$f":"VLOOKUP(A10,ORÇAMENTO!$A$9:$I$33,2)","v":3},{"$f":"VLOOKUP(A10,ORÇAMENTO!$A$9:$I$33,3)","v":"TRANSPORTE DE MATERIAIS"},"FISICO ",{"$f":"ROUND(E11/$G$2,4)","v":0.1076},0.5,0.5,null,1]
[null,null,null,"FINANCEIRO",{"$f":"ORÇAMENTO!I22","v":32149.67},{"$f":"ROUND($E$11*F10,2)","v":16074.84},{"$f":"ROUND($E$11*G10,2)","v":16074.84},0,32149.68]
["D",{"$f":"VLOOKUP(A12,ORÇAMENTO!$A$9:$I$33,2)","v":4},{"$f":"VLOOKUP(A12,ORÇAMENTO!$A$9:$I$33,3)","v":"DRENAGEM E OBRAS COMPLEMENTARES"},"FISICO ",{"$f":"ROUND(E13/$G$2,4)","v":0.3952},0,0.5,0.5,1]
[null,null,null,"FINANCEIRO",{"$f":"ORÇAMENTO!I25","v":118073.19},{"$f":"ROUND($E$13*F12,2)","v":0},{"$f":"ROUND($E$13*G12,2)","v":59036.6},{"$f":"ROUND($E$13*H12,2)","v":59036.6},118073.2]
[null,"TOTAL",null,"FISICO ",{"$f":"SUM(F14:H14)","v":1.0000000669455105},{"$f":"F15/E15","v":0.21268588634332677},{"$f":"G15/E15","v":0.4405536085755592},{"$f":"H15/E15","v":0.34676057202662436},{"$f":"SUM(F14:H14)","v":1.0000000669455105}]
[null,null,null,"FINANCEIRO",{"$f":"E11+E9+E7+E13","v":298750.43},{"$f":"F11+F9+F7+F13","v":63540},{"$f":"G11+G9+G7+G13","v":131615.57999999999},{"$f":"H11+H9+H7+H13","v":103594.87},{"$f":"SUM(F15:H15)","v":298750.44999999995}]
[]
[null,"OBSERVAÇÕES:"]