{"text_format":"2","workbook":"xlsx","n_sheets":5,"sheets":["ORÇAMENTO","CPU","BDI SERV","BDI FORN","CRONOGRAMA"],"not_rendered":{"charts":0,"images":2,"macros":0,"external_links":0,"defined_names":5,"comments":1,"pivot_tables":0},"unopened":[],"bounds":{"document_bytes":16777216,"sheet_cells":100000,"run_cost":"one","rows_first":2000,"rows_last":500,"rows_between":2000,"halvings":0,"cell_chars":16384,"cell_head_chars":4096},"cells_cut":0,"cells_raw":0,"read":"whole","date_system":"1900"}

{"sheet":"ORÇAMENTO","index":0,"n_rows":37,"n_cols":11,"rows_kept":37,"cut":false,"hidden":false,"merged":[[6,6,6,7],[36,1,36,2],[0,0,7,0],[0,2,0,8],[1,2,1,8],[2,2,2,8],[4,2,4,8],[5,6,5,7],[6,1,6,2]]}
["<---- NUMERAR SERVIÇOS PARA CPU",null,"Ministério do Desenvolvimento Regional"]
[null,null,"Companhia de Desenvolvimento dos Vales do São Francisco e do Parnaíba"]
[null,null,"1ª Superintendência Regional"]
[]
[null,"OBRA: "," PAVIMENTAÇÃO ASFÁLTICA EM CBUQ - DIVERSAS RUAS (MONTES CLAROS / MG)"]
[null,"DATA:","OUTUBRO / 2.021   ",null,null,null,"BDI Serviços:",null,{"$f":"'BDI SERV'!D31/100","v":0.22920000000000001}]
[null,"PRAZO DE EXECUÇÃO:     240 DIAS",{"$nulls":4},"BDI Serviços:",null,{"$f":"'BDI FORN'!D31/100","v":0.15}]
[null,"ITEM","DISCRIMINAÇÃO","REFER.","UNID.","QUANT.","P. UNITÁRIO","P.UNIT.C/ BDI","P. TOTAL",{"$f":"I37","v":9688537.6500000004},{"$f":"500000*0.955","v":477500}]
["A",1,"SERVIÇOS PRELIMINARES",{"$nulls":5},{"$f":"SUM(I10:I14)","v":418618.29},{"$f":"I9/$I$37","v":4.320758251891605E-2}]
[1,"1.1","MOBILIZAÇÃO E DESMOBILIZAÇÃO","CPU.1","GL",1,{"$f":"VLOOKUP(A10,CPU!$A$1:$N$4656,9)","v":5053.7599999999993},{"$f":"VLOOKUP(A10,CPU!$A$1:$N$4656,10)","v":6212.08},{"$f":"ROUND(F10*H10,2)","v":6212.08},{"$f":"I10/$I$37","v":6.4117828968750506E-4}]
[2,"1.2","ADMINISTRAÇÃO LOCAL","CPU.2","GL",1,{"$f":"VLOOKUP(A11,CPU!$A$1:$N$4656,9)","v":259895.2},{"$f":"VLOOKUP(A11,CPU!$A$1:$N$4656,10)","v":319463.18},{"$f":"ROUND(F11*H11,2)","v":319463.18},3.2973312541134621E-2]
[3,"1.3","CANTEIRO DE OBRAS","CPU.3","GL",1,{"$f":"VLOOKUP(A12,CPU!$A$1:$N$4656,9)","v":50391.149999999994},{"$f":"VLOOKUP(A12,CPU!$A$1:$N$4656,10)","v":61940.800000000003},{"$f":"ROUND(F12*H12,2)","v":61940.800000000003},6.3932042417154666E-3]
[4,"1.4","PLACA DE OBRA EM CHAPA DE AÇO GALVANIZADO","74209/001","M2",36,{"$f":"VLOOKUP(A13,CPU!$A$1:$N$4656,9)","v":551.75},{"$f":"VLOOKUP(A13,CPU!$A$1:$N$4656,10)","v":678.21},{"$f":"ROUND(F13*H13,2)","v":24415.56},2.5200459431563441E-3]
[5,"1.5","LOCAÇÃO DE PAVIMENTAÇÃO",99064,"M",9277,{"$f":"VLOOKUP(A14,CPU!$A$1:$N$4656,9)","v":0.57999999999999996},{"$f":"VLOOKUP(A14,CPU!$A$1:$N$4656,10)","v":0.71},{"$f":"ROUND(F14*H14,2)","v":6586.67},6.798415032221091E-4]
["B",2,"PAVIMENTAÇÃO",{"$nulls":5},{"$f":"SUM(I16:I22)","v":2390754},0.24676107854109439]
[6,"2.1","ESCAVAÇÃO HORIZONTAL EM SOLO DE 1A CATEGORIA ",101116,"M3",20070,{"$f":"VLOOKUP(A16,CPU!$A$1:$N$4656,9)","v":1.63},{"$f":"VLOOKUP(A16,CPU!$A$1:$N$4656,10)","v":2},{"$f":"ROUND(F16*H16,2)","v":40140},4.143040100587316E-3]
[7,"2.2","CARGA, MANOBRA E DESCARGA DE SOLOS E MATERIAIS GRANULARES EM CAMINHÃO BASCULANTE",100976,"M3",20070,{"$f":"VLOOKUP(A17,CPU!$A$1:$N$4656,9)","v":6.41},{"$f":"VLOOKUP(A17,CPU!$A$1:$N$4656,10)","v":7.88},{"$f":"ROUND(F17*H17,2)","v":158151.6},1.6323577996314027E-2]
[8,"2.3","REGULARIZAÇÃO DO SUBLEITO ","4011209a","M2",66900,{"$f":"VLOOKUP(A18,CPU!$A$1:$N$4656,9)","v":0.74919999999999987},{"$f":"VLOOKUP(A18,CPU!$A$1:$N$4656,10)","v":0.92},61548,6.3526614875672183E-3]
[9,"2.4","EXECUÇÃO E COMPACTAÇÃO DE BASE E OU SUB BASE PARA PAVIMENTAÇÃO DE BRITA GRADUADA SIMPLES - EXCLUSIVE TRANSPORTE",96396,"M3",9619.9999999999982,{"$f":"VLOOKUP(A19,CPU!$A$1:$N$4656,9)","v":146.07999999999998},{"$f":"VLOOKUP(A19,CPU!$A$1:$N$4656,10)","v":179.56},1727367.2,0.178289775237649]
[10,"2.5","IMPRIMAÇÃO COM ASFALTO DILUIDO CM-30",96401,"M2",64120,{"$f":"VLOOKUP(A20,CPU!$A$1:$N$4656,9)","v":0.99},{"$f":"VLOOKUP(A20,CPU!$A$1:$N$4656,10)","v":1.22},78226.399999999994,8.0741183887539508E-3]
[11,"2.6","PINTURA DE LIGAÇÃO COM EMULSÃO ASFÁLTICA RR-2C",96402,"M2",64120,{"$f":"VLOOKUP(A21,CPU!$A$1:$N$4656,9)","v":0.78},{"$f":"VLOOKUP(A21,CPU!$A$1:$N$4656,10)","v":0.96},61555.199999999997,6.3534046337736013E-3]
[12,"2.7","EXECUÇÃO DE PAVIMENTO COM APLICAÇÃO DE CONCRETO ASFÁLTICO USINADO A QUENTE (CBUQ), CAMADA DE ROLAMENTO - EXCLUSIVE TRANSPORTE",95995,"M3",2345.0000000000005,{"$f":"VLOOKUP(A22,CPU!$A$1:$N$4656,9)","v":91.509999999999991},{"$f":"VLOOKUP(A22,CPU!$A$1:$N$4656,10)","v":112.48},263765.59999999998,2.7224500696449268E-2]
["C",3,"TRANSPORTE DE MATERIAIS",{"$nulls":5},{"$f":"SUM(I24:I26)","v":683827},7.0581033454517259E-2]
[13,"3.1","TRANSPORTE COM CAMINHÃO BASCULANTE, EM VIA URBANA PAVIMENTADA",95877,"M3XKM",366349.99861871998,{"$f":"VLOOKUP(A24,CPU!$A$1:$N$4656,9)","v":1.36},{"$f":"VLOOKUP(A24,CPU!$A$1:$N$4656,10)","v":1.67},{"$f":"ROUND(F24*H24,2)","v":611804.5},6.314724905878856E-2]
[13.5,"3.2","TRANSPORTE COM CAMINHÃO CARROCERIA 9T, EM VIA URBANA PAVIMENTADA",100947,"TXKM",24950,{"$f":"VLOOKUP(A25,CPU!$A$1:$N$4656,9)","v":1.4900000000000002},{"$f":"VLOOKUP(A25,CPU!$A$1:$N$4656,10)","v":1.83},{"$f":"ROUND(F25*H25,2)","v":45658.5},4.7126307033549071E-3]
[14,"3.3","TRANSPORTE COM CAMINHÃO TANQUE DE TRANSPORTE DE MATERIAL ASFÁLTICO DE 30000 L, EM VIA URBANA PAVIMENTADA",102331,"TXKM",50700,{"$f":"VLOOKUP(A26,CPU!$A$1:$N$4656,9)","v":0.42000000000000004},{"$f":"VLOOKUP(A26,CPU!$A$1:$N$4656,10)","v":0.52},{"$f":"ROUND(F26*H26,2)","v":26364},2.7211536923737916E-3]
["D",4,"OBRAS COMPLEMENTARES",{"$nulls":5},{"$f":"SUM(I28:I32)","v":2073639.18},0.21403015139235176]
[15,"4.1","ASSENTAMENTO DE GUIA (MEIO-FIO) EM TRECHO RETO, CONFECCIONADA EM CONCRETO PRÉ-FABRICADO, DIMENSÕES 100X15X13X30 CM (COMPRIMENTO X BASE INFERIOR X BASE SUPERIOR X ALTURA), PARA VIAS URBANAS (USO VIÁRIO)",94273,"M",18554,{"$f":"VLOOKUP(A28,CPU!$A$1:$N$4656,9)","v":42.070000000000007},{"$f":"VLOOKUP(A28,CPU!$A$1:$N$4656,10)","v":51.71},{"$f":"ROUND(F28*H28,2)","v":959427.34},9.9027053891873967E-2]
[15.05,"4.2","EXECUÇÃO DE SARJETA DE CONCRETO USINADO, MOLDADA  IN LOCO  EM TRECHO RETO, 30 CM BASE X 15 CM ALTURA",94281,"M",18554,{"$f":"VLOOKUP(A29,CPU!$A$1:$N$4656,9)","v":45.3},{"$f":"VLOOKUP(A29,CPU!$A$1:$N$4656,10)","v":55.68},{"$f":"ROUND(F29*H29,2)","v":1033086.72},0.10662978844903388]
[15.1,"4.3","FORNECIMENTO E INSTALAÇÃO DE PLACA DE SINALIZAÇÃO VIÁRIA","CPU.4","UN.",39,{"$f":"VLOOKUP(A30,CPU!$A$1:$N$4656,9)","v":577.65},{"$f":"VLOOKUP(A30,CPU!$A$1:$N$4656,10)","v":710.05},{"$f":"ROUND(F30*H30,2)","v":27691.95},2.8582177208136255E-3]
[15.2,"4.4","PLACA DE AÇO ESMALTADA PARA IDENTIFICACAO DE RUA, *45 CM X 20* CM                                   ",13521,"UN.",75,{"$f":"VLOOKUP(A31,CPU!$A$1:$N$4656,9)","v":148.5},{"$f":"VLOOKUP(A31,CPU!$A$1:$N$4656,10)","v":182.54},{"$f":"ROUND(F31*H31,2)","v":13690.5},1.4130615470127218E-3]
[15.3,"4.5","PINTURA DE FAIXA COM TINTA ACRÍLICA - ESPESSURA DE 0,6 MM","5213401a","M2",1113.24,{"$f":"VLOOKUP(A32,CPU!$A$1:$N$4656,9)","v":29.0411},{"$f":"VLOOKUP(A32,CPU!$A$1:$N$4656,10)","v":35.700000000000003},{"$f":"ROUND(F32*H32,2)","v":39742.67},4.1020297836175511E-3]
["E",5,"FORNECIMENTOS - MATERIAL ASFÁLTICO (BDI DIFERENCIADO)",{"$nulls":5},{"$f":"SUM(I34:I36)","v":4121699.18},0.42542015409312056]
[17,"5.1","AQUISIÇÃO DE ASFALTO DILUIDO DE PETROLEO CM-30 - EXCLUSIVE TRANSPORTE","CPU.5","T",76.944000000000003,{"$f":"VLOOKUP(A34,CPU!$A$1:$N$4656,9)","v":6532.51},{"$f":"VLOOKUP(A34,CPU!$A$1:$N$4656,10)","v":7512.39},{"$f":"ROUND(F34*H34,2)","v":578033.34},5.9661567192237717E-2]
[18,"5.2","AQUISIÇÃO DE EMULSAO ASFALTICA CATIONICA RR-2C - EXCLUSIVE TRANSPORTE","CPU.6","T",28.853999999999999,{"$f":"VLOOKUP(A35,CPU!$A$1:$N$4656,9)","v":3690},{"$f":"VLOOKUP(A35,CPU!$A$1:$N$4656,10)","v":4243.5},{"$f":"ROUND(F35*H35,2)","v":122441.95},1.2637815367317068E-2]
[19,"5.3","AQUISIÇÃO DE CONCRETO BETUMINOSO USINADO A QUENTE (CBUQ) PARA PAVIMENTACAO ASFALTICA, PADRAO DNIT, FAIXA C, COM CAP 50/70 - EXCLUSIVE TRANSPORTE","CPU.7","T",5991.0060000000012,{"$f":"VLOOKUP(A36,CPU!$A$1:$N$4656,9)","v":496.57},{"$f":"VLOOKUP(A36,CPU!$A$1:$N$4656,10)","v":571.05999999999995},{"$f":"ROUND(F36*H36,2)","v":3421223.89},0.35312077153356575]
[null,"TOTAL GERAL DA OBRA COM BDI ",{"$nulls":6},{"$f":"SUM(I9,I15,I23,I27,I33)","v":9688537.6500000004},{"$f":"I37/F20","v":151.10008811603245}," / m²"]

{"sheet":"CPU","index":1,"n_rows":353,"n_cols":13,"rows_kept":353,"cut":false,"hidden":false,"merged":[[340,1,340,6],[341,1,341,6],[321,1,321,3],[321,4,321,7],[322,2,322,5],[323,2,323,3],[324,1,324,7],[327,1,327,3],[327,5,327,6],[328,1,328,6],[329,1,329,6],[330,1,330,6],[213,1,213,6],[180,0,201,0],[202,1,202,3],[343,0,352,0],[343,1,343,3],[343,4,343,7],[344,2,344,5],[345,2,345,3],[346,1,346,7],[349,1,349,3],[349,5,349,6],[350,1,350,6],[351,1,351,6],[352,1,352,6],[321,0,330,0],[332,0,341,0],[332,1,332,3],[332,4,332,7],[333,2,333,5],[334,2,334,3],[335,1,335,7],[338,1,338,3],[338,5,338,6],[339,1,339,6],[122,4,122,7],[123,2,123,5],[124,2,124,3],[125,1,125,7],[137,1,137,3],[137,5,137,6],[138,1,138,6],[139,1,139,6],[140,1,140,6],[228,10,228,11],[229,2,229,5],[230,2,230,3],[231,1,231,7],[235,1,235,3],[235,5,235,6],[228,4,228,7],[240,10,240,11],[241,2,241,5],[240,1,240,3],[240,4,240,7],[0,0,12,0],[13,0,30,0],[31,0,43,0],[44,0,60,0],[61,0,72,0],[73,0,85,0],[100,0,121,0],[142,0,160,0],[161,0,179,0],[86,0,98,0],[122,0,140,0],[180,1,180,3],[180,4,180,7],[163,2,163,3],[180,10,180,11],[181,2,181,5],[182,2,182,3],[183,1,183,7],[197,1,197,3],[197,5,197,6],[176,1,176,6],[177,1,177,6],[178,1,178,6],[162,2,162,5],[100,1,100,3],[100,4,100,7],[198,1,198,6],[228,0,239,0],[228,1,228,3],[185,8,185,9],[202,10,202,11],[203,2,203,5],[204,2,204,3],[205,1,205,7],[238,1,238,6],[236,1,236,6],[237,1,237,6],[199,1,199,6],[200,1,200,6],[210,1,210,3],[210,5,210,6],[211,1,211,6],[212,1,212,6],[164,1,164,7],[175,1,175,3],[175,5,175,6],[202,4,202,7],[100,10,100,11],[101,2,101,5],[102,2,102,3],[103,1,103,7],[117,1,117,3],[117,5,117,6],[161,10,161,11],[118,1,118,6],[119,1,119,6],[120,1,120,6],[142,1,142,3],[142,4,142,7],[142,10,142,11],[143,2,143,5],[144,2,144,3],[145,1,145,7],[156,1,156,3],[156,5,156,6],[157,1,157,6],[158,1,158,6],[159,1,159,6],[161,1,161,3],[161,4,161,7],[122,1,122,3],[73,10,73,11],[74,2,74,5],[75,2,75,3],[76,1,76,7],[81,1,81,3],[81,5,81,6],[82,1,82,6],[83,1,83,6],[84,1,84,6],[73,1,73,3],[73,4,73,7],[61,10,61,11],[62,2,62,5],[63,2,63,3],[64,1,64,7],[68,1,68,3],[68,5,68,6],[69,1,69,6],[70,1,70,6],[71,1,71,6],[61,1,61,3],[61,4,61,7],[44,10,44,11],[45,2,45,5],[46,2,46,3],[47,1,47,7],[56,1,56,3],[56,5,56,6],[57,1,57,6],[58,1,58,6],[59,1,59,6],[44,4,44,7],[31,10,31,11],[32,2,32,5],[33,2,33,3],[34,1,34,7],[32,8,33,9],[39,1,39,3],[39,5,39,6],[40,1,40,6],[41,1,41,6],[13,10,13,11],[14,2,14,5],[15,2,15,3],[16,1,16,7],[26,1,26,3],[26,5,26,6],[14,8,15,9],[0,1,0,3],[0,4,0,7],[0,10,0,11],[1,2,1,5],[2,2,2,3],[3,1,3,7],[8,1,8,3],[8,5,8,6],[9,1,9,6],[1,10,1,11],[10,1,10,6],[11,1,11,6],[13,1,13,3],[13,4,13,7],[252,1,252,6],[253,1,253,6],[256,0,271,0],[256,1,256,3],[256,4,256,7],[257,2,257,5],[258,2,258,3],[27,1,27,6],[28,1,28,6],[29,1,29,6],[98,1,98,6],[86,1,86,3],[86,4,86,7],[87,2,87,5],[88,2,88,3],[89,1,89,7],[95,1,95,3],[95,5,95,6],[96,1,96,6],[97,1,97,6],[31,1,31,3],[31,4,31,7],[42,1,42,6],[44,1,44,3],[273,0,289,0],[273,1,273,3],[273,4,273,7],[274,2,274,5],[275,2,275,3],[276,1,276,7],[286,1,286,3],[286,5,286,6],[287,1,287,6],[288,1,288,6],[289,1,289,6],[303,0,319,0],[303,1,303,3],[303,4,303,7],[304,2,304,5],[305,2,305,3],[306,1,306,7],[316,1,316,3],[316,5,316,6],[317,1,317,6],[318,1,318,6],[319,1,319,6],[291,0,301,0],[291,1,291,3],[291,4,291,7],[292,2,292,5],[293,2,293,3],[294,1,294,7],[298,1,298,3],[298,5,298,6],[299,1,299,6],[300,1,300,6],[301,1,301,6],[259,1,259,7],[268,1,268,3],[268,5,268,6],[269,1,269,6],[270,1,270,6],[271,1,271,6],[202,0,213,0],[215,0,226,0],[215,1,215,3],[215,4,215,7],[216,2,216,5],[217,2,217,3],[218,1,218,7],[223,1,223,3],[223,5,223,6],[224,1,224,6],[225,1,225,6],[226,1,226,6],[240,0,254,0],[254,1,254,6],[242,2,242,3],[243,1,243,7],[251,1,251,3],[251,5,251,6]]}
[1,"CODEVASF",null,null," COMPOSIÇÃO DE PREÇO UNITÁRIO",null,null,null,{"$f":"H10","v":5053.7599999999993},{"$f":"H12","v":6212.08},"BDI CALCULADO:",null,{"$f":"ORÇAMENTO!I6","v":0.22920000000000001}]
[null,"OBRA:  ",{"$f":"ORÇAMENTO!C5","v":" PAVIMENTAÇÃO ASFÁLTICA EM CBUQ - DIVERSAS RUAS (MONTES CLAROS / MG)"},null,null,null,"DATA: ",{"$f":"ORÇAMENTO!C6","v":"OUTUBRO / 2.021   "},null,null,"BDI DIFERENCIADO:",null,{"$f":"'BDI FORN'!D31/100","v":0.15}]
[null,"SERVIÇO:  ",{"$f":"VLOOKUP(A1,ORÇAMENTO!A10:I28,3)","v":"MOBILIZAÇÃO E DESMOBILIZAÇÃO"},null,"Referência:",{"$f":"VLOOKUP(A1,ORÇAMENTO!A10:I28,4)","v":"CPU.1"},"UNIDADE: ",{"$f":"VLOOKUP(A1,ORÇAMENTO!A10:I28,5)","v":"GL"}]
[]
[null,"TIPO ITEM","CODIGO ITEM","DESCRIÇÃO ITEM","UNIDADE ITEM","COEFICIENTE","PRECO UNITARIO","CUSTO TOTAL"]
[null,"COMPOSICAO",89876,"CAMINHÃO BASCULANTE 14 M3, COM CAVALO MECÂNICO DE CAPACIDADE MÁXIMA DE TRAÇÃO COMBINADO DE 36000 KG, POTÊNCIA 286 CV, INCLUSIVE SEMIREBOQUE COM CAÇAMBA METÁLICA","CHP DIURNO.",16,246.54,{"$f":"ROUNDDOWN(F6*G6,2)","v":3944.64}]
[null,"COMPOSICAO",89877,"CAMINHÃO BASCULANTE 14 M3, COM CAVALO MECÂNICO DE CAPACIDADE MÁXIMA DE TRAÇÃO COMBINADO DE 36000 KG, POTÊNCIA 286 CV, INCLUSIVE SEMIREBOQUE COM CAÇAMBA METÁLICA","CHI DIURNO.",16,53.61,{"$f":"ROUNDDOWN(F7*G7,2)","v":857.76}]
[null,"COMPOSIÇÃO",88316,"SERVENTE COM ENCARGOS COMPLEMENTARES","H",16,15.71,251.36]
[null,"PRODUÇÃO DA EQUIPE",null,null,1,"CUSTO ",null,{"$f":"SUM(H6:H8)","v":5053.7599999999993}]
[null,"TOTAL",{"$nulls":5},{"$f":"H9/E9","v":5053.7599999999993}]
[null,"BDI                %",{"$nulls":5},{"$f":"1+$M$1","v":1.2292000000000001}]
[null,"TOTAL DO SERVIÇO - R$",{"$nulls":5},{"$f":"ROUND(H10*H11,2)","v":6212.08}]
[]
[{"$f":"A1+1","v":2},"CODEVASF",null,null," COMPOSIÇÃO DE PREÇO UNITÁRIO",null,null,null,{"$f":"H28","v":259895.2},{"$f":"H30","v":319463.18}]
[null,"OBRA:  ",{"$f":"$C$2","v":" PAVIMENTAÇÃO ASFÁLTICA EM CBUQ - DIVERSAS RUAS (MONTES CLAROS / MG)"},null,null,null,"DATA: ",{"$f":"$H$2","v":"OUTUBRO / 2.021   "},"CALCULAR ÍNDICES PELO PORTE DA OBRA"]
[null,"SERVIÇO:  ",{"$f":"VLOOKUP(A14,ORÇAMENTO!$A$10:$I$28,3)","v":"ADMINISTRAÇÃO LOCAL"},null,"SINAPI","CPU","UNIDADE: ",{"$f":"VLOOKUP(A14,ORÇAMENTO!$A$10:$I$28,5)","v":"GL"}]
[]
[null,"TIPO ITEM","CODIGO ITEM","DESCRIÇÃO ITEM","UNIDADE ITEM","COEFICIENTE","PRECO UNITARIO","CUSTO TOTAL"]
[null,"INSUMO",14250,"ENERGIA ELÉTRICA","kwh",80,1.1599999999999999,{"$f":"ROUNDDOWN(F19*G19,2)","v":92.8}]
[null,"INSUMO",14583,"ÁGUA/ESGOTO ","m³",6,21.95,131.69999999999999]
[null,"COTAÇÃO","MERC.","TELEFONE (PLANO CONTROLE)","UNID",2,50,100]
[null,"INSUMO","ED-50155 SEINFRA","BANHEIRO QUÍMICO 110 X 120 X 230 CM COM MANUTENÇÃO (CONSIDERANDO OBRAS SIMULTÂNEAS)","MÊS",2,515,1030]
[null,"COMPOSICAO",90777,"Engenheiro Civil Júnior com encargos complementares","H",200,95.07,19014]
[null,"COMPOSICAO",90776,"Encarregado Geral com encargos complementares","H",200,42.26,8452]
[null,"COMPOSICAO",88321,"Tecnico de Laboratório com encargos complementares","H",80,29.17,2333.6]
[null,"COMPOSICAO",90772,"Auxiliar de escritório com encargos complementares","H",80,16.66,1332.8]
[null,"PRODUÇÃO DA EQUIPE",null,null,0.125,"CUSTO ",null,{"$f":"SUM(H19:H26)","v":32486.899999999998}]
[null,"TOTAL",{"$nulls":5},{"$f":"ROUND(H27/E27,2)","v":259895.2}]
[null,"BDI                %",{"$nulls":5},{"$f":"1+$M$1","v":1.2292000000000001}]
[null,"TOTAL DO SERVIÇO - R$",{"$nulls":5},{"$f":"ROUND(H28*H29,2)","v":319463.18}]
[]
[{"$f":"A14+1","v":3},"CODEVASF",null,null," COMPOSIÇÃO DE PREÇO UNITÁRIO",null,null,null,{"$f":"H41","v":50391.149999999994},{"$f":"H43","v":61940.800000000003}]
[null,"OBRA:  ",{"$f":"$C$2","v":" PAVIMENTAÇÃO ASFÁLTICA EM CBUQ - DIVERSAS RUAS (MONTES CLAROS / MG)"},null,null,null,"DATA: ",{"$f":"$H$2","v":"OUTUBRO / 2.021   "},"QUANTIDADES PELO PORTE E PRAZO DA OBRA"]
[null,"SERVIÇO:  ",{"$f":"VLOOKUP(A32,ORÇAMENTO!$A$10:$I$28,3)","v":"CANTEIRO DE OBRAS"},null,"SINAPI",{"$f":"VLOOKUP(A32,ORÇAMENTO!$A$10:$I$28,4)","v":"CPU.3"},"UNIDADE: ",{"$f":"VLOOKUP(A32,ORÇAMENTO!$A$10:$I$28,5)","v":"GL"}]
[]
[null,"TIPO ITEM","CODIGO ITEM","DESCRIÇÃO ITEM","UNIDADE ITEM","COEFICIENTE","PRECO UNITARIO","CUSTO TOTAL"]
[null,"COMPOSICAO",93207,"EXECUÇÃO DE ESCRITÓRIO EM CANTEIRO DE OBRA EM CHAPA DE MADEIRA COMPENSADA COM MOBILIÁRIO","M2",10,1239.17,{"$f":"ROUNDDOWN(F37*G37,2)","v":12391.7}]
[null,"COMPOSICAO",93208,"EXECUÇÃO DE ALMOXARIFADO EM CANTEIRO DE OBRA EM CHAPA DE MADEIRA COMPENSADA, INCLUSO PRATELEIRAS","M2",15,1088.51,16327.65]
[null,"COMPOSICAO",93312,"EXECUÇÃO DE SANITÁRIO E VESTIÁRIO EM CANTEIRO DE OBRA EM CHAPA DE MADEIRA COMPENSADA","M2",20,1083.5899999999999,{"$f":"ROUNDDOWN(F39*G39,2)","v":21671.8}]
[null,"PRODUÇÃO DA EQUIPE",null,null,1,"CUSTO ",null,{"$f":"SUM(H37:H39)","v":50391.149999999994}]
[null,"TOTAL",{"$nulls":5},{"$f":"H40/E40","v":50391.149999999994}]
[null,"BDI                %",{"$nulls":5},{"$f":"1+$M$1","v":1.2292000000000001}]
[null,"TOTAL DO SERVIÇO - R$",{"$nulls":5},{"$f":"ROUND(H41*H42,2)","v":61940.800000000003}]
[]
[{"$f":"A32+1","v":4},"CODEVASF",null,null," COMPOSIÇÃO DE PREÇO UNITÁRIO",null,null,null,{"$f":"H58","v":551.75},{"$f":"H60","v":678.21}]
[null,"OBRA:  ",{"$f":"$C$2","v":" PAVIMENTAÇÃO ASFÁLTICA EM CBUQ - DIVERSAS RUAS (MONTES CLAROS / MG)"},null,null,null,"DATA: ",{"$f":"$H$2","v":"OUTUBRO / 2.021   "}]
[null,"SERVIÇO:  ",{"$f":"VLOOKUP(A45,ORÇAMENTO!$A$10:$I$28,3)","v":"PLACA DE OBRA EM CHAPA DE AÇO GALVANIZADO"},null,"SINAPI",{"$f":"VLOOKUP(A45,ORÇAMENTO!$A$10:$I$28,4)","v":"74209/001"},"UNIDADE: ",{"$f":"VLOOKUP(A45,ORÇAMENTO!$A$10:$I$28,5)","v":"M2"}]
[]
[null,"TIPO ITEM","CODIGO ITEM","DESCRIÇÃO ITEM","UNIDADE ITEM","COEFICIENTE","PRECO UNITARIO","CUSTO TOTAL"]
[null,"INSUMO","4417","SARRAFO DE MADEIRA NAO APARELHADA *2,5 X 7* CM, MACARANDUBA, ANGELIM OU EQUIVALENTE DA REGIAO","M","1,0000000",13.06,{"$f":"ROUNDDOWN(F50*G50,2)","v":13.06}]
[null,"INSUMO","4491","PONTALETE DE MADEIRA NAO APARELHADA *7,5 X 7,5* CM (3 X 3 \") PINUS, MISTA OU EQUIVALENTE DA REGIAO","M","4,0000000",7.54,30.16]
[null,"INSUMO","4813","PLACA DE OBRA (PARA CONSTRUCAO CIVIL) EM CHAPA GALVANIZADA *N. 22*, ADESIVADA, DE *2,0 X 1,125* M","M2","1,0000000",450,450]
[null,"INSUMO","5075","PREGO DE ACO POLIDO COM CABECA 18 X 30 (2 3/4 X 10)","KG","0,1100000",19.79,2.17]
[null,"COMPOSICAO","88262","CARPINTEIRO DE FORMAS COM ENCARGOS COMPLEMENTARES","H","1,0000000",21.87,21.87]
[null,"COMPOSICAO","88316","SERVENTE COM ENCARGOS COMPLEMENTARES","H","2,0000000",15.71,31.42]
[null,"COMPOSICAO","94962","CONCRETO MAGRO PARA LASTRO, TRAÇO 1:4,5:4,5 (CIMENTO/ AREIA MÉDIA/ BRITA 1)","M3","0,0100000",307.48,3.07]
[null,"PRODUÇÃO DA EQUIPE",null,null,1,"CUSTO ",null,{"$f":"SUM(H50:H56)","v":551.75}]
[null,"TOTAL",{"$nulls":5},{"$f":"H57/E57","v":551.75}]
[null,"BDI                %",{"$nulls":5},{"$f":"1+$M$1","v":1.2292000000000001}]
[null,"TOTAL DO SERVIÇO - R$",{"$nulls":5},{"$f":"ROUND(H58*H59,2)","v":678.21}]
[]
[{"$f":"A45+1","v":5},"CODEVASF",null,null," COMPOSIÇÃO DE PREÇO UNITÁRIO",null,null,null,{"$f":"H70","v":0.57999999999999996},{"$f":"H72","v":0.71}]
[null,"OBRA:  ",{"$f":"$C$2","v":" PAVIMENTAÇÃO ASFÁLTICA EM CBUQ - DIVERSAS RUAS (MONTES CLAROS / MG)"},null,null,null,"DATA: ",{"$f":"$H$2","v":"OUTUBRO / 2.021   "}]
[null,"SERVIÇO:  ",{"$f":"VLOOKUP(A62,ORÇAMENTO!$A$10:$I$28,3)","v":"LOCAÇÃO DE PAVIMENTAÇÃO"},null,"SINAPI",{"$f":"VLOOKUP(A62,ORÇAMENTO!$A$10:$I$28,4)","v":99064},"UNIDADE: ",{"$f":"VLOOKUP(A62,ORÇAMENTO!$A$10:$I$28,5)","v":"M"}]
[]
[null,"TIPO ITEM","CODIGO ITEM","DESCRIÇÃO ITEM","UNIDADE ITEM","COEFICIENTE","PRECO UNITARIO","CUSTO TOTAL"]
[null,"COMPOSICAO","99058","LOCAÇÃO DE PONTO PARA REFERÊNCIA TOPOGRÁFICA","UN",0.05,11.63,{"$f":"ROUNDDOWN(F67*G67,2)","v":0.57999999999999996}]
[]
[null,"PRODUÇÃO DA EQUIPE",null,null,1,"CUSTO ",null,{"$f":"SUM(H67:H68)","v":0.57999999999999996}]
[null,"TOTAL",{"$nulls":5},{"$f":"H69/E69","v":0.57999999999999996}]
[null,"BDI                %",{"$nulls":5},{"$f":"1+$M$1","v":1.2292000000000001}]
[null,"TOTAL DO SERVIÇO - R$",{"$nulls":5},{"$f":"ROUND(H70*H71,2)","v":0.71}]
[]
[{"$f":"A62+1","v":6},"CODEVASF",null,null," COMPOSIÇÃO DE PREÇO UNITÁRIO",null,null,null,{"$f":"H83","v":1.63},{"$f":"H85","v":2}]
[null,"OBRA:  ",{"$f":"$C$2","v":" PAVIMENTAÇÃO ASFÁLTICA EM CBUQ - DIVERSAS RUAS (MONTES CLAROS / MG)"},null,null,null,"DATA: ",{"$f":"$H$2","v":"OUTUBRO / 2.021   "},null,{"$f":"H86","v":0}]
[null,"SERVIÇO:  ",{"$f":"VLOOKUP(A74,ORÇAMENTO!$A$10:$I$28,3)","v":"ESCAVAÇÃO HORIZONTAL EM SOLO DE 1A CATEGORIA "},null,"SINAPI",{"$f":"VLOOKUP(A74,ORÇAMENTO!$A$10:$I$28,4)","v":101116},"UNIDADE: ",{"$f":"VLOOKUP(A74,ORÇAMENTO!$A$10:$I$28,5)","v":"M3"}]
[]
[null,"TIPO ITEM","CODIGO ITEM","DESCRIÇÃO ITEM","UNIDADE ITEM","COEFICIENTE","PRECO UNITARIO","CUSTO TOTAL"]
[null,"COMPOSICAO","5847","TRATOR DE ESTEIRAS, POTÊNCIA 170 HP, PESO OPERACIONAL 19 T, CAÇAMBA 5,2 M3 - CHP DIURNO. AF_06/2014","CHP","0,0048000","199,24",{"$f":"ROUNDDOWN(F79*G79,2)","v":0.95}]
[null,"COMPOSICAO","5849","TRATOR DE ESTEIRAS, POTÊNCIA 170 HP, PESO OPERACIONAL 19 T, CAÇAMBA 5,2 M3 - CHI DIURNO. AF_06/2014","CHI","0,0082000","59,09",0.48]
[null,"COMPOSICAO","88316","SERVENTE COM ENCARGOS COMPLEMENTARES","H","0,0131000","15,71",0.2]
[null,"PRODUÇÃO DA EQUIPE",null,null,1,"CUSTO ",null,{"$f":"SUM(H79:H81)","v":1.63}]
[null,"TOTAL",{"$nulls":5},{"$f":"H82/E82","v":1.63}]
[null,"BDI                %",{"$nulls":5},{"$f":"1+$M$1","v":1.2292000000000001}]
[null,"TOTAL DO SERVIÇO - R$",{"$nulls":5},{"$f":"ROUND(H83*H84,2)","v":2}]
[]
[7,"CODEVASF",null,null," COMPOSIÇÃO DE PREÇO UNITÁRIO",null,null,null,{"$f":"H97","v":6.41},{"$f":"H99","v":7.88}]
[null,"OBRA:  ",{"$f":"$C$2","v":" PAVIMENTAÇÃO ASFÁLTICA EM CBUQ - DIVERSAS RUAS (MONTES CLAROS / MG)"},null,null,null,"DATA: ",{"$f":"$H$2","v":"OUTUBRO / 2.021   "}]
[null,"SERVIÇO:  ",{"$f":"VLOOKUP(A87,ORÇAMENTO!$A$10:$I$28,3)","v":"CARGA, MANOBRA E DESCARGA DE SOLOS E MATERIAIS GRANULARES EM CAMINHÃO BASCULANTE"},null,"SINAPI",{"$f":"VLOOKUP(A87,ORÇAMENTO!$A$10:$I$28,4)","v":100976},"UNIDADE: ",{"$f":"VLOOKUP(A87,ORÇAMENTO!$A$10:$I$28,5)","v":"M3"}]
[]
[null,"TIPO ITEM","CODIGO ITEM","DESCRIÇÃO ITEM","UNIDADE ITEM","COEFICIENTE","PRECO UNITARIO","CUSTO TOTAL"]
[null,"COMPOSICAO","5940","PÁ CARREGADEIRA SOBRE RODAS, POTÊNCIA LÍQUIDA 128 HP, CAPACIDADE DA CAÇAMBA 1,7 A 2,8 M3, PESO OPERACIONAL 11632 KG - CHP DIURNO. AF_06/2014","CHP","0,0083000","157,62",{"$f":"ROUNDDOWN(F92*G92,2)","v":1.3}]
[null,"COMPOSICAO","5942","PÁ CARREGADEIRA SOBRE RODAS, POTÊNCIA LÍQUIDA 128 HP, CAPACIDADE DA CAÇAMBA 1,7 A 2,8 M3, PESO OPERACIONAL 11632 KG - CHI DIURNO. AF_06/2014","CHI","0,0074000","56,76",0.42]
[null,"COMPOSICAO","89883","CAMINHÃO BASCULANTE 18 M3, COM CAVALO MECÂNICO DE CAPACIDADE MÁXIMA DE TRAÇÃO COMBINADO DE 45000 KG, POTÊNCIA 330 CV, INCLUSIVE SEMIREBOQUE COM CAÇAMBA METÁLICA - CHP DIURNO. AF_12/2014","CHP","0,0153000","273,08",4.17]
[null,"COMPOSICAO","89884","CAMINHÃO BASCULANTE 18 M3, COM CAVALO MECÂNICO DE CAPACIDADE MÁXIMA DE TRAÇÃO COMBINADO DE 45000 KG, POTÊNCIA 330 CV, INCLUSIVE SEMIREBOQUE COM CAÇAMBA METÁLICA - CHI DIURNO. AF_12/2014","CHI","0,0095000","55,57",0.52]
[null,"PRODUÇÃO DA EQUIPE",null,null,1,"CUSTO ",null,{"$f":"SUM(H92:H95)","v":6.41}]
[null,"TOTAL",{"$nulls":5},{"$f":"H96/E96","v":6.41}]
[null,"BDI                %",{"$nulls":5},{"$f":"1+$M$1","v":1.2292000000000001}]
[null,"TOTAL DO SERVIÇO - R$",{"$nulls":5},{"$f":"ROUND(H97*H98,2)","v":7.88}]
[]
[8,"CODEVASF",null,null," COMPOSIÇÃO DE PREÇO UNITÁRIO",null,null,null,{"$f":"H119","v":0.74919999999999987},{"$f":"H121","v":0.92}]
[null,"OBRA:  ",{"$f":"$C$2","v":" PAVIMENTAÇÃO ASFÁLTICA EM CBUQ - DIVERSAS RUAS (MONTES CLAROS / MG)"},null,null,null,"DATA: ",{"$f":"$H$2","v":"OUTUBRO / 2.021   "}]
[null,"SERVIÇO:  ",{"$f":"VLOOKUP(A101,ORÇAMENTO!$A$10:$I$28,3)","v":"REGULARIZAÇÃO DO SUBLEITO "},null,"SICRO",{"$f":"VLOOKUP(A101,ORÇAMENTO!$A$10:$I$28,4)","v":"4011209a"},"UNIDADE: ",{"$f":"VLOOKUP(A101,ORÇAMENTO!$A$10:$I$28,5)","v":"M2"}]
[]
[null,"TIPO ITEM","CODIGO ITEM","DESCRIÇÃO ITEM","UNIDADE ITEM","COEFICIENTE","PRECO UNITARIO","CUSTO TOTAL"]
[null,"COMPOSICAO","E9571","CAMINHÃO TANQUE COM CAPACIDADE DE 10.000 L - 188 KW","CHP",{"$f":"2/1121.33*0.51","v":9.0963409522620462E-4},231.76,{"$f":"ROUND(F106*G106,4)","v":0.21079999999999999}]
[null,"COMPOSICAO","E9571","CAMINHÃO TANQUE COM CAPACIDADE DE 10.000 L - 188 KW","CHI",{"$f":"2/1121.33*0.49","v":8.7396216992321617E-4},56.65,{"$f":"ROUND(F107*G107,4)","v":4.9500000000000002E-2}]
[null,"COMPOSICAO","E9518","GRADE DE 24 DISCOS REBOCÁVEL DE D = 60 CM (24\")","CHP",{"$f":"1/1121.33*0.69","v":6.1534071147655012E-4},2.96,1.8E-3]
[null,"COMPOSICAO","E9518","GRADE DE 24 DISCOS REBOCÁVEL DE D = 60 CM (24\")","CHI",{"$f":"1/1121.33*0.31","v":2.7645742109816022E-4},2,5.9999999999999995E-4]
[null,"COMPOSICAO","E9524","MOTONIVELADORA - 93 KW","CHP",{"$f":"1/1121.33*0.71","v":6.3317667412804435E-4},185.1,0.1172]
[null,"COMPOSICAO","E9524","MOTONIVELADORA - 93 KW","CHI",{"$f":"1/1121.33*0.29","v":2.5862145844666599E-4},76.73,1.9800000000000002E-2]
[null,"COMPOSICAO","88316","SERVENTE COM ENCARGOS COMPLEMENTARES","H",{"$f":"1/1121.33","v":8.9179813257471039E-4},15.71,1.4E-2]
[null,"COMPOSICAO","E9762","ROLO COMPACTADOR DE PNEUS AUTOPROPELIDO DE 27 T - 85 KW","CHP",{"$f":"1/1121.33*0.96","v":8.5612620727172194E-4},153.65,0.13150000000000001]
[null,"COMPOSICAO","E9762","ROLO COMPACTADOR DE PNEUS AUTOPROPELIDO DE 27 T - 85 KW","CHI",{"$f":"1/1121.33*0.04","v":3.5671925302988417E-5},71.400000000000006,2.5000000000000001E-3]
[null,"COMPOSICAO","E9577","TRATOR AGRÍCOLA SOBRE PNEUS - 77 KW","CHP",{"$f":"1/1121.33*0.69","v":6.1534071147655012E-4},94.13,5.79E-2]
[null,"COMPOSICAO","E9577","TRATOR AGRÍCOLA SOBRE PNEUS - 77 KW","CHI",{"$f":"1/1121.33*0.31","v":2.7645742109816022E-4},30.81,8.5000000000000006E-3]
[null,"COMPOSICAO","E9685","ROLO COMPACTADOR PÉ DE CARNEIRO VIBRATÓRIO AUTOPROPELIDO POR PNEUS DE 11,6 T - 82 KW","CHP",{"$f":"1/1121.33","v":8.9179813257471039E-4},151.46,0.1351]
[null,"PRODUÇÃO DA EQUIPE",null,null,1,"CUSTO ",null,{"$f":"SUM(H106:H117)","v":0.74919999999999987}]
[null,"TOTAL",{"$nulls":5},{"$f":"H118/E118","v":0.74919999999999987}]
[null,"BDI                %",{"$nulls":5},{"$f":"1+$M$1","v":1.2292000000000001}]
[null,"TOTAL DO SERVIÇO - R$",{"$nulls":5},{"$f":"ROUND(H119*H120,2)","v":0.92}]
[]
[9,"CODEVASF",null,null," COMPOSIÇÃO DE PREÇO UNITÁRIO",null,null,null,{"$f":"H139","v":146.07999999999998},{"$f":"H141","v":179.56}]
[null,"OBRA:  ",{"$f":"$C$2","v":" PAVIMENTAÇÃO ASFÁLTICA EM CBUQ - DIVERSAS RUAS (MONTES CLAROS / MG)"},null,null,null,"DATA: ",{"$f":"$H$2","v":"OUTUBRO / 2.021   "}]
[null,"SERVIÇO:  ",{"$f":"VLOOKUP(A123,ORÇAMENTO!$A$10:$I$28,3)","v":"EXECUÇÃO E COMPACTAÇÃO DE BASE E OU SUB BASE PARA PAVIMENTAÇÃO DE BRITA GRADUADA SIMPLES - EXCLUSIVE TRANSPORTE"},null,"SINAPI",{"$f":"VLOOKUP(A123,ORÇAMENTO!$A$10:$I$28,4)","v":96396},"UNIDADE: ",{"$f":"VLOOKUP(A123,ORÇAMENTO!$A$10:$I$28,5)","v":"M3"}]
[]
[null,"TIPO ITEM","CODIGO ITEM","DESCRIÇÃO ITEM","UNIDADE ITEM","COEFICIENTE","PRECO UNITARIO","CUSTO TOTAL"]
[null,"COMPOSICAO","5684","ROLO COMPACTADOR VIBRATÓRIO DE UM CILINDRO AÇO LISO, POTÊNCIA 80 HP, PESO OPERACIONAL MÁXIMO 8,1 T, IMPACTO DINÂMICO 16,15 / 9,5 T, LARGURA DE TRABALHO 1,68 M - CHP DIURNO. AF_06/2014","CHP","0,0090000","108,41",{"$f":"ROUNDDOWN(F128*G128,2)","v":0.97}]
[null,"COMPOSICAO","5685","ROLO COMPACTADOR VIBRATÓRIO DE UM CILINDRO AÇO LISO, POTÊNCIA 80 HP, PESO OPERACIONAL MÁXIMO 8,1 T, IMPACTO DINÂMICO 16,15 / 9,5 T, LARGURA DE TRABALHO 1,68 M - CHI DIURNO. AF_06/2014","CHI","0,0210000","39,30",0.82]
[null,"COMPOSICAO","5901","CAMINHÃO PIPA 10.000 L TRUCADO, PESO BRUTO TOTAL 23.000 KG, CARGA ÚTIL MÁXIMA 15.935 KG, DISTÂNCIA ENTRE EIXOS 4,8 M, POTÊNCIA 230 CV, INCLUSIVE TANQUE DE AÇO PARA TRANSPORTE DE ÁGUA - CHP DIURNO. AF_06/2014","CHP","0,0020000","229,83",0.45]
[null,"COMPOSICAO","5903","CAMINHÃO PIPA 10.000 L TRUCADO, PESO BRUTO TOTAL 23.000 KG, CARGA ÚTIL MÁXIMA 15.935 KG, DISTÂNCIA ENTRE EIXOS 4,8 M, POTÊNCIA 230 CV, INCLUSIVE TANQUE DE AÇO PARA TRANSPORTE DE ÁGUA - CHI DIURNO. AF_06/2014","CHI","0,0280000","42,66",1.19]
[null,"COMPOSICAO","5932","MOTONIVELADORA POTÊNCIA BÁSICA LÍQUIDA (PRIMEIRA MARCHA) 125 HP, PESO BRUTO 13032 KG, LARGURA DA LÂMINA DE 3,7 M - CHP DIURNO. AF_06/2014","CHP","0,0080000","184,38",1.47]
[null,"COMPOSICAO","5934","MOTONIVELADORA POTÊNCIA BÁSICA LÍQUIDA (PRIMEIRA MARCHA) 125 HP, PESO BRUTO 13032 KG, LARGURA DA LÂMINA DE 3,7 M - CHI DIURNO. AF_06/2014","CHI","0,0220000","64,79",1.42]
[null,"COMPOSICAO","88316","SERVENTE COM ENCARGOS COMPLEMENTARES","H","0,0300000","15,71",0.47]
[null,"COMPOSICAO","96393","USINAGEM DE BRITA GRADUADA SIMPLES. AF_03/2020","M3","1,0000000","137,34",137.34]
[null,"COMPOSICAO","96463","ROLO COMPACTADOR DE PNEUS, ESTATICO, PRESSAO VARIAVEL, POTENCIA 110 HP, PESO SEM/COM LASTRO 10,8/27 T, LARGURA DE ROLAGEM 2,30 M - CHP DIURNO. AF_06/2017","CHP","0,0040000","143,32",0.56999999999999995]
[null,"COMPOSICAO","96464","ROLO COMPACTADOR DE PNEUS, ESTATICO, PRESSAO VARIAVEL, POTENCIA 110 HP, PESO SEM/COM LASTRO 10,8/27 T, LARGURA DE ROLAGEM 2,30 M - CHI DIURNO. AF_06/2017","CHI","0,0260000","53,38",1.38]
[null,"PRODUÇÃO DA EQUIPE",null,null,1,"CUSTO ",null,{"$f":"SUM(H128:H137)","v":146.07999999999998}]
[null,"TOTAL",{"$nulls":5},{"$f":"H138/E138","v":146.07999999999998}]
[null,"BDI                %",{"$nulls":5},{"$f":"1+$M$1","v":1.2292000000000001}]
[null,"TOTAL DO SERVIÇO - R$",{"$nulls":5},{"$f":"ROUND(H139*H140,2)","v":179.56}]
[]
[10,"CODEVASF",null,null," COMPOSIÇÃO DE PREÇO UNITÁRIO",null,null,null,{"$f":"H158","v":0.99},{"$f":"H160","v":1.22}]
[null,"OBRA:  ",{"$f":"$C$2","v":" PAVIMENTAÇÃO ASFÁLTICA EM CBUQ - DIVERSAS RUAS (MONTES CLAROS / MG)"},null,null,null,"DATA: ",{"$f":"$H$2","v":"OUTUBRO / 2.021   "}]
[null,"SERVIÇO:  ",{"$f":"VLOOKUP(A143,ORÇAMENTO!$A$10:$I$28,3)","v":"IMPRIMAÇÃO COM ASFALTO DILUIDO CM-30"},null,"SINAPI",{"$f":"VLOOKUP(A143,ORÇAMENTO!$A$10:$I$28,4)","v":96401},"UNIDADE: ",{"$f":"VLOOKUP(A143,ORÇAMENTO!$A$10:$I$28,5)","v":"M2"}]
[]
[null,"TIPO ITEM","CODIGO ITEM","DESCRIÇÃO ITEM","UNIDADE ITEM","COEFICIENTE","PRECO UNITARIO","CUSTO TOTAL"]
[null,"COMPOSICAO","5839","VASSOURA MECÂNICA REBOCÁVEL COM ESCOVA CILÍNDRICA, LARGURA ÚTIL DE VARRIMENTO DE 2,44 M ","CHP","0,0020000","10,64",{"$f":"ROUNDDOWN(F148*G148,2)","v":0.02}]
[null,"COMPOSICAO","5841","VASSOURA MECÂNICA REBOCÁVEL COM ESCOVA CILÍNDRICA, LARGURA ÚTIL DE VARRIMENTO DE 2,44 M ","CHI","0,0040000","5,06",0.02]
[null,"INSUMO","MATRO-10374","ASFALTO DILUIDO DE PETROLEO CM-30 (FORNECIMENTO COM BDI DIFERENCIADO)","T",{"$f":"1.2/1000","v":1.1999999999999999E-3},null,0]
[null,"COMPOSICAO","83362","ESPARGIDOR DE ASFALTO PRESSURIZADO, TANQUE 6 M3 COM ISOLAÇÃO TÉRMICA, AQUECIDO COM 2 MAÇARICOS, COM BARRA ESPARGIDORA 3,60 M, MONTADO SOBRE CAMINHÃO  TOCO, PBT 14.300 KG, POTÊNCIA 185 CV","CHP","0,0010000","231,02",0.23]
[null,"COMPOSICAO","88316","SERVENTE COM ENCARGOS COMPLEMENTARES","H","0,0060000","15,71",0.09]
[null,"COMPOSICAO","89035","TRATOR DE PNEUS, POTÊNCIA 85 CV, TRAÇÃO 4X4, PESO COM LASTRO DE 4.675 KG ","CHP","0,0020000","140,90",0.28000000000000003]
[null,"COMPOSICAO","89036","TRATOR DE PNEUS, POTÊNCIA 85 CV, TRAÇÃO 4X4, PESO COM LASTRO DE 4.675 KG ","CHI","0,0040000","33,46",0.13]
[null,"COMPOSICAO","91486","ESPARGIDOR DE ASFALTO PRESSURIZADO, TANQUE 6 M3 COM ISOLAÇÃO TÉRMICA, AQUECIDO COM 2 MAÇARICOS, COM BARRA ESPARGIDORA 3,60 M, MONTADO SOBRE CAMINHÃO  TOCO, PBT 14.300 KG, POTÊNCIA 185 CV","CHI","0,0050000","44,47",0.22]
[{"$nulls":7},0]
[null,"PRODUÇÃO DA EQUIPE",null,null,1,"CUSTO ",null,{"$f":"SUM(H148:H156)","v":0.99}]
[null,"TOTAL",{"$nulls":5},{"$f":"H157/E157","v":0.99}]
[null,"BDI                %",{"$nulls":5},{"$f":"1+$M$1","v":1.2292000000000001}]
[null,"TOTAL DO SERVIÇO - R$",{"$nulls":5},{"$f":"ROUND(H158*H159,2)","v":1.22}]
[]
[11,"CODEVASF",null,null," COMPOSIÇÃO DE PREÇO UNITÁRIO",null,null,null,{"$f":"H177","v":0.78},{"$f":"H179","v":0.96}]
[null,"OBRA:  ",{"$f":"$C$2","v":" PAVIMENTAÇÃO ASFÁLTICA EM CBUQ - DIVERSAS RUAS (MONTES CLAROS / MG)"},null,null,null,"DATA: ",{"$f":"$H$2","v":"OUTUBRO / 2.021   "}]
[null,"SERVIÇO:  ",{"$f":"VLOOKUP(A162,ORÇAMENTO!$A$10:$I$28,3)","v":"PINTURA DE LIGAÇÃO COM EMULSÃO ASFÁLTICA RR-2C"},null,"SINAPI",{"$f":"VLOOKUP(A162,ORÇAMENTO!$A$10:$I$28,4)","v":96402},"UNIDADE: ",{"$f":"VLOOKUP(A162,ORÇAMENTO!$A$10:$I$28,5)","v":"M2"}]
[]
[null,"TIPO ITEM","CODIGO ITEM","DESCRIÇÃO ITEM","UNIDADE ITEM","COEFICIENTE","PRECO UNITARIO","CUSTO TOTAL"]
[null,"COMPOSICAO","5839","VASSOURA MECÂNICA REBOCÁVEL COM ESCOVA CILÍNDRICA, LARGURA ÚTIL DE VARRIMENTO DE 2,44 M - CHP DIURNO. AF_06/2014","CHP","0,0020000","10,64",{"$f":"ROUNDDOWN(F167*G167,2)","v":0.02}]
[null,"COMPOSICAO","5841","VASSOURA MECÂNICA REBOCÁVEL COM ESCOVA CILÍNDRICA, LARGURA ÚTIL DE VARRIMENTO DE 2,44 M - CHI DIURNO. AF_06/2014","CHI","0,0040000","5,06",0.02]
[null,"INSUMO","41903","EMULSAO ASFALTICA CATIONICA RR-2C PARA USO EM PAVIMENTACAO ASFALTICA (COLETADO CAIXA NA ANP ACRESCIDO DE ICMS)","KG","0,4500000",null,0]
[null,"COMPOSICAO","83362","ESPARGIDOR DE ASFALTO PRESSURIZADO, TANQUE 6 M3 COM ISOLAÇÃO TÉRMICA, AQUECIDO COM 2 MAÇARICOS, COM BARRA ESPARGIDORA 3,60 M, MONTADO SOBRE CAMINHÃO  TOCO, PBT 14.300 KG, POTÊNCIA 185 CV - CHP DIURNO. AF_08/2015","CHP","0,0004000","231,02",0.09]
[null,"COMPOSICAO","88316","SERVENTE COM ENCARGOS COMPLEMENTARES","H","0,0055000","15,71",0.08]
[null,"COMPOSICAO","89035","TRATOR DE PNEUS, POTÊNCIA 85 CV, TRAÇÃO 4X4, PESO COM LASTRO DE 4.675 KG - CHP DIURNO. AF_06/2014","CHP","0,0017000","140,90",0.23]
[null,"COMPOSICAO","89036","TRATOR DE PNEUS, POTÊNCIA 85 CV, TRAÇÃO 4X4, PESO COM LASTRO DE 4.675 KG - CHI DIURNO. AF_06/2014","CHI","0,0038000","33,46",0.12]
[null,"COMPOSICAO","91486","ESPARGIDOR DE ASFALTO PRESSURIZADO, TANQUE 6 M3 COM ISOLAÇÃO TÉRMICA, AQUECIDO COM 2 MAÇARICOS, COM BARRA ESPARGIDORA 3,60 M, MONTADO SOBRE CAMINHÃO  TOCO, PBT 14.300 KG, POTÊNCIA 185 CV - CHI DIURNO. AF_08/2015","CHI","0,0051000","44,47",0.22]
[{"$nulls":7},0]
[null,"PRODUÇÃO DA EQUIPE",null,null,1,"CUSTO ",null,{"$f":"SUM(H167:H175)","v":0.78}]
[null,"TOTAL",{"$nulls":5},{"$f":"H176/E176","v":0.78}]
[null,"BDI                %",{"$nulls":5},{"$f":"1+$M$1","v":1.2292000000000001}]
[null,"TOTAL DO SERVIÇO - R$",{"$nulls":5},{"$f":"ROUND(H177*H178,2)","v":0.96}]
[]
[12,"CODEVASF",null,null," COMPOSIÇÃO DE PREÇO UNITÁRIO",null,null,null,{"$f":"H199","v":91.509999999999991},{"$f":"H201","v":112.48}]
[null,"OBRA:  ",{"$f":"$C$2","v":" PAVIMENTAÇÃO ASFÁLTICA EM CBUQ - DIVERSAS RUAS (MONTES CLAROS / MG)"},null,null,null,"DATA: ",{"$f":"$H$2","v":"OUTUBRO / 2.021   "}]
[null,"SERVIÇO:  ",{"$f":"VLOOKUP(A181,ORÇAMENTO!$A$10:$I$28,3)","v":"EXECUÇÃO DE PAVIMENTO COM APLICAÇÃO DE CONCRETO ASFÁLTICO USINADO A QUENTE (CBUQ), CAMADA DE ROLAMENTO - EXCLUSIVE TRANSPORTE"},null,"SINAPI",{"$f":"VLOOKUP(A181,ORÇAMENTO!$A$10:$I$28,4)","v":95995},"UNIDADE: ",{"$f":"VLOOKUP(A181,ORÇAMENTO!$A$10:$I$28,5)","v":"M3"}]
[]
[null,"TIPO ITEM","CODIGO ITEM","DESCRIÇÃO ITEM","UNIDADE ITEM","COEFICIENTE","PRECO UNITARIO","CUSTO TOTAL"]
[null,"INSUMO","1518","CONCRETO BETUMINOSO USINADO A QUENTE (CBUQ) PARA PAVIMENTACAO ASFALTICA, PADRAO DNIT, FAIXA C, COM CAP 50/70 - AQUISICAO POSTO USINA","T","2,5548000",null,{"$f":"ROUNDDOWN(F186*G186,2)","v":0},"RECOMENDADO PEGAR COTAÇÃO NAS USINAS MAIS PRÓXIMAS"]
[null,"COMPOSICAO","5835","VIBROACABADORA DE ASFALTO SOBRE ESTEIRAS, LARGURA DE PAVIMENTAÇÃO 1,90 M A 5,30 M, POTÊNCIA 105 HP CAPACIDADE 450 T/H - CHP DIURNO. AF_11/2014","CHP","0,0464000","344,57",15.98]
[null,"COMPOSICAO","5837","VIBROACABADORA DE ASFALTO SOBRE ESTEIRAS, LARGURA DE PAVIMENTAÇÃO 1,90 M A 5,30 M, POTÊNCIA 105 HP CAPACIDADE 450 T/H - CHI DIURNO. AF_11/2014","CHI","0,0949000","128,69",12.21]
[null,"COMPOSICAO","88314","RASTELEIRO COM ENCARGOS COMPLEMENTARES","H","1,1301000","16,13",18.22]
[null,"COMPOSICAO","91386","CAMINHÃO BASCULANTE 10 M3, TRUCADO CABINE SIMPLES, PESO BRUTO TOTAL 23.000 KG, CARGA ÚTIL MÁXIMA 15.935 KG, DISTÂNCIA ENTRE EIXOS 4,80 M, POTÊNCIA 230 CV INCLUSIVE CAÇAMBA METÁLICA - CHP DIURNO. AF_06/2014","CHP","0,0464000","194,17",9]
[null,"COMPOSICAO","95631","ROLO COMPACTADOR VIBRATORIO TANDEM, ACO LISO, POTENCIA 125 HP, PESO SEM/COM LASTRO 10,20/11,65 T, LARGURA DE TRABALHO 1,73 M - CHP DIURNO. AF_11/2016","CHP","0,0805000","156,31",12.58]
[null,"COMPOSICAO","95632","ROLO COMPACTADOR VIBRATORIO TANDEM, ACO LISO, POTENCIA 125 HP, PESO SEM/COM LASTRO 10,20/11,65 T, LARGURA DE TRABALHO 1,73 M - CHI DIURNO. AF_11/2016","CHI","0,0607000","49,89",3.02]
[null,"COMPOSICAO","96155","TRATOR DE PNEUS COM POTÊNCIA DE 85 CV, TRAÇÃO 4X4, COM VASSOURA MECÂNICA ACOPLADA - CHI DIURNO. AF_02/2017","CHI","0,1071000","38,30",4.0999999999999996]
[null,"COMPOSICAO","96157","TRATOR DE PNEUS COM POTÊNCIA DE 85 CV, TRAÇÃO 4X4, COM VASSOURA MECÂNICA ACOPLADA - CHP DIURNO. AF_03/2017","CHP","0,0341000","150,39",5.12]
[null,"COMPOSICAO","96463","ROLO COMPACTADOR DE PNEUS, ESTATICO, PRESSAO VARIAVEL, POTENCIA 110 HP, PESO SEM/COM LASTRO 10,8/27 T, LARGURA DE ROLAGEM 2,30 M - CHP DIURNO. AF_06/2017","CHP","0,0419000","143,32",6]
[null,"COMPOSICAO","96464","ROLO COMPACTADOR DE PNEUS, ESTATICO, PRESSAO VARIAVEL, POTENCIA 110 HP, PESO SEM/COM LASTRO 10,8/27 T, LARGURA DE ROLAGEM 2,30 M - CHI DIURNO. AF_06/2017","CHI","0,0990000","53,38",5.28]
[{"$nulls":7},0]
[null,"PRODUÇÃO DA EQUIPE",null,null,1,"CUSTO ",null,{"$f":"SUM(H186:H197)","v":91.509999999999991}]
[null,"TOTAL",{"$nulls":5},{"$f":"H198/E198","v":91.509999999999991}]
[null,"BDI                %",{"$nulls":5},{"$f":"1+$M$1","v":1.2292000000000001}]
[null,"TOTAL DO SERVIÇO - R$",{"$nulls":5},{"$f":"ROUND(H199*H200,2)","v":112.48}]
[]
[13,"CODEVASF",null,null," COMPOSIÇÃO DE PREÇO UNITÁRIO",null,null,null,{"$f":"H212","v":1.36},{"$f":"H214","v":1.67}]
[null,"OBRA:  ",{"$f":"$C$2","v":" PAVIMENTAÇÃO ASFÁLTICA EM CBUQ - DIVERSAS RUAS (MONTES CLAROS / MG)"},null,null,null,"DATA: ",{"$f":"$H$2","v":"OUTUBRO / 2.021   "}]
[null,"SERVIÇO:  ",{"$f":"VLOOKUP(A203,ORÇAMENTO!$A$10:$I$28,3)","v":"TRANSPORTE COM CAMINHÃO BASCULANTE, EM VIA URBANA PAVIMENTADA"},null,"SINAPI",{"$f":"VLOOKUP(A203,ORÇAMENTO!$A$10:$I$28,4)","v":95877},"UNIDADE: ",{"$f":"VLOOKUP(A203,ORÇAMENTO!$A$10:$I$28,5)","v":"M3XKM"}]
[]
[null,"TIPO ITEM","CODIGO ITEM","DESCRIÇÃO ITEM","UNIDADE ITEM","COEFICIENTE","PRECO UNITARIO","CUSTO TOTAL"]
[null,"COMPOSICAO","89883","CAMINHÃO BASCULANTE 18 M3, COM CAVALO MECÂNICO DE CAPACIDADE MÁXIMA DE TRAÇÃO COMBINADO DE 45000 KG, POTÊNCIA 330 CV, INCLUSIVE SEMIREBOQUE COM CAÇAMBA METÁLICA - CHP DIURNO. AF_12/2014","CHP","0,0046000","273,08",{"$f":"ROUNDDOWN(F208*G208,2)","v":1.25}]
[null,"COMPOSICAO","89884","CAMINHÃO BASCULANTE 18 M3, COM CAVALO MECÂNICO DE CAPACIDADE MÁXIMA DE TRAÇÃO COMBINADO DE 45000 KG, POTÊNCIA 330 CV, INCLUSIVE SEMIREBOQUE COM CAÇAMBA METÁLICA - CHI DIURNO. AF_12/2014","CHI","0,0020000","55,57",0.11]
[{"$nulls":7},0]
[null,"PRODUÇÃO DA EQUIPE",null,null,1,"CUSTO ",null,{"$f":"SUM(H208:H210)","v":1.36}]
[null,"TOTAL",{"$nulls":5},{"$f":"H211/E211","v":1.36}]
[null,"BDI                %",{"$nulls":5},{"$f":"1+$M$1","v":1.2292000000000001}]
[null,"TOTAL DO SERVIÇO - R$",{"$nulls":5},{"$f":"ROUND(H212*H213,2)","v":1.67}]
[]
[13.5,"CODEVASF",null,null," COMPOSIÇÃO DE PREÇO UNITÁRIO",null,null,null,{"$f":"H225","v":1.4900000000000002},{"$f":"H227","v":1.83}]
[null,"OBRA:  ",{"$f":"$C$2","v":" PAVIMENTAÇÃO ASFÁLTICA EM CBUQ - DIVERSAS RUAS (MONTES CLAROS / MG)"},null,null,null,"DATA: ",{"$f":"$H$2","v":"OUTUBRO / 2.021   "}]
[null,"SERVIÇO:  ",{"$f":"VLOOKUP(A216,ORÇAMENTO!$A$10:$I$28,3)","v":"TRANSPORTE COM CAMINHÃO CARROCERIA 9T, EM VIA URBANA PAVIMENTADA"},null,"SINAPI",{"$f":"VLOOKUP(A216,ORÇAMENTO!$A$10:$I$28,4)","v":100947},"UNIDADE: ",{"$f":"VLOOKUP(A216,ORÇAMENTO!$A$10:$I$28,5)","v":"TXKM"}]
[]
[null,"TIPO ITEM","CODIGO ITEM","DESCRIÇÃO ITEM","UNIDADE ITEM","COEFICIENTE","PRECO UNITARIO","CUSTO TOTAL"]
[null,"COMPOSICAO","5824","CAMINHÃO TOCO, PBT 16.000 KG, CARGA ÚTIL MÁX. 10.685 KG, DIST. ENTRE EIXOS 4,8 M, POTÊNCIA 189 CV, INCLUSIVE CARROCERIA FIXA ABERTA DE MADEIRA P/ TRANSPORTE GERAL DE CARGA SECA, DIMEN. APROX. 2,5 X 7,00 X 0,50 M - CHP DIURNO. AF_06/2014","CHP","0,0093000","147,24",{"$f":"ROUNDDOWN(F221*G221,2)","v":1.36}]
[null,"COMPOSICAO","5826","CAMINHÃO TOCO, PBT 16.000 KG, CARGA ÚTIL MÁX. 10.685 KG, DIST. ENTRE EIXOS 4,8 M, POTÊNCIA 189 CV, INCLUSIVE CARROCERIA FIXA ABERTA DE MADEIRA P/ TRANSPORTE GERAL DE CARGA SECA, DIMEN. APROX. 2,5 X 7,00 X 0,50 M - CHI DIURNO. AF_06/2014","CHI","0,0040000","33,72",0.13]
[{"$nulls":7},0]
[null,"PRODUÇÃO DA EQUIPE",null,null,1,"CUSTO ",null,{"$f":"SUM(H221:H223)","v":1.4900000000000002}]
[null,"TOTAL",{"$nulls":5},{"$f":"H224/E224","v":1.4900000000000002}]
[null,"BDI                %",{"$nulls":5},{"$f":"1+$M$1","v":1.2292000000000001}]
[null,"TOTAL DO SERVIÇO - R$",{"$nulls":5},{"$f":"ROUND(H225*H226,2)","v":1.83}]
[]
[14,"CODEVASF",null,null," COMPOSIÇÃO DE PREÇO UNITÁRIO",null,null,null,{"$f":"H237","v":0.42000000000000004},{"$f":"H239","v":0.52}]
[null,"OBRA:  ",{"$f":"$C$2","v":" PAVIMENTAÇÃO ASFÁLTICA EM CBUQ - DIVERSAS RUAS (MONTES CLAROS / MG)"},null,null,null,"DATA: ",{"$f":"$H$2","v":"OUTUBRO / 2.021   "}]
[null,"SERVIÇO:  ",{"$f":"VLOOKUP(A229,ORÇAMENTO!$A$10:$I$28,3)","v":"TRANSPORTE COM CAMINHÃO TANQUE DE TRANSPORTE DE MATERIAL ASFÁLTICO DE 30000 L, EM VIA URBANA PAVIMENTADA"},null,"SINAPI",{"$f":"VLOOKUP(A229,ORÇAMENTO!$A$10:$I$28,4)","v":102331},"UNIDADE: ",{"$f":"VLOOKUP(A229,ORÇAMENTO!$A$10:$I$28,5)","v":"TXKM"}]
[]
[null,"TIPO ITEM","CODIGO ITEM","DESCRIÇÃO ITEM","UNIDADE ITEM","COEFICIENTE","PRECO UNITARIO","CUSTO TOTAL"]
[null,"COMPOSICAO","91645","CAMINHÃO DE TRANSPORTE DE MATERIAL ASFÁLTICO 30.000 L, COM CAVALO MECÂNICO DE CAPACIDADE MÁXIMA DE TRAÇÃO COMBINADO DE 66.000 KG, POTÊNCIA 360 CV, INCLUSIVE TANQUE DE ASFALTO COM SERPENTINA - CHP DIURNO. AF_08/2015","CHP","0,0011000","360,00",{"$f":"ROUNDDOWN(F234*G234,2)","v":0.39}]
[null,"COMPOSICAO","91646","CAMINHÃO DE TRANSPORTE DE MATERIAL ASFÁLTICO 30.000 L, COM CAVALO MECÂNICO DE CAPACIDADE MÁXIMA DE TRAÇÃO COMBINADO DE 66.000 KG, POTÊNCIA 360 CV, INCLUSIVE TANQUE DE ASFALTO COM SERPENTINA - CHI DIURNO. AF_08/2015","CHI","0,0005000","63,62",0.03]
[null,"PRODUÇÃO DA EQUIPE",null,null,1,"CUSTO ",null,{"$f":"SUM(H234:H235)","v":0.42000000000000004}]
[null,"TOTAL",{"$nulls":5},{"$f":"H236/E236","v":0.42000000000000004}]
[null,"BDI                %",{"$nulls":5},{"$f":"1+$M$1","v":1.2292000000000001}]
[null,"TOTAL DO SERVIÇO - R$",{"$nulls":5},{"$f":"ROUND(H237*H238,2)","v":0.52}]
[]
[15,"CODEVASF",null,null," COMPOSIÇÃO DE PREÇO UNITÁRIO",null,null,null,{"$f":"H253","v":42.070000000000007},{"$f":"H255","v":51.71}]
[null,"OBRA:  ",{"$f":"$C$2","v":" PAVIMENTAÇÃO ASFÁLTICA EM CBUQ - DIVERSAS RUAS (MONTES CLAROS / MG)"},null,null,null,"DATA: ",{"$f":"$H$2","v":"OUTUBRO / 2.021   "}]
[null,"SERVIÇO:  ",{"$f":"VLOOKUP(A241,ORÇAMENTO!$A$10:$I$28,3)","v":"ASSENTAMENTO DE GUIA (MEIO-FIO) EM TRECHO RETO, CONFECCIONADA EM CONCRETO PRÉ-FABRICADO, DIMENSÕES 100X15X13X30 CM (COMPRIMENTO X BASE INFERIOR X BASE SUPERIOR X ALTURA), PARA VIAS URBANAS (USO VIÁRIO)"},null,"SINAPI",{"$f":"VLOOKUP(A241,ORÇAMENTO!$A$10:$I$28,4)","v":94273},"UNIDADE: ",{"$f":"VLOOKUP(A241,ORÇAMENTO!$A$10:$I$28,5)","v":"M"}]
[]
[null,"TIPO ITEM","CODIGO ITEM","DESCRIÇÃO ITEM","UNIDADE ITEM","COEFICIENTE","PRECO UNITARIO","CUSTO TOTAL"]
[null,"INSUMO","370","AREIA MEDIA - POSTO JAZIDA/FORNECEDOR (RETIRADO NA JAZIDA, SEM TRANSPORTE)","M3","0,0070000","74,17",{"$f":"ROUNDDOWN(F246*G246,2)","v":0.51}]
[null,"INSUMO","4059","MEIO-FIO OU GUIA DE CONCRETO, PRE-MOLDADO, COMP 1 M, *30 X 12/15* CM (H X L1/L2)","M","1,0050000","25,54",25.66]
[null,"COMPOSICAO","88309","PEDREIRO COM ENCARGOS COMPLEMENTARES","H","0,3940000","22,09",8.6999999999999993]
[null,"COMPOSICAO","88316","SERVENTE COM ENCARGOS COMPLEMENTARES","H","0,3940000","15,71",6.18]
[null,"COMPOSICAO","88629","ARGAMASSA TRAÇO 1:3 (EM VOLUME DE CIMENTO E AREIA MÉDIA ÚMIDA), PREPARO MANUAL. AF_08/2019","M3","0,0020000","513,42",1.02]
[{"$nulls":7},0]
[null,"PRODUÇÃO DA EQUIPE",null,null,1,"CUSTO ",null,{"$f":"SUM(H246:H250)","v":42.070000000000007}]
[null,"TOTAL",{"$nulls":5},{"$f":"H252/E252","v":42.070000000000007}]
[null,"BDI                %",{"$nulls":5},{"$f":"1+$M$1","v":1.2292000000000001}]
[null,"TOTAL DO SERVIÇO - R$",{"$nulls":5},{"$f":"ROUND(H253*H254,2)","v":51.71}]
[]
[15.05,"CODEVASF",null,null," COMPOSIÇÃO DE PREÇO UNITÁRIO",null,null,null,{"$f":"H270","v":45.3},{"$f":"H272","v":55.68}]
[null,"OBRA:  ",{"$f":"$C$2","v":" PAVIMENTAÇÃO ASFÁLTICA EM CBUQ - DIVERSAS RUAS (MONTES CLAROS / MG)"},null,null,null,"DATA: ",{"$f":"$H$2","v":"OUTUBRO / 2.021   "}]
[null,"SERVIÇO:  ",{"$f":"VLOOKUP(A257,ORÇAMENTO!$A$10:$I$37,3)","v":"EXECUÇÃO DE SARJETA DE CONCRETO USINADO, MOLDADA  IN LOCO  EM TRECHO RETO, 30 CM BASE X 15 CM ALTURA"},null,"SINAPI",{"$f":"VLOOKUP(A257,ORÇAMENTO!$A$10:$I$37,4)","v":94281},"UNIDADE: ",{"$f":"VLOOKUP(A257,ORÇAMENTO!$A$10:$I$37,5)","v":"M"}]
[]
[null,"TIPO ITEM","CODIGO ITEM","DESCRIÇÃO ITEM","UNIDADE ITEM","COEFICIENTE","PRECO UNITARIO","CUSTO TOTAL"]
[null,"INSUMO","370","AREIA MEDIA - POSTO JAZIDA/FORNECEDOR (RETIRADO NA JAZIDA, SEM TRANSPORTE)","M3","0,0100000","74,17",{"$f":"ROUNDDOWN(F262*G262,2)","v":0.74}]
[null,"INSUMO","4517","SARRAFO *2,5 X 7,5* CM EM PINUS, MISTA OU EQUIVALENTE DA REGIAO - BRUTA","M","0,2000000","2,63",0.52]
[null,"INSUMO","6189","TABUA NAO APARELHADA *2,5 X 30* CM, EM MACARANDUBA, ANGELIM OU EQUIVALENTE DA REGIAO - BRUTA","M","0,1250000","49,50",6.18]
[null,"INSUMO","34492","CONCRETO USINADO BOMBEAVEL, CLASSE DE RESISTENCIA C20, COM BRITA 0 E 1, SLUMP = 100 +/- 20 MM, EXCLUI SERVICO DE BOMBEAMENTO (NBR 8953)","M3","0,0560000","340,00",19.04]
[null,"COMPOSICAO","88309","PEDREIRO COM ENCARGOS COMPLEMENTARES","H","0,4980000","22,09",11]
[null,"COMPOSICAO","88316","SERVENTE COM ENCARGOS COMPLEMENTARES","H","0,4980000","15,71",7.82]
[{"$nulls":7},0]
[null,"PRODUÇÃO DA EQUIPE",null,null,1,"CUSTO ",null,{"$f":"SUM(H262:H267)","v":45.3}]
[null,"TOTAL",{"$nulls":5},{"$f":"H269/E269","v":45.3}]
[null,"BDI                %",{"$nulls":5},{"$f":"1+$M$1","v":1.2292000000000001}]
[null,"TOTAL DO SERVIÇO - R$",{"$nulls":5},{"$f":"ROUND(H270*H271,2)","v":55.68}]
[]
[15.1,"CODEVASF",null,null," COMPOSIÇÃO DE PREÇO UNITÁRIO",null,null,null,{"$f":"H288","v":577.65},{"$f":"H290","v":710.05}]
[null,"OBRA:  ",{"$f":"$C$2","v":" PAVIMENTAÇÃO ASFÁLTICA EM CBUQ - DIVERSAS RUAS (MONTES CLAROS / MG)"},null,null,null,"DATA: ",{"$f":"$H$2","v":"OUTUBRO / 2.021   "}]
[null,"SERVIÇO:  ",{"$f":"VLOOKUP(A274,ORÇAMENTO!$A$10:$I$35,3)","v":"FORNECIMENTO E INSTALAÇÃO DE PLACA DE SINALIZAÇÃO VIÁRIA"},null,"SINAPI",{"$f":"VLOOKUP(A274,ORÇAMENTO!$A$10:$I$39,4)","v":"CPU.4"},"UNIDADE: ",{"$f":"VLOOKUP(A274,ORÇAMENTO!$A$10:$I$39,5)","v":"UN."}]
[]
[null,"TIPO ITEM","CODIGO ITEM","DESCRIÇÃO ITEM","UNIDADE ITEM","COEFICIENTE","PRECO UNITARIO","CUSTO TOTAL"]
[null,"COMPOSICAO",94962,"CONCRETO MAGRO PARA LASTRO, TRAÇO 1:4,5:4,5 (EM MASSA SECA DE CIMENTO/ AREIA MÉDIA/ BRITA 1)","M3",2.4E-2,307.48,{"$f":"ROUNDDOWN(F279*G279,2)","v":7.37}]
[null,"COMPOSICAO",93358,"ESCAVAÇÃO MANUAL DE VALA COM PROFUNDIDADE MENOR OU IGUAL A 1,30 M","M3",2.4E-2,62.14,1.49]
[null,"COMPOSICAO",88309,"PEDREIRO COM ENCARGOS COMPLEMENTARES","H",0.2,22.09,4.41]
[null,"COMPOSICAO",88316,"SERVENTE COM ENCARGOS COMPLEMENTARES","H",1,15.71,15.71]
[null,"COMPOSICAO",92873,"LANÇAMENTO COM USO DE BALDES, ADENSAMENTO E ACABAMENTO DE CONCRETO EM ESTRUTURAS","M3",2.4E-2,169.93,4.07]
[null,"INSUMO",34723,"PLACA DE SINALIZACAO EM CHAPA DE ACO NUM 16 COM PINTURA REFLETIVA (CIRCULAR - D=50CM) ","M2",0.2,1039.51,207.9]
[null,"INSUMO",21013,"TUBO AÇO GALVANIZADO COM COSTURA, CLASSE LEVE, DN 50 MM ( 2\")E = 3,00 MM, *4,40* KG/M (NBR 5580)","M",3.5,96.2,336.7]
[{"$nulls":7},0]
[null,"PRODUÇÃO DA EQUIPE",null,null,1,"CUSTO ",null,{"$f":"SUM(H279:H285)","v":577.65}]
[null,"TOTAL",{"$nulls":5},{"$f":"H287/E287","v":577.65}]
[null,"BDI                %",{"$nulls":5},{"$f":"1+$M$1","v":1.2292000000000001}]
[null,"TOTAL DO SERVIÇO - R$",{"$nulls":5},{"$f":"ROUND(H288*H289,2)","v":710.05}]
[]
[15.2,"CODEVASF",null,null," COMPOSIÇÃO DE PREÇO UNITÁRIO",null,null,null,{"$f":"H300","v":148.5},{"$f":"H302","v":182.54}]
[null,"OBRA:  ",{"$f":"$C$2","v":" PAVIMENTAÇÃO ASFÁLTICA EM CBUQ - DIVERSAS RUAS (MONTES CLAROS / MG)"},null,null,null,"DATA: ",{"$f":"$H$2","v":"OUTUBRO / 2.021   "}]
[null,"SERVIÇO:  ",{"$f":"VLOOKUP(A292,ORÇAMENTO!$A$10:$I$35,3)","v":"PLACA DE AÇO ESMALTADA PARA IDENTIFICACAO DE RUA, *45 CM X 20* CM                                   "},null,"SINAPI",{"$f":"VLOOKUP(A292,ORÇAMENTO!$A$10:$I$39,4)","v":13521},"UNIDADE: ",{"$f":"VLOOKUP(A292,ORÇAMENTO!$A$10:$I$39,5)","v":"UN."}]
[]
[null,"TIPO ITEM","CODIGO ITEM","DESCRIÇÃO ITEM","UNIDADE ITEM","COEFICIENTE","PRECO UNITARIO","CUSTO TOTAL"]
[null,"INSUMO",13521,"PLACA DE ACO ESMALTADA PARA  IDENTIFICACAO DE RUA, *45 CM X 20* CM  ","UNID.",1,148.5,{"$f":"ROUNDDOWN(F297*G297,2)","v":148.5}]
[{"$nulls":7},0]
[null,"PRODUÇÃO DA EQUIPE",null,null,1,"CUSTO ",null,{"$f":"SUM(H297:H297)","v":148.5}]
[null,"TOTAL",{"$nulls":5},{"$f":"H299/E299","v":148.5}]
[null,"BDI                %",{"$nulls":5},{"$f":"1+$M$1","v":1.2292000000000001}]
[null,"TOTAL DO SERVIÇO - R$",{"$nulls":5},{"$f":"ROUND(H300*H301,2)","v":182.54}]
[]
[15.3,"CODEVASF",null,null," COMPOSIÇÃO DE PREÇO UNITÁRIO",null,null,null,{"$f":"H318","v":29.0411},{"$f":"H320","v":35.700000000000003}]
[null,"OBRA:  ",{"$f":"$C$2","v":" PAVIMENTAÇÃO ASFÁLTICA EM CBUQ - DIVERSAS RUAS (MONTES CLAROS / MG)"},null,null,null,"DATA: ",{"$f":"$H$2","v":"OUTUBRO / 2.021   "}]
[null,"SERVIÇO:  ",{"$f":"VLOOKUP(A304,ORÇAMENTO!$A$10:$I$35,3)","v":"PINTURA DE FAIXA COM TINTA ACRÍLICA - ESPESSURA DE 0,6 MM"},null,"SICRO",{"$f":"VLOOKUP(A304,ORÇAMENTO!$A$10:$I$39,4)","v":"5213401a"},"UNIDADE: ",{"$f":"VLOOKUP(A304,ORÇAMENTO!$A$10:$I$39,5)","v":"M2"}]
[]
[null,"TIPO ITEM","CODIGO ITEM","DESCRIÇÃO ITEM","UNIDADE ITEM","COEFICIENTE","PRECO UNITARIO","CUSTO TOTAL"]
[null,"COMPOSICAO","E9644","CAMINHÃO DEMARCADOR DE FAIXAS COM SISTEMA DE PINTURA A FRIO - 28 KW/115 KW","CHP",6.6934400000000002E-3,295.8,{"$f":"ROUND(F309*G309,4)","v":1.9799}]
[null,"COMPOSICAO","P9853","PRÉ-MARCADOR","H",{"$f":"1/149.4","v":6.6934404283801874E-3},18.16,{"$f":"ROUND(F310*G310,4)","v":0.1216}]
[null,"COMPOSICAO","88316","SERVENTE COM ENCARGOS COMPLEMENTARES","H",{"$f":"4/149.4","v":2.677376171352075E-2},15.71,0.42059999999999997]
[null,"INSUMO","M2037","MICROESFERAS REFLETIVAS DE VIDRO TIPO I-B","KG",0.12,7.52,0.90239999999999998]
[null,"INSUMO","M2038","MICROESFERAS REFLETIVAS DE VIDRO TIPO II-A","KG",0.35,7.52,2.6320000000000001]
[null,"INSUMO","M2034","SOLVENTE PARA TINTA À BASE DE RESINA ACRÍLICA","L",0.03,12.95,0.38850000000000001]
[null,"INSUMO","M2044","TINTA À BASE DE RESINA ACRÍLICA EMULSIONADA EM ÁGUA PARA PRÉ-MARCAÇÃO VIÁRIA","L",9.7000000000000005E-4,18.66,1.8100000000000002E-2]
[null,"INSUMO","M2027","TINTA À BASE DE RESINA ACRÍLICA ESTIRENADA PARA DEMARCAÇÃO VIÁRIA","L",0.6,37.630000000000003,22.577999999999999]
[null,"PRODUÇÃO DA EQUIPE",null,null,1,"CUSTO ",null,{"$f":"SUM(H309:H316)","v":29.0411}]
[null,"TOTAL",{"$nulls":5},{"$f":"H317/E317","v":29.0411}]
[null,"BDI                %",{"$nulls":5},{"$f":"1+$M$1","v":1.2292000000000001}]
[null,"TOTAL DO SERVIÇO - R$",{"$nulls":5},{"$f":"ROUND(H318*H319,2)","v":35.700000000000003}]
[]
[17,"CODEVASF",null,null," COMPOSIÇÃO DE PREÇO UNITÁRIO",null,null,null,{"$f":"H329","v":6532.51},{"$f":"H331","v":7512.39}]
[null,"OBRA:  ",{"$f":"$C$2","v":" PAVIMENTAÇÃO ASFÁLTICA EM CBUQ - DIVERSAS RUAS (MONTES CLAROS / MG)"},null,null,null,"DATA: ",{"$f":"$H$2","v":"OUTUBRO / 2.021   "}]
[null,"SERVIÇO:  ",{"$f":"VLOOKUP(A322,ORÇAMENTO!$A$10:$I$44,3)","v":"AQUISIÇÃO DE ASFALTO DILUIDO DE PETROLEO CM-30 - EXCLUSIVE TRANSPORTE"},null,"SEINFRA",{"$f":"VLOOKUP(A322,ORÇAMENTO!$A$10:$I$44,4)","v":"CPU.5"},"UNIDADE: ",{"$f":"VLOOKUP(A322,ORÇAMENTO!$A$10:$I$44,5)","v":"T"}]
[]
[null,"TIPO ITEM","CODIGO ITEM","DESCRIÇÃO ITEM","UNIDADE ITEM","COEFICIENTE","PRECO UNITARIO","CUSTO TOTAL"]
[null,"INSUMO","MATRO-10374","ASFALTO DILUIDO CM-30 INCLUINDO ICMS 18%","T",1,6532.51,{"$f":"ROUNDDOWN(F327*G327,2)","v":6532.51}]
[null,"PRODUÇÃO DA EQUIPE",null,null,1,"CUSTO ",null,{"$f":"SUM(H327:H327)","v":6532.51}]
[null,"TOTAL",{"$nulls":5},{"$f":"H328/E328","v":6532.51}]
[null,"BDI                %",{"$nulls":5},{"$f":"1+$M$2","v":1.1499999999999999}]
[null,"TOTAL DO SERVIÇO - R$",{"$nulls":5},{"$f":"ROUND(H329*H330,2)","v":7512.39}]
[]
[18,"CODEVASF",null,null," COMPOSIÇÃO DE PREÇO UNITÁRIO",null,null,null,{"$f":"H340","v":3690},{"$f":"H342","v":4243.5}]
[null,"OBRA:  ",{"$f":"$C$2","v":" PAVIMENTAÇÃO ASFÁLTICA EM CBUQ - DIVERSAS RUAS (MONTES CLAROS / MG)"},null,null,null,"DATA: ",{"$f":"$H$2","v":"OUTUBRO / 2.021   "}]
[null,"SERVIÇO:  ",{"$f":"VLOOKUP(A333,ORÇAMENTO!$A$10:$I$44,3)","v":"AQUISIÇÃO DE EMULSAO ASFALTICA CATIONICA RR-2C - EXCLUSIVE TRANSPORTE"},null,"SINAPI",{"$f":"VLOOKUP(A333,ORÇAMENTO!$A$10:$I$44,4)","v":"CPU.6"},"UNIDADE: ",{"$f":"VLOOKUP(A333,ORÇAMENTO!$A$10:$I$44,5)","v":"T"}]
[]
[null,"TIPO ITEM","CODIGO ITEM","DESCRIÇÃO ITEM","UNIDADE ITEM","COEFICIENTE","PRECO UNITARIO","CUSTO TOTAL"]
[null,"INSUMO",41903,"EMULSÃO ASFÁLTICA CATIÔNICA RR-2C ","T",1,3690,{"$f":"ROUNDDOWN(F338*G338,2)","v":3690}]
[null,"PRODUÇÃO DA EQUIPE",null,null,1,"CUSTO ",null,{"$f":"SUM(H338:H338)","v":3690}]
[null,"TOTAL",{"$nulls":5},{"$f":"H339/E339","v":3690}]
[null,"BDI                %",{"$nulls":5},{"$f":"1+$M$2","v":1.1499999999999999}]
[null,"TOTAL DO SERVIÇO - R$",{"$nulls":5},{"$f":"ROUND(H340*H341,2)","v":4243.5}]
[]
[19,"CODEVASF",null,null," COMPOSIÇÃO DE PREÇO UNITÁRIO",null,null,null,{"$f":"H351","v":496.57},{"$f":"H353","v":571.05999999999995}]
[null,"OBRA:  ",{"$f":"$C$2","v":" PAVIMENTAÇÃO ASFÁLTICA EM CBUQ - DIVERSAS RUAS (MONTES CLAROS / MG)"},null,null,null,"DATA: ",{"$f":"$H$2","v":"OUTUBRO / 2.021   "}]
[null,"SERVIÇO:  ",{"$f":"VLOOKUP(A344,ORÇAMENTO!$A$10:$I$44,3)","v":"AQUISIÇÃO DE CONCRETO BETUMINOSO USINADO A QUENTE (CBUQ) PARA PAVIMENTACAO ASFALTICA, PADRAO DNIT, FAIXA C, COM CAP 50/70 - EXCLUSIVE TRANSPORTE"},null,"SINAPI",{"$f":"VLOOKUP(A344,ORÇAMENTO!$A$10:$I$44,4)","v":"CPU.7"},"UNIDADE: ",{"$f":"VLOOKUP(A344,ORÇAMENTO!$A$10:$I$44,5)","v":"T"}]
[]
[null,"TIPO ITEM","CODIGO ITEM","DESCRIÇÃO ITEM","UNIDADE ITEM","COEFICIENTE","PRECO UNITARIO","CUSTO TOTAL"]
[null,"INSUMO",1518,"CONCRETO BETUMINOSO USINADO A QUENTE (CBUQ) PARA PAVIMENTACAO ASFALTICA, PADRAO DNIT, FAIXA C, COM CAP 50/70 - AQUISICAO POSTO USINA","T",1,496.57,{"$f":"ROUNDDOWN(F349*G349,2)","v":496.57}]
[null,"PRODUÇÃO DA EQUIPE",null,null,1,"CUSTO ",null,{"$f":"SUM(H349:H349)","v":496.57}]
[null,"TOTAL",{"$nulls":5},{"$f":"H350/E350","v":496.57}]
[null,"BDI                %",{"$nulls":5},{"$f":"1+$M$2","v":1.1499999999999999}]
[null,"TOTAL DO SERVIÇO - R$",{"$nulls":5},{"$f":"ROUND(H351*H352,2)","v":571.05999999999995}]

{"sheet":"BDI SERV","index":2,"n_rows":37,"n_cols":5,"rows_kept":37,"cut":false,"hidden":false,"merged":[[36,0,36,5],[3,1,4,1],[3,2,4,2],[0,1,2,4],[32,0,34,5],[28,0,28,5],[30,1,30,2],[31,1,31,2]]}
[null,"DETALHAMENTO DO BDI - SERVIÇOS"]
[]
[]
[null,"Item","Descrição dos Serviços","%","%"]
[null,null,null,"PV","CD"]
[]
[null,1,"ADMINISTRAÇÃO CENTRAL"," ",4.01]
[null,"1.1","ESCRITÓRIO CENTRAL"," "," "]
[null,"1.2","VIAGENS"," "," "]
[null,"1.3","OUTROS"," "," "]
[null," "," "," "," "]
[null,2,"IMPOSTOS E TAXAS",{"$f":"SUM(D13:D16)","v":6.15},{"$f":"SUM(E13:E16)","v":7.6899999999999995}]
[null,"2.1","ISS (*)",2.5,{"$f":"ROUND(D13*1.2515,2)","v":3.13}]
[null,"2.2","PIS",0.65,0.81]
[null,"2.3","Cofins",3,3.75]
[null,"2.4","CONTRIBUIÇÃO PREVIDENCIÁRIA SOBRE A RENDA BRUTA",0,0]
[]
[null,3,"TAXA DE RISCO"," ",{"$f":"SUM(E19:E22)","v":0.96}]
[null,"3.1","SEGURO",null,0.2]
[null,"3.2","RISCO",null,0.56000000000000005]
[null,"3.3","GARANTIA",null,0.2]
[]
[null,4,"DESPESAS FINANCEIRAS"," ",1.1100000000000001]
[]
[null,5,"LUCRO",null,8.69]
[]
[null," ","BDI - CALCULADO"," ",{"$f":"ROUND((((1+(E7+E18)/100)*(1+E23/100)*(1+E25/100)/(1-D12/100)-1)*100),2)","v":22.92}]
[]
["BDI = ((1+((AC+S+R+G)/100))x(1+DF/100)x(1+L/100)/(1-I/100)-1)*100"]
[]
[null,"BDI (CALCULADO):",null,{"$f":"ROUND((((1+((E7+E18)/100))*(1+E23/100)*(1+E25/100))/(1-D12/100)-1)*100,2)","v":22.92},"%"]
[null," "]
["(*) ISS CONFORME LEI COMPLEMENTAR Nº 04 / 2005 - Atualizado até a LC nº 64, de 27/12/2017 - \nConsiderando as deduções previstas no Art. 62 - § 2º (Quant. Estimada de Material: 50%)"]
[]
[]
[]
["BDI EM CONFORMIDADE COM OS ACÓRDÃOS Nº 2369/2011 e ACÓRDÃO Nº 2.622/2013 - TCU - PLENÁRIO"]

{"sheet":"BDI FORN","index":3,"n_rows":37,"n_cols":5,"rows_kept":37,"cut":false,"hidden":false,"merged":[[32,0,34,5],[36,0,36,5],[0,1,2,4],[3,1,4,1],[3,2,4,2],[28,0,28,5],[30,1,30,2],[31,1,31,2]]}
[null,"DETALHAMENTO DO BDI - FORNECIMENTO \n(MATERIAL ASFÁLTICO)"]
[]
[]
[null,"Item","Descrição dos Serviços","%","%"]
[null,null,null,"PV","CD"]
[]
[null,1,"ADMINISTRAÇÃO CENTRAL"," ",3.72]
[null,"1.1","ESCRITÓRIO CENTRAL"," "," "]
[null,"1.2","VIAGENS"," "," "]
[null,"1.3","OUTROS"," "," "]
[null," "," "," "," "]
[null,2,"IMPOSTOS E TAXAS",{"$f":"SUM(D13:D16)","v":3.65},{"$f":"SUM(E13:E16)","v":4.5600000000000005}]
[null,"2.1","ISS (*)",null,{"$f":"ROUND(D13*1.2515,2)","v":0}]
[null,"2.2","PIS",0.65,0.81]
[null,"2.3","Cofins",3,3.75]
[null,"2.4","CONTRIBUIÇÃO PREVIDENCIÁRIA SOBRE A RENDA BRUTA",0,0]
[]
[null,3,"TAXA DE RISCO"," ",{"$f":"SUM(E19:E22)","v":0.82000000000000006}]
[null,"3.1","SEGURO",null,0.16]
[null,"3.2","RISCO",null,0.5]
[null,"3.3","GARANTIA",null,0.16]
[]
[null,4,"DESPESAS FINANCEIRAS"," ",0.94]
[]
[null,5,"LUCRO",null,5]
[]
[null," ","BDI - CALCULADO"," ",{"$f":"ROUND((((1+(E7+E18)/100)*(1+E23/100)*(1+E25/100)/(1-D12/100)-1)*100),2)","v":15}]
[]
["BDI = ((1+((AC+S+R+G)/100))x(1+DF/100)x(1+L/100)/(1-I/100)-1)*100"]
[]
[null,"BDI (CALCULADO):",null,{"$f":"ROUND((((1+((E7+E18)/100))*(1+E23/100)*(1+E25/100))/(1-D12/100)-1)*100,2)","v":15},"%"]
[null," "]
[]
[]
[]
[]
["BDI EM CONFORMIDADE COM OS ACÓRDÃOS Nº 2369/2011 e ACÓRDÃO Nº 2.622/2013 - TCU - PLENÁRIO"]

{"sheet":"CRONOGRAMA","index":4,"n_rows":19,"n_cols":14,"rows_kept":19,"cut":false,"hidden":false,"merged":[[15,1,16,2],[18,1,22,13],[9,1,10,1],[11,1,12,1],[13,0,14,0],[13,1,14,1],[13,2,14,2],[7,0,8,0],[9,0,10,0],[11,0,12,0],[0,1,0,13],[1,9,1,13],[2,9,2,13],[3,1,3,9],[5,0,6,0],[5,2,6,2],[1,1,2,1],[5,1,6,1],[1,2,2,4],[7,2,8,2],[9,2,10,2],[11,2,12,2],[7,1,8,1]]}
[null,"CRONOGRAMA FÍSICO-FINANCEIRO"]
[null,"OBRA: ",{"$f":"ORÇAMENTO!C5","v":" PAVIMENTAÇÃO ASFÁLTICA EM CBUQ - DIVERSAS RUAS (MONTES CLAROS / MG)"},null,null,"VALOR:",null,null,null,{"$f":"ORÇAMENTO!I37","v":9688537.6500000004}]
[{"$nulls":5},"PRAZO: ",null,null,null,"240 DIAS "]
[]
[null,"ITEM","ETAPAS/DESCRIÇAO","FISICO/  FINANCEIRO","TOTAL    ETAPAS","MÊS 1","MÊS 2","MÊS 3","MÊS 4","MÊS 5","MÊS 6","MÊS 7","MÊS 8","TOTAL"]
["A",{"$f":"VLOOKUP(A6,ORÇAMENTO!$A$9:$I$37,2)","v":1},{"$f":"VLOOKUP(A6,ORÇAMENTO!$A$9:$I$37,3)","v":"SERVIÇOS PRELIMINARES"},"FISICO ",{"$f":"ROUND(E7/$J$2,4)","v":4.3200000000000002E-2},0.25,0.1,0.1,0.1,0.1,0.1,0.1,0.15,{"$f":"SUM(F6:M6)","v":0.99999999999999989}]
[null,null,null,"FINANCEIRO",{"$f":"ORÇAMENTO!I9","v":418618.29},{"$f":"ROUND($E$7*F6,2)","v":104654.57},41861.83,41861.83,41861.83,41861.83,41861.83,41861.83,62792.74,{"$f":"SUM(F7:M7)","v":418618.2900000001}]
["B",{"$f":"VLOOKUP(A8,ORÇAMENTO!$A$9:$I$37,2)","v":2},{"$f":"VLOOKUP(A8,ORÇAMENTO!$A$9:$I$37,3)","v":"PAVIMENTAÇÃO"},"FISICO ",{"$f":"ROUND(E9/$J$2,4)","v":0.24679999999999999},0.125,0.125,0.125,0.125,0.125,0.125,0.125,0.125,{"$f":"SUM(F8:M8)","v":1}]
[null,null,null,"FINANCEIRO",{"$f":"ORÇAMENTO!I15","v":2390754},{"$f":"ROUND($E$9*F8,2)","v":298844.25},298844.25,298844.25,298844.25,298844.25,298844.25,298844.25,298844.25,{"$f":"SUM(F9:M9)","v":2390754}]
["C",{"$f":"VLOOKUP(A10,ORÇAMENTO!$A$9:$I$37,2)","v":3},{"$f":"VLOOKUP(A10,ORÇAMENTO!$A$9:$I$37,3)","v":"TRANSPORTE DE MATERIAIS"},"FISICO ",{"$f":"ROUND(E11/$J$2,4)","v":7.0599999999999996E-2},0.125,0.125,0.125,0.125,0.125,0.125,0.125,0.125,{"$f":"SUM(F10:M10)","v":1}]
[null,null,null,"FINANCEIRO",{"$f":"ORÇAMENTO!I23","v":683827},{"$f":"ROUND($E$11*F10,2)","v":85478.38},85478.38,85478.38,85478.38,85478.38,85478.38,85478.38,85478.38,{"$f":"SUM(F11:M11)-0.04","v":683827}]
["D",{"$f":"VLOOKUP(A12,ORÇAMENTO!$A$9:$I$37,2)","v":4},{"$f":"VLOOKUP(A12,ORÇAMENTO!$A$9:$I$37,3)","v":"OBRAS COMPLEMENTARES"},"FISICO ",{"$f":"ROUND(E13/$J$2,4)","v":0.214},0.125,0.125,0.125,0.125,0.125,0.125,0.125,0.125,{"$f":"SUM(F12:M12)","v":1}]
[null,null,null,"FINANCEIRO",{"$f":"ORÇAMENTO!I27","v":2073639.18},{"$f":"ROUND($E$13*F12,2)","v":259204.9},259204.9,259204.9,259204.9,259204.9,259204.9,259204.9,259204.9,{"$f":"SUM(F13:M13)-0.02","v":2073639.1799999997}]
["E",{"$f":"VLOOKUP(A14,ORÇAMENTO!$A$9:$I$37,2)","v":5},{"$f":"VLOOKUP(A14,ORÇAMENTO!$A$9:$I$37,3)","v":"FORNECIMENTOS - MATERIAL ASFÁLTICO (BDI DIFERENCIADO)"},"FISICO ",{"$f":"ROUND(E15/$J$2,4)","v":0.4254},0.125,0.125,0.125,0.125,0.125,0.125,0.125,0.125,1]
[null,null,null,"FINANCEIRO",{"$f":"ORÇAMENTO!I33","v":4121699.18},{"$f":"ROUND($E$15*F14,2)","v":515212.4},{"$f":"ROUND($E$15*G14,2)","v":515212.4},515212.4,515212.4,515212.4,515212.4,515212.4,515212.4,{"$f":"SUM(F15:M15)-0.02","v":4121699.1799999997}]
[null,"TOTAL",null,"FISICO ",{"$f":"SUM(F16:M16)","v":1.0000000082571803},{"$f":"F17/$E$17","v":0.13040094858897514},{"$f":"G17/$E$17","v":0.12391981157238935},0.12391981157238935,0.12391981157238935,0.12391981157238935,0.12391981157238935,0.12391981157238935,0.12608019023386877,1.0000000082571803]
[null,null,null,"FINANCEIRO",{"$f":"E11+E9+E7+E13+E15","v":9688537.6500000004},{"$f":"F11+F9+F7+F13+F15","v":1263394.5},{"$f":"G11+G9+G7+G13+G15","v":1200601.76},1200601.76,1200601.76,1200601.76,1200601.76,1200601.76,1221532.67,{"$f":"SUM(F17:M17)-0.08","v":9688537.6499999985}]
[]
[null,"OBSERVAÇÕES:"]