{"text_format":"2","workbook":"xlsx","n_sheets":5,"sheets":["ORÇAMENTO","CPU","BDI SERV","BDI FORN","CRONOGRAMA"],"not_rendered":{"charts":0,"images":2,"macros":0,"external_links":0,"defined_names":5,"comments":1,"pivot_tables":0},"unopened":[],"bounds":{"document_bytes":16777216,"sheet_cells":100000,"run_cost":"one","rows_first":2000,"rows_last":500,"rows_between":2000,"halvings":0,"cell_chars":16384,"cell_head_chars":4096},"cells_cut":0,"cells_raw":0,"read":"whole","date_system":"1900"}

{"sheet":"ORÇAMENTO","index":0,"n_rows":37,"n_cols":11,"rows_kept":37,"cut":false,"hidden":false,"merged":[[6,6,6,7],[36,1,36,2],[0,0,7,0],[0,2,0,8],[1,2,1,8],[2,2,2,8],[4,2,4,8],[5,6,5,7],[6,1,6,2]]}
["<---- NUMERAR SERVIÇOS PARA CPU",null,"Ministério do Desenvolvimento Regional"]
[null,null,"Companhia de Desenvolvimento dos Vales do São Francisco e do Parnaíba"]
[null,null,"1ª Superintendência Regional"]
[]
[null,"OBRA: "," PAVIMENTAÇÃO ASFÁLTICA EM CBUQ - DIVERSAS RUAS (MONTES CLAROS / MG)"]
[null,"DATA:","OUTUBRO / 2.021   ",null,null,null,"BDI Serviços:",null,{"$f":"'BDI SERV'!D31/100","v":0.22920000000000001}]
[null,"PRAZO DE EXECUÇÃO:     240 DIAS",{"$nulls":4},"BDI Serviços:",null,{"$f":"'BDI FORN'!D31/100","v":0.15}]
[null,"ITEM","DISCRIMINAÇÃO","REFER.","UNID.","QUANT.","P. UNITÁRIO","P.UNIT.C/ BDI","P. TOTAL",{"$f":"I37","v":9688537.6500000004},{"$f":"500000*0.955","v":477500}]
["A",1,"SERVIÇOS PRELIMINARES",{"$nulls":5},{"$f":"SUM(I10:I14)","v":418618.29},{"$f":"I9/$I$37","v":4.320758251891605E-2}]
[1,"1.1","MOBILIZAÇÃO E DESMOBILIZAÇÃO","CPU.1","GL",1,{"$f":"VLOOKUP(A10,CPU!$A$1:$N$4656,9)","v":5053.7599999999993},{"$f":"VLOOKUP(A10,CPU!$A$1:$N$4656,10)","v":6212.08},{"$f":"ROUND(F10*H10,2)","v":6212.08},{"$f":"I10/$I$37","v":6.4117828968750506E-4}]
[2,"1.2","ADMINISTRAÇÃO LOCAL","CPU.2","GL",1,{"$f":"VLOOKUP(A11,CPU!$A$1:$N$4656,9)","v":259895.2},{"$f":"VLOOKUP(A11,CPU!$A$1:$N$4656,10)","v":319463.18},{"$f":"ROUND(F11*H11,2)","v":319463.18},3.2973312541134621E-2]
[3,"1.3","CANTEIRO DE OBRAS","CPU.3","GL",1,{"$f":"VLOOKUP(A12,CPU!$A$1:$N$4656,9)","v":50391.149999999994},{"$f":"VLOOKUP(A12,CPU!$A$1:$N$4656,10)","v":61940.800000000003},{"$f":"ROUND(F12*H12,2)","v":61940.800000000003},6.3932042417154666E-3]
[4,"1.4","PLACA DE OBRA EM CHAPA DE AÇO GALVANIZADO","74209/001","M2",36,{"$f":"VLOOKUP(A13,CPU!$A$1:$N$4656,9)","v":551.75},{"$f":"VLOOKUP(A13,CPU!$A$1:$N$4656,10)","v":678.21},{"$f":"ROUND(F13*H13,2)","v":24415.56},2.5200459431563441E-3]
[5,"1.5","LOCAÇÃO DE PAVIMENTAÇÃO",99064,"M",9277,{"$f":"VLOOKUP(A14,CPU!$A$1:$N$4656,9)","v":0.57999999999999996},{"$f":"VLOOKUP(A14,CPU!$A$1:$N$4656,10)","v":0.71},{"$f":"ROUND(F14*H14,2)","v":6586.67},6.798415032221091E-4]
["B",2,"PAVIMENTAÇÃO",{"$nulls":5},{"$f":"SUM(I16:I22)","v":2390754},0.24676107854109439]
[6,"2.1","ESCAVAÇÃO HORIZONTAL EM SOLO DE 1A CATEGORIA ",101116,"M3",20070,{"$f":"VLOOKUP(A16,CPU!$A$1:$N$4656,9)","v":1.63},{"$f":"VLOOKUP(A16,CPU!$A$1:$N$4656,10)","v":2},{"$f":"ROUND(F16*H16,2)","v":40140},4.143040100587316E-3]
[7,"2.2","CARGA, MANOBRA E DESCARGA DE SOLOS E MATERIAIS GRANULARES EM CAMINHÃO BASCULANTE",100976,"M3",20070,{"$f":"VLOOKUP(A17,CPU!$A$1:$N$4656,9)","v":6.41},{"$f":"VLOOKUP(A17,CPU!$A$1:$N$4656,10)","v":7.88},{"$f":"ROUND(F17*H17,2)","v":158151.6},1.6323577996314027E-2]
[8,"2.3","REGULARIZAÇÃO DO SUBLEITO ","4011209a","M2",66900,{"$f":"VLOOKUP(A18,CPU!$A$1:$N$4656,9)","v":0.74919999999999987},{"$f":"VLOOKUP(A18,CPU!$A$1:$N$4656,10)","v":0.92},61548,6.3526614875672183E-3]
[9,"2.4","EXECUÇÃO E COMPACTAÇÃO DE BASE E OU SUB BASE PARA PAVIMENTAÇÃO DE BRITA GRADUADA SIMPLES - EXCLUSIVE TRANSPORTE",96396,"M3",9619.9999999999982,{"$f":"VLOOKUP(A19,CPU!$A$1:$N$4656,9)","v":146.07999999999998},{"$f":"VLOOKUP(A19,CPU!$A$1:$N$4656,10)","v":179.56},1727367.2,0.178289775237649]
[10,"2.5","IMPRIMAÇÃO COM ASFALTO DILUIDO CM-30",96401,"M2",64120,{"$f":"VLOOKUP(A20,CPU!$A$1:$N$4656,9)","v":0.99},{"$f":"VLOOKUP(A20,CPU!$A$1:$N$4656,10)","v":1.22},78226.399999999994,8.0741183887539508E-3]
[11,"2.6","PINTURA DE LIGAÇÃO COM EMULSÃO ASFÁLTICA RR-2C",96402,"M2",64120,{"$f":"VLOOKUP(A21,CPU!$A$1:$N$4656,9)","v":0.78},{"$f":"VLOOKUP(A21,CPU!$A$1:$N$4656,10)","v":0.96},61555.199999999997,6.3534046337736013E-3]
[12,"2.7","EXECUÇÃO DE PAVIMENTO COM APLICAÇÃO DE CONCRETO ASFÁLTICO USINADO A QUENTE (CBUQ), CAMADA DE ROLAMENTO - EXCLUSIVE TRANSPORTE",95995,"M3",2345.0000000000005,{"$f":"VLOOKUP(A22,CPU!$A$1:$N$4656,9)","v":91.509999999999991},{"$f":"VLOOKUP(A22,CPU!$A$1:$N$4656,10)","v":112.48},263765.59999999998,2.7224500696449268E-2]
["C",3,"TRANSPORTE DE MATERIAIS",{"$nulls":5},{"$f":"SUM(I24:I26)","v":683827},7.0581033454517259E-2]
[13,"3.1","TRANSPORTE COM CAMINHÃO BASCULANTE, EM VIA URBANA PAVIMENTADA",95877,"M3XKM",366349.99861871998,{"$f":"VLOOKUP(A24,CPU!$A$1:$N$4656,9)","v":1.36},{"$f":"VLOOKUP(A24,CPU!$A$1:$N$4656,10)","v":1.67},{"$f":"ROUND(F24*H24,2)","v":611804.5},6.314724905878856E-2]
[13.5,"3.2","TRANSPORTE COM CAMINHÃO CARROCERIA 9T, EM VIA URBANA PAVIMENTADA",100947,"TXKM",24950,{"$f":"VLOOKUP(A25,CPU!$A$1:$N$4656,9)","v":1.4900000000000002},{"$f":"VLOOKUP(A25,CPU!$A$1:$N$4656,10)","v":1.83},{"$f":"ROUND(F25*H25,2)","v":45658.5},4.7126307033549071E-3]
[14,"3.3","TRANSPORTE COM CAMINHÃO TANQUE DE TRANSPORTE DE MATERIAL ASFÁLTICO DE 30000 L, EM VIA URBANA PAVIMENTADA",102331,"TXKM",50700,{"$f":"VLOOKUP(A26,CPU!$A$1:$N$4656,9)","v":0.42000000000000004},{"$f":"VLOOKUP(A26,CPU!$A$1:$N$4656,10)","v":0.52},{"$f":"ROUND(F26*H26,2)","v":26364},2.7211536923737916E-3]
["D",4,"OBRAS COMPLEMENTARES",{"$nulls":5},{"$f":"SUM(I28:I32)","v":2073639.18},0.21403015139235176]
[15,"4.1","ASSENTAMENTO DE GUIA (MEIO-FIO) EM TRECHO RETO, CONFECCIONADA EM CONCRETO PRÉ-FABRICADO, DIMENSÕES 100X15X13X30 CM (COMPRIMENTO X BASE INFERIOR X BASE SUPERIOR X ALTURA), PARA VIAS URBANAS (USO VIÁRIO)",94273,"M",18554,{"$f":"VLOOKUP(A28,CPU!$A$1:$N$4656,9)","v":42.070000000000007},{"$f":"VLOOKUP(A28,CPU!$A$1:$N$4656,10)","v":51.71},{"$f":"ROUND(F28*H28,2)","v":959427.34},9.9027053891873967E-2]
[15.05,"4.2","EXECUÇÃO DE SARJETA DE CONCRETO USINADO, MOLDADA  IN LOCO  EM TRECHO RETO, 30 CM BASE X 15 CM ALTURA",94281,"M",18554,{"$f":"VLOOKUP(A29,CPU!$A$1:$N$4656,9)","v":45.3},{"$f":"VLOOKUP(A29,CPU!$A$1:$N$4656,10)","v":55.68},{"$f":"ROUND(F29*H29,2)","v":1033086.72},0.10662978844903388]
[15.1,"4.3","FORNECIMENTO E INSTALAÇÃO DE PLACA DE SINALIZAÇÃO VIÁRIA","CPU.4","UN.",39,{"$f":"VLOOKUP(A30,CPU!$A$1:$N$4656,9)","v":577.65},{"$f":"VLOOKUP(A30,CPU!$A$1:$N$4656,10)","v":710.05},{"$f":"ROUND(F30*H30,2)","v":27691.95},2.8582177208136255E-3]
[15.2,"4.4","PLACA DE AÇO ESMALTADA PARA IDENTIFICACAO DE RUA, *45 CM X 20* CM                                   ",13521,"UN.",75,{"$f":"VLOOKUP(A31,CPU!$A$1:$N$4656,9)","v":148.5},{"$f":"VLOOKUP(A31,CPU!$A$1:$N$4656,10)","v":182.54},{"$f":"ROUND(F31*H31,2)","v":13690.5},1.4130615470127218E-3]
[15.3,"4.5","PINTURA DE FAIXA COM TINTA ACRÍLICA - ESPESSURA DE 0,6 MM","5213401a","M2",1113.24,{"$f":"VLOOKUP(A32,CPU!$A$1:$N$4656,9)","v":29.0411},{"$f":"VLOOKUP(A32,CPU!$A$1:$N$4656,10)","v":35.700000000000003},{"$f":"ROUND(F32*H32,2)","v":39742.67},4.1020297836175511E-3]
["E",5,"FORNECIMENTOS - MATERIAL ASFÁLTICO (BDI DIFERENCIADO)",{"$nulls":5},{"$f":"SUM(I34:I36)","v":4121699.18},0.42542015409312056]
[17,"5.1","AQUISIÇÃO DE ASFALTO DILUIDO DE PETROLEO CM-30 - EXCLUSIVE TRANSPORTE","CPU.5","T",76.944000000000003,{"$f":"VLOOKUP(A34,CPU!$A$1:$N$4656,9)","v":6532.51},{"$f":"VLOOKUP(A34,CPU!$A$1:$N$4656,10)","v":7512.39},{"$f":"ROUND(F34*H34,2)","v":578033.34},5.9661567192237717E-2]
[18,"5.2","AQUISIÇÃO DE EMULSAO ASFALTICA CATIONICA RR-2C - EXCLUSIVE TRANSPORTE","CPU.6","T",28.853999999999999,{"$f":"VLOOKUP(A35,CPU!$A$1:$N$4656,9)","v":3690},{"$f":"VLOOKUP(A35,CPU!$A$1:$N$4656,10)","v":4243.5},{"$f":"ROUND(F35*H35,2)","v":122441.95},1.2637815367317068E-2]
[19,"5.3","AQUISIÇÃO DE CONCRETO BETUMINOSO USINADO A QUENTE (CBUQ) PARA PAVIMENTACAO ASFALTICA, PADRAO DNIT, FAIXA C, COM CAP 50/70 - EXCLUSIVE TRANSPORTE","CPU.7","T",5991.0060000000012,{"$f":"VLOOKUP(A36,CPU!$A$1:$N$4656,9)","v":496.57},{"$f":"VLOOKUP(A36,CPU!$A$1:$N$4656,10)","v":571.05999999999995},{"$f":"ROUND(F36*H36,2)","v":3421223.89},0.35312077153356575]
[null,"TOTAL GERAL DA OBRA COM BDI ",{"$nulls":6},{"$f":"SUM(I9,I15,I23,I27,I33)","v":9688537.6500000004},{"$f":"I37/F20","v":151.10008811603245}," / m²"]

{"sheet":"CPU","index":1,"n_rows":353,"n_cols":13,"rows_kept":353,"cut":false,"hidden":false,"merged":[[340,1,340,6],[341,1,341,6],[321,1,321,3],[321,4,321,7],[322,2,322,5],[323,2,323,3],[324,1,324,7],[327,1,327,3],[327,5,327,6],[328,1,328,6],[329,1,329,6],[330,1,330,6],[213,1,213,6],[180,0,201,0],[202,1,202,3],[343,0,352,0],[343,1,343,3],[343,4,343,7],[344,2,344,5],[345,2,345,3],[346,1,346,7],[349,1,349,3],[349,5,349,6],[350,1,350,6],[351,1,351,6],[352,1,352,6],[321,0,330,0],[332,0,341,0],[332,1,332,3],[332,4,332,7],[333,2,333,5],[334,2,334,3],[335,1,335,7],[338,1,338,3],[338,5,338,6],[339,1,339,6],[122,4,122,7],[123,2,123,5],[124,2,124,3],[125,1,125,7],[137,1,137,3],[137,5,137,6],[138,1,138,6],[139,1,139,6],[140,1,140,6],[228,10,228,11],[229,2,229,5],[230,2,230,3],[231,1,231,7],[235,1,235,3],[235,5,235,6],[228,4,228,7],[240,10,240,11],[241,2,241,5],[240,1,240,3],[240,4,240,7],[0,0,12,0],[13,0,30,0],[31,0,43,0],[44,0,60,0],[61,0,72,0],[73,0,85,0],[100,0,121,0],[142,0,160,0],[161,0,179,0],[86,0,98,0],[122,0,140,0],[180,1,180,3],[180,4,180,7],[163,2,163,3],[180,10,180,11],[181,2,181,5],[182,2,182,3],[183,1,183,7],[197,1,197,3],[197,5,197,6],[176,1,176,6],[177,1,177,6],[178,1,178,6],[162,2,162,5],[100,1,100,3],[100,4,100,7],[198,1,198,6],[228,0,239,0],[228,1,228,3],[185,8,185,9],[202,10,202,11],[203,2,203,5],[204,2,204,3],[205,1,205,7],[238,1,238,6],[236,1,236,6],[237,1,237,6],[199,1,199,6],[200,1,200,6],[210,1,210,3],[210,5,210,6],[211,1,211,6],[212,1,212,6],[164,1,164,7],[175,1,175,3],[175,5,175,6],[202,4,202,7],[100,10,100,11],[101,2,101,5],[102,2,102,3],[103,1,103,7],[117,1,117,3],[117,5,117,6],[161,10,161,11],[118,1,118,6],[119,1,119,6],[120,1,120,6],[142,1,142,3],[142,4,142,7],[142,10,142,11],[143,2,143,5],[144,2,144,3],[145,1,145,7],[156,1,156,3],[156,5,156,6],[157,1,157,6],[158,1,158,6],[159,1,159,6],[161,1,161,3],[161,4,161,7],[122,1,122,3],[73,10,73,11],[74,2,74,5],[75,2,75,3],[76,1,76,7],[81,1,81,3],[81,5,81,6],[82,1,82,6],[83,1,83,6],[84,1,84,6],[73,1,73,3],[73,4,73,7],[61,10,61,11],[62,2,62,5],[63,2,63,3],[64,1,64,7],[68,1,68,3],[68,5,68,6],[69,1,69,6],[70,1,70,6],[71,1,71,6],[61,1,61,3],[61,4,61,7],[44,10,44,11],[45,2,45,5],[46,2,46,3],[47,1,47,7],[56,1,56,3],[56,5,56,6],[57,1,57,6],[58,1,58,6],[59,1,59,6],[44,4,44,7],[31,10,31,11],[32,2,32,5],[33,2,33,3],[34,1,34,7],[32,8,33,9],[39,1,39,3],[39,5,39,6],[40,1,40,6],[41,1,41,6],[13,10,13,11],[14,2,14,5],[15,2,15,3],[16,1,16,7],[26,1,26,3],[26,5,26,6],[14,8,15,9],[0,1,0,3],[0,4,0,7],[0,10,0,11],[1,2,1,5],[2,2,2,3],[3,1,3,7],[8,1,8,3],[8,5,8,6],[9,1,9,6],[1,10,1,11],[10,1,10,6],[11,1,11,6],[13,1,13,3],[13,4,13,7],[252,1,252,6],[253,1,253,6],[256,0,271,0],[256,1,256,3],[256,4,256,7],[257,2,257,5],[258,2,258,3],[27,1,27,6],[28,1,28,6],[29,1,29,6],[98,1,98,6],[86,1,86,3],[86,4,86,7],[87,2,87,5],[88,2,88,3],[89,1,89,7],[95,1,95,3],[95,5,95,6],[96,1,96,6],[97,1,97,6],[31,1,31,3],[31,4,31,7],[42,1,42,6],[44,1,44,3],[273,0,289,0],[273,1,273,3],[273,4,273,7],[274,2,274,5],[275,2,275,3],[276,1,276,7],[286,1,286,3],[286,5,286,6],[287,1,287,6],[288,1,288,6],[289,1,289,6],[303,0,319,0],[303,1,303,3],[303,4,303,7],[304,2,304,5],[305,2,305,3],[306,1,306,7],[316,1,316,3],[316,5,316,6],[317,1,317,6],[318,1,318,6],[319,1,319,6],[291,0,301,0],[291,1,291,3],[291,4,291,7],[292,2,292,5],[293,2,293,3],[294,1,294,7],[298,1,298,3],[298,5,298,6],[299,1,299,6],[300,1,300,6],[301,1,301,6],[259,1,259,7],[268,1,268,3],[268,5,268,6],[269,1,269,6],[270,1,270,6],[271,1,271,6],[202,0,213,0],[215,0,226,0],[215,1,215,3],[215,4,215,7],[216,2,216,5],[217,2,217,3],[218,1,218,7],[223,1,223,3],[223,5,223,6],[224,1,224,6],[225,1,225,6],[226,1,226,6],[240,0,254,0],[254,1,254,6],[242,2,242,3],[243,1,243,7],[251,1,251,3],[251,5,251,6]]}
[1,"CODEVASF",null,null," COMPOSIÇÃO DE PREÇO UNITÁRIO",null,null,null,{"$f":"H10","v":5053.7599999999993},{"$f":"H12","v":6212.08},"BDI CALCULADO:",null,{"$f":"ORÇAMENTO!I6","v":0.22920000000000001}]
[null,"OBRA:  ",{"$f":"ORÇAMENTO!C5","v":" PAVIMENTAÇÃO ASFÁLTICA EM CBUQ - DIVERSAS RUAS (MONTES CLAROS / MG)"},null,null,null,"DATA: ",{"$f":"ORÇAMENTO!C6","v":"OUTUBRO / 2.021   "},null,null,"BDI DIFERENCIADO:",null,{"$f":"'BDI FORN'!D31/100","v":0.15}]
[null,"SERVIÇO:  ",{"$f":"VLOOKUP(A1,ORÇAMENTO!A10:I28,3)","v":"MOBILIZAÇÃO E DESMOBILIZAÇÃO"},null,"Referência:",{"$f":"VLOOKUP(A1,ORÇAMENTO!A10:I28,4)","v":"CPU.1"},"UNIDADE: ",{"$f":"VLOOKUP(A1,ORÇAMENTO!A10:I28,5)","v":"GL"}]
[]
[null,"TIPO ITEM","CODIGO ITEM","DESCRIÇÃO ITEM","UNIDADE ITEM","COEFICIENTE","PRECO UNITARIO","CUSTO TOTAL"]
[null,"COMPOSICAO",89876,"CAMINHÃO BASCULANTE 14 M3, COM CAVALO MECÂNICO DE CAPACIDADE MÁXIMA DE TRAÇÃO COMBINADO DE 36000 KG, POTÊNCIA 286 CV, INCLUSIVE SEMIREBOQUE COM CAÇAMBA METÁLICA","CHP DIURNO.",16,246.54,{"$f":"ROUNDDOWN(F6*G6,2)","v":3944.64}]
[null,"COMPOSICAO",89877,"CAMINHÃO BASCULANTE 14 M3, COM CAVALO MECÂNICO DE CAPACIDADE MÁXIMA DE TRAÇÃO COMBINADO DE 36000 KG, POTÊNCIA 286 CV, INCLUSIVE SEMIREBOQUE COM CAÇAMBA METÁLICA","CHI DIURNO.",16,53.61,{"$f":"ROUNDDOWN(F7*G7,2)","v":857.76}]
[null,"COMPOSIÇÃO",88316,"SERVENTE COM ENCARGOS COMPLEMENTARES","H",16,15.71,251.36]
[null,"PRODUÇÃO DA EQUIPE",null,null,1,"CUSTO ",null,{"$f":"SUM(H6:H8)","v":5053.7599999999993}]
[null,"TOTAL",{"$nulls":5},{"$f":"H9/E9","v":5053.7599999999993}]
[null,"BDI                %",{"$nulls":5},{"$f":"1+$M$1","v":1.2292000000000001}]
[null,"TOTAL DO SERVIÇO - R$",{"$nulls":5},{"$f":"ROUND(H10*H11,2)","v":6212.08}]
[]
[{"$f":"A1+1","v":2},"CODEVASF",null,null," COMPOSIÇÃO DE PREÇO UNITÁRIO",null,null,null,{"$f":"H28","v":259895.2},{"$f":"H30","v":319463.18}]
[null,"OBRA:  ",{"$f":"$C$2","v":" PAVIMENTAÇÃO ASFÁLTICA EM CBUQ - DIVERSAS RUAS (MONTES CLAROS / MG)"},null,null,null,"DATA: ",{"$f":"$H$2","v":"OUTUBRO / 2.021   "},"CALCULAR ÍNDICES PELO PORTE DA OBRA"]
[null,"SERVIÇO:  ",{"$f":"VLOOKUP(A14,ORÇAMENTO!$A$10:$I$28,3)","v":"ADMINISTRAÇÃO LOCAL"},null,"SINAPI","CPU","UNIDADE: ",{"$f":"VLOOKUP(A14,ORÇAMENTO!$A$10:$I$28,5)","v":"GL"}]
[]
[null,"TIPO ITEM","CODIGO ITEM","DESCRIÇÃO ITEM","UNIDADE ITEM","COEFICIENTE","PRECO UNITARIO","CUSTO TOTAL"]
[null,"INSUMO",14250,"ENERGIA ELÉTRICA","kwh",80,1.1599999999999999,{"$f":"ROUNDDOWN(F19*G19,2)","v":92.8}]
[null,"INSUMO",14583,"ÁGUA/ESGOTO ","m³",6,21.95,131.69999999999999]
[null,"COTAÇÃO","MERC.","TELEFONE (PLANO CONTROLE)","UNID",2,50,100]
[null,"INSUMO","ED-50155 SEINFRA","BANHEIRO QUÍMICO 110 X 120 X 230 CM COM MANUTENÇÃO (CONSIDERANDO OBRAS SIMULTÂNEAS)","MÊS",2,515,1030]
[null,"COMPOSICAO",90777,"Engenheiro Civil Júnior com encargos complementares","H",200,95.07,19014]
[null,"COMPOSICAO",90776,"Encarregado Geral com encargos complementares","H",200,42.26,8452]
[null,"COMPOSICAO",88321,"Tecnico de Laboratório com encargos complementares","H",80,29.17,2333.6]
[null,"COMPOSICAO",90772,"Auxiliar de escritório com encargos complementares","H",80,16.66,1332.8]
[null,"PRODUÇÃO DA EQUIPE",null,null,0.125,"CUSTO ",null,{"$f":"SUM(H19:H26)","v":32486.899999999998}]
[null,"TOTAL",{"$nulls":5},{"$f":"ROUND(H27/E27,2)","v":259895.2}]
[null,"BDI                %",{"$nulls":5},{"$f":"1+$M$1","v":1.2292000000000001}]
[null,"TOTAL DO SERVIÇO - R$",{"$nulls":5},{"$f":"ROUND(H28*H29,2)","v":319463.18}]
[]
[{"$f":"A14+1","v":3},"CODEVASF",null,null," COMPOSIÇÃO DE PREÇO UNITÁRIO",null,null,null,{"$f":"H41","v":50391.149999999994},{"$f":"H43","v":61940.800000000003}]
[null,"OBRA:  ",{"$f":"$C$2","v":" PAVIMENTAÇÃO ASFÁLTICA EM CBUQ - DIVERSAS RUAS (MONTES CLAROS / MG)"},null,null,null,"DATA: ",{"$f":"$H$2","v":"OUTUBRO / 2.021   "},"QUANTIDADES PELO PORTE E PRAZO DA OBRA"]
[null,"SERVIÇO:  ",{"$f":"VLOOKUP(A32,ORÇAMENTO!$A$10:$I$28,3)","v":"CANTEIRO DE OBRAS"},null,"SINAPI",{"$f":"VLOOKUP(A32,ORÇAMENTO!$A$10:$I$28,4)","v":"CPU.3"},"UNIDADE: ",{"$f":"VLOOKUP(A32,ORÇAMENTO!$A$10:$I$28,5)","v":"GL"}]
[]
[null,"TIPO ITEM","CODIGO ITEM","DESCRIÇÃO ITEM","UNIDADE ITEM","COEFICIENTE","PRECO UNITARIO","CUSTO TOTAL"]
[null,"COMPOSICAO",93207,"EXECUÇÃO DE ESCRITÓRIO EM CANTEIRO DE OBRA EM CHAPA DE MADEIRA COMPENSADA COM MOBILIÁRIO","M2",10,1239.17,{"$f":"ROUNDDOWN(F37*G37,2)","v":12391.7}]
[null,"COMPOSICAO",93208,"EXECUÇÃO DE ALMOXARIFADO EM CANTEIRO DE OBRA EM CHAPA DE MADEIRA COMPENSADA, INCLUSO PRATELEIRAS","M2",15,1088.51,16327.65]
[null,"COMPOSICAO",93312,"EXECUÇÃO DE SANITÁRIO E VESTIÁRIO EM CANTEIRO DE OBRA EM CHAPA DE MADEIRA COMPENSADA","M2",20,1083.5899999999999,{"$f":"ROUNDDOWN(F39*G39,2)","v":21671.8}]
[null,"PRODUÇÃO DA EQUIPE",null,null,1,"CUSTO ",null,{"$f":"SUM(H37:H39)","v":50391.149999999994}]
{"$rows_left_out":314}
{"sheet":"BDI SERV","index":2,"n_rows":37,"n_cols":5,"rows_kept":37,"cut":false,"hidden":false,"merged":[[36,0,36,5],[3,1,4,1],[3,2,4,2],[0,1,2,4],[32,0,34,5],[28,0,28,5],[30,1,30,2],[31,1,31,2]]}
[null,"DETALHAMENTO DO BDI - SERVIÇOS"]
[]
[]
[null,"Item","Descrição dos Serviços","%","%"]
[null,null,null,"PV","CD"]
[]
[null,1,"ADMINISTRAÇÃO CENTRAL"," ",4.01]
[null,"1.1","ESCRITÓRIO CENTRAL"," "," "]
[null,"1.2","VIAGENS"," "," "]
[null,"1.3","OUTROS"," "," "]
[null," "," "," "," "]
[null,2,"IMPOSTOS E TAXAS",{"$f":"SUM(D13:D16)","v":6.15},{"$f":"SUM(E13:E16)","v":7.6899999999999995}]
[null,"2.1","ISS (*)",2.5,{"$f":"ROUND(D13*1.2515,2)","v":3.13}]
[null,"2.2","PIS",0.65,0.81]
[null,"2.3","Cofins",3,3.75]
[null,"2.4","CONTRIBUIÇÃO PREVIDENCIÁRIA SOBRE A RENDA BRUTA",0,0]
[]
[null,3,"TAXA DE RISCO"," ",{"$f":"SUM(E19:E22)","v":0.96}]
[null,"3.1","SEGURO",null,0.2]
[null,"3.2","RISCO",null,0.56000000000000005]
[null,"3.3","GARANTIA",null,0.2]
[]
[null,4,"DESPESAS FINANCEIRAS"," ",1.1100000000000001]
[]
[null,5,"LUCRO",null,8.69]
[]
[null," ","BDI - CALCULADO"," ",{"$f":"ROUND((((1+(E7+E18)/100)*(1+E23/100)*(1+E25/100)/(1-D12/100)-1)*100),2)","v":22.92}]
[]
["BDI = ((1+((AC+S+R+G)/100))x(1+DF/100)x(1+L/100)/(1-I/100)-1)*100"]
[]
[null,"BDI (CALCULADO):",null,{"$f":"ROUND((((1+((E7+E18)/100))*(1+E23/100)*(1+E25/100))/(1-D12/100)-1)*100,2)","v":22.92},"%"]
[null," "]
["(*) ISS CONFORME LEI COMPLEMENTAR Nº 04 / 2005 - Atualizado até a LC nº 64, de 27/12/2017 - \nConsiderando as deduções previstas no Art. 62 - § 2º (Quant. Estimada de Material: 50%)"]
[]
[]
[]
["BDI EM CONFORMIDADE COM OS ACÓRDÃOS Nº 2369/2011 e ACÓRDÃO Nº 2.622/2013 - TCU - PLENÁRIO"]

{"sheet":"BDI FORN","index":3,"n_rows":37,"n_cols":5,"rows_kept":37,"cut":false,"hidden":false,"merged":[[32,0,34,5],[36,0,36,5],[0,1,2,4],[3,1,4,1],[3,2,4,2],[28,0,28,5],[30,1,30,2],[31,1,31,2]]}
[null,"DETALHAMENTO DO BDI - FORNECIMENTO \n(MATERIAL ASFÁLTICO)"]
[]
[]
[null,"Item","Descrição dos Serviços","%","%"]
[null,null,null,"PV","CD"]
[]
[null,1,"ADMINISTRAÇÃO CENTRAL"," ",3.72]
[null,"1.1","ESCRITÓRIO CENTRAL"," "," "]
[null,"1.2","VIAGENS"," "," "]
[null,"1.3","OUTROS"," "," "]
[null," "," "," "," "]
[null,2,"IMPOSTOS E TAXAS",{"$f":"SUM(D13:D16)","v":3.65},{"$f":"SUM(E13:E16)","v":4.5600000000000005}]
[null,"2.1","ISS (*)",null,{"$f":"ROUND(D13*1.2515,2)","v":0}]
[null,"2.2","PIS",0.65,0.81]
[null,"2.3","Cofins",3,3.75]
[null,"2.4","CONTRIBUIÇÃO PREVIDENCIÁRIA SOBRE A RENDA BRUTA",0,0]
[]
[null,3,"TAXA DE RISCO"," ",{"$f":"SUM(E19:E22)","v":0.82000000000000006}]
[null,"3.1","SEGURO",null,0.16]
[null,"3.2","RISCO",null,0.5]
[null,"3.3","GARANTIA",null,0.16]
[]
[null,4,"DESPESAS FINANCEIRAS"," ",0.94]
[]
[null,5,"LUCRO",null,5]
[]
[null," ","BDI - CALCULADO"," ",{"$f":"ROUND((((1+(E7+E18)/100)*(1+E23/100)*(1+E25/100)/(1-D12/100)-1)*100),2)","v":15}]
[]
["BDI = ((1+((AC+S+R+G)/100))x(1+DF/100)x(1+L/100)/(1-I/100)-1)*100"]
[]
[null,"BDI (CALCULADO):",null,{"$f":"ROUND((((1+((E7+E18)/100))*(1+E23/100)*(1+E25/100))/(1-D12/100)-1)*100,2)","v":15},"%"]
[null," "]
[]
[]
[]
[]
["BDI EM CONFORMIDADE COM OS ACÓRDÃOS Nº 2369/2011 e ACÓRDÃO Nº 2.622/2013 - TCU - PLENÁRIO"]

{"sheet":"CRONOGRAMA","index":4,"n_rows":19,"n_cols":14,"rows_kept":19,"cut":false,"hidden":false,"merged":[[15,1,16,2],[18,1,22,13],[9,1,10,1],[11,1,12,1],[13,0,14,0],[13,1,14,1],[13,2,14,2],[7,0,8,0],[9,0,10,0],[11,0,12,0],[0,1,0,13],[1,9,1,13],[2,9,2,13],[3,1,3,9],[5,0,6,0],[5,2,6,2],[1,1,2,1],[5,1,6,1],[1,2,2,4],[7,2,8,2],[9,2,10,2],[11,2,12,2],[7,1,8,1]]}
[null,"CRONOGRAMA FÍSICO-FINANCEIRO"]
[null,"OBRA: ",{"$f":"ORÇAMENTO!C5","v":" PAVIMENTAÇÃO ASFÁLTICA EM CBUQ - DIVERSAS RUAS (MONTES CLAROS / MG)"},null,null,"VALOR:",null,null,null,{"$f":"ORÇAMENTO!I37","v":9688537.6500000004}]
[{"$nulls":5},"PRAZO: ",null,null,null,"240 DIAS "]
[]
[null,"ITEM","ETAPAS/DESCRIÇAO","FISICO/  FINANCEIRO","TOTAL    ETAPAS","MÊS 1","MÊS 2","MÊS 3","MÊS 4","MÊS 5","MÊS 6","MÊS 7","MÊS 8","TOTAL"]
["A",{"$f":"VLOOKUP(A6,ORÇAMENTO!$A$9:$I$37,2)","v":1},{"$f":"VLOOKUP(A6,ORÇAMENTO!$A$9:$I$37,3)","v":"SERVIÇOS PRELIMINARES"},"FISICO ",{"$f":"ROUND(E7/$J$2,4)","v":4.3200000000000002E-2},0.25,0.1,0.1,0.1,0.1,0.1,0.1,0.15,{"$f":"SUM(F6:M6)","v":0.99999999999999989}]
[null,null,null,"FINANCEIRO",{"$f":"ORÇAMENTO!I9","v":418618.29},{"$f":"ROUND($E$7*F6,2)","v":104654.57},41861.83,41861.83,41861.83,41861.83,41861.83,41861.83,62792.74,{"$f":"SUM(F7:M7)","v":418618.2900000001}]
["B",{"$f":"VLOOKUP(A8,ORÇAMENTO!$A$9:$I$37,2)","v":2},{"$f":"VLOOKUP(A8,ORÇAMENTO!$A$9:$I$37,3)","v":"PAVIMENTAÇÃO"},"FISICO ",{"$f":"ROUND(E9/$J$2,4)","v":0.24679999999999999},0.125,0.125,0.125,0.125,0.125,0.125,0.125,0.125,{"$f":"SUM(F8:M8)","v":1}]
[null,null,null,"FINANCEIRO",{"$f":"ORÇAMENTO!I15","v":2390754},{"$f":"ROUND($E$9*F8,2)","v":298844.25},298844.25,298844.25,298844.25,298844.25,298844.25,298844.25,298844.25,{"$f":"SUM(F9:M9)","v":2390754}]
["C",{"$f":"VLOOKUP(A10,ORÇAMENTO!$A$9:$I$37,2)","v":3},{"$f":"VLOOKUP(A10,ORÇAMENTO!$A$9:$I$37,3)","v":"TRANSPORTE DE MATERIAIS"},"FISICO ",{"$f":"ROUND(E11/$J$2,4)","v":7.0599999999999996E-2},0.125,0.125,0.125,0.125,0.125,0.125,0.125,0.125,{"$f":"SUM(F10:M10)","v":1}]
[null,null,null,"FINANCEIRO",{"$f":"ORÇAMENTO!I23","v":683827},{"$f":"ROUND($E$11*F10,2)","v":85478.38},85478.38,85478.38,85478.38,85478.38,85478.38,85478.38,85478.38,{"$f":"SUM(F11:M11)-0.04","v":683827}]
["D",{"$f":"VLOOKUP(A12,ORÇAMENTO!$A$9:$I$37,2)","v":4},{"$f":"VLOOKUP(A12,ORÇAMENTO!$A$9:$I$37,3)","v":"OBRAS COMPLEMENTARES"},"FISICO ",{"$f":"ROUND(E13/$J$2,4)","v":0.214},0.125,0.125,0.125,0.125,0.125,0.125,0.125,0.125,{"$f":"SUM(F12:M12)","v":1}]
[null,null,null,"FINANCEIRO",{"$f":"ORÇAMENTO!I27","v":2073639.18},{"$f":"ROUND($E$13*F12,2)","v":259204.9},259204.9,259204.9,259204.9,259204.9,259204.9,259204.9,259204.9,{"$f":"SUM(F13:M13)-0.02","v":2073639.1799999997}]
["E",{"$f":"VLOOKUP(A14,ORÇAMENTO!$A$9:$I$37,2)","v":5},{"$f":"VLOOKUP(A14,ORÇAMENTO!$A$9:$I$37,3)","v":"FORNECIMENTOS - MATERIAL ASFÁLTICO (BDI DIFERENCIADO)"},"FISICO ",{"$f":"ROUND(E15/$J$2,4)","v":0.4254},0.125,0.125,0.125,0.125,0.125,0.125,0.125,0.125,1]
[null,null,null,"FINANCEIRO",{"$f":"ORÇAMENTO!I33","v":4121699.18},{"$f":"ROUND($E$15*F14,2)","v":515212.4},{"$f":"ROUND($E$15*G14,2)","v":515212.4},515212.4,515212.4,515212.4,515212.4,515212.4,515212.4,{"$f":"SUM(F15:M15)-0.02","v":4121699.1799999997}]
[null,"TOTAL",null,"FISICO ",{"$f":"SUM(F16:M16)","v":1.0000000082571803},{"$f":"F17/$E$17","v":0.13040094858897514},{"$f":"G17/$E$17","v":0.12391981157238935},0.12391981157238935,0.12391981157238935,0.12391981157238935,0.12391981157238935,0.12391981157238935,0.12608019023386877,1.0000000082571803]
[null,null,null,"FINANCEIRO",{"$f":"E11+E9+E7+E13+E15","v":9688537.6500000004},{"$f":"F11+F9+F7+F13+F15","v":1263394.5},{"$f":"G11+G9+G7+G13+G15","v":1200601.76},1200601.76,1200601.76,1200601.76,1200601.76,1200601.76,1221532.67,{"$f":"SUM(F17:M17)-0.08","v":9688537.6499999985}]
[]
[null,"OBSERVAÇÕES:"]