{"text_format":"2","workbook":"xlsx","n_sheets":4,"sheets":["ORÇAMENTO","CPU","BDI SERV","CRONOGRAMA"],"not_rendered":{"charts":0,"images":1,"macros":0,"external_links":0,"defined_names":4,"comments":1,"pivot_tables":0},"unopened":[],"bounds":{"document_bytes":16777216,"sheet_cells":100000,"run_cost":"one","rows_first":2000,"rows_last":500,"rows_between":2000,"halvings":0,"cell_chars":16384,"cell_head_chars":4096},"cells_cut":0,"cells_raw":0,"read":"whole","date_system":"1900"}

{"sheet":"ORÇAMENTO","index":0,"n_rows":31,"n_cols":9,"rows_kept":31,"cut":false,"hidden":false,"merged":[[30,1,30,7],[6,6,6,7],[0,0,7,0],[0,2,0,8],[1,2,1,8],[2,2,2,8],[4,2,4,8],[5,6,5,7],[6,1,6,2]]}
["<---- NUMERAR SERVIÇOS PARA CPU",null,"Ministério do Desenvolvimento Regional"]
[null,null,"Companhia de Desenvolvimento dos Vales do São Francisco e do Parnaíba"]
[null,null,"1ª Superintendência Regional"]
[]
[null,"OBRA: "," PASSAGEM MOLHADA DA PRAINHA - RIO MOSQUITO (ESTRADA PARA TALHADO - SERRANÓPOLIS DE MINAS/MG)"]
[null,"DATA:"," AGOSTO / 2.021   ",null,null,null,"BDI Serviços:",null,{"$f":"'BDI SERV'!D31/100","v":0.22469999999999998}]
[null,"PRAZO DE EXECUÇÃO:     90 DIAS"]
[null,"ITEM","DISCRIMINAÇÃO","REFER.","UNID.","QUANT.","P. UNITÁRIO","P.UNIT.C/ BDI","P. TOTAL"]
["A",1,"SERVIÇOS PRELIMINARES ",{"$nulls":5},{"$f":"SUM(I10:I14)","v":30451.399999999998}]
[1,"1.1","MOBILIZAÇÃO E DESMOBILIZAÇÃO","CPU.1","GL",1,{"$f":"VLOOKUP(A10,CPU!$A$1:$N$4589,9)","v":4184},{"$f":"VLOOKUP(A10,CPU!$A$1:$N$4589,10)","v":5124.1448},{"$f":"ROUND(F10*H10,2)","v":5124.1400000000003}]
[2,"1.2","ADMINISTRAÇÃO LOCAL","CPU.2","GL",1,{"$f":"VLOOKUP(A11,CPU!$A$1:$N$4589,9)","v":13565.300000000001},{"$f":"VLOOKUP(A11,CPU!$A$1:$N$4589,10)","v":16613.422910000001},{"$f":"ROUND(F11*H11,2)","v":16613.419999999998}]
[3,"1.3","CANTEIRO DE OBRAS","CPU.3","GL",1,{"$f":"VLOOKUP(A12,CPU!$A$1:$N$4589,9)","v":1755},{"$f":"VLOOKUP(A12,CPU!$A$1:$N$4589,10)","v":2149.3484999999996},{"$f":"ROUND(F12*H12,2)","v":2149.35}]
[4,"1.4","PLACA DE OBRA EM CHAPA DE AÇO GALVANIZADO","74209/001","M2",2,{"$f":"VLOOKUP(A13,CPU!$A$1:$N$4589,9)","v":465.94000000000005},{"$f":"VLOOKUP(A13,CPU!$A$1:$N$4589,10)","v":570.63671799999997},{"$f":"ROUND(F13*H13,2)","v":1141.27}]
[5,"1.5","LOCACAO CONVENCIONAL DE OBRA, UTILIZANDO GABARITO DE TÁBUAS CORRIDAS PONTALETADAS A CADA 2,00M",99059,"M",70,{"$f":"VLOOKUP(A14,CPU!$A$1:$N$4589,9)","v":63.260000000000005},{"$f":"VLOOKUP(A14,CPU!$A$1:$N$4589,10)","v":77.474521999999993},{"$f":"ROUND(F14*H14,2)","v":5423.22}]
["B",2,"TERRAPLANAGEM E ESTRUTURA",{"$nulls":5},{"$f":"SUM(I16:I28)","v":122401.21000000002}]
[6,"2.1","ESCAVAÇÃO HORIZONTAL EM SOLO DE 1A CATEGORIA",101116,"M3",129.99619999999999,{"$f":"VLOOKUP(A16,CPU!$A$1:$N$4589,9)","v":1.6199999999999999},{"$f":"VLOOKUP(A16,CPU!$A$1:$N$4589,10)","v":1.9840139999999997},{"$f":"ROUND(F16*H16,2)","v":257.91000000000003}]
[7,"2.2","ESCAVAÇÃO MANUAL PARA BLOCO DE COROAMENTO OU SAPATA, SEM PREVISÃO DE FÔRMA",96522,"M3",4,{"$f":"VLOOKUP(A17,CPU!$A$1:$N$4589,9)","v":117.28999999999999},{"$f":"VLOOKUP(A17,CPU!$A$1:$N$4589,10)","v":143.64506299999996},{"$f":"ROUND(F17*H17,2)","v":574.58000000000004}]
[8,"2.2","CARGA, MANOBRA E DESCARGA DE SOLOS E MATERIAIS GRANULARES EM CAMINHÃO BASCULANTE - CARGA COM PÁ CARREGADEIRA  E DESCARGA LIVRE ",100976,"M3",129.99619999999999,{"$f":"VLOOKUP(A18,CPU!$A$1:$N$4589,9)","v":6.1400000000000006},{"$f":"VLOOKUP(A18,CPU!$A$1:$N$4589,10)","v":7.5196579999999997},{"$f":"ROUND(F18*H18,2)","v":977.53}]
[9,"2.3","PREPARO DE FUNDO DE VALA COM LARGURA MAIOR OU IGUAL A 1,5 M (ACERTO DO SOLO NATURAL)",101617,"M2",140,{"$f":"VLOOKUP(A19,CPU!$A$1:$N$4589,9)","v":2.3699999999999997},{"$f":"VLOOKUP(A19,CPU!$A$1:$N$4589,10)","v":2.9025389999999995},406.36]
[10,"2.4","LASTRO DE BRITA, ESPESSURA 5CM",96622,"M3",7,{"$f":"VLOOKUP(A20,CPU!$A$1:$N$4589,9)","v":131.82999999999998},{"$f":"VLOOKUP(A20,CPU!$A$1:$N$4589,10)","v":161.45220099999997},1130.17]
[11,"2.5","FABRICAÇÃO, MONTAGEM E DESMONTAGEM DE FÔRMA PARA VIGAS EM CHAPA DE MADEIRA COMPENSADA RESINADA, E=17 MM",96542,"M2",170,{"$f":"VLOOKUP(A21,CPU!$A$1:$N$4589,9)","v":79.55},{"$f":"VLOOKUP(A21,CPU!$A$1:$N$4589,10)","v":97.424884999999989},16562.23]
[12,"2.6","ARMAÇÃO DE BLOCO, VIGA BALDRAME E SAPATA UTILIZANDO AÇO CA-60 DE 4.2 OU 5 MM - MONTAGEM",96543,"KG",230.00299999999999,{"$f":"VLOOKUP(A22,CPU!$A$1:$N$4589,9)","v":20.34},{"$f":"VLOOKUP(A22,CPU!$A$1:$N$4589,10)","v":24.910397999999997},5729.47]
[13,"2.7","ARMAÇÃO DE BLOCO, VIGA BALDRAME OU SAPATA UTILIZANDO AÇO CA-50 DE 10MM - MONTAGEM",96546,"KG",299.99799999999999,{"$f":"VLOOKUP(A23,CPU!$A$1:$N$4589,9)","v":16.79},{"$f":"VLOOKUP(A23,CPU!$A$1:$N$4589,10)","v":20.562712999999999},6168.77]
[14,"2.8","CONCRETO FCK = 25MPA - PREPARO MECÂNICO COM BETONEIRA",94965,"M3",140,{"$f":"VLOOKUP(A24,CPU!$A$1:$N$4589,9)","v":394.17},{"$f":"VLOOKUP(A24,CPU!$A$1:$N$4589,10)","v":482.73999899999995},67583.600000000006]
[15,"2.9","ENSECADEIRA COM SACOS DE RÁFIA, INCLUSIVE FORNECIMENTO DO MATERIAL DE ENCHIMENTO","C2767a","M3",16,{"$f":"VLOOKUP(A25,CPU!$A$1:$N$4589,9)","v":186.26000000000002},{"$f":"VLOOKUP(A25,CPU!$A$1:$N$4589,10)","v":228.11262200000002},{"$f":"ROUND(F25*H25,2)","v":3649.8}]
[16,"2.10","LANÇAMENTO COM USO DE BOMBA, ADENSAMENTO E ACABAMENTO DE CONCRETO EM ESTRUTURAS",92874,"M3",140,{"$f":"VLOOKUP(A26,CPU!$A$1:$N$4589,9)","v":27.639999999999997},{"$f":"VLOOKUP(A26,CPU!$A$1:$N$4589,10)","v":33.85070799999999},4739.1000000000004]
[17,"2.11","TUBO DE CONCRETO DIÂMETRO DE 800 MM, JUNTA RÍGIDA - FORNECIMENTO E ASSENTAMENTO",92214,"M",20,{"$f":"VLOOKUP(A27,CPU!$A$1:$N$4589,9)","v":459.15000000000003},{"$f":"VLOOKUP(A27,CPU!$A$1:$N$4589,10)","v":562.32100500000001},{"$f":"ROUND(F27*H27,2)","v":11246.42}]
[18,"2.10","TRANSPORTE COM CAMINHÃO BASCULANTE DE 18 M3, EM VIA URBANA PAVIMENTADA",95427,"M3XKM",5199.9972000000007,{"$f":"VLOOKUP(A28,CPU!$A$1:$N$4589,9)","v":0.53},{"$f":"VLOOKUP(A28,CPU!$A$1:$N$4589,10)","v":0.64909099999999997},{"$f":"ROUND(F28*H28,2)","v":3375.27}]
["c",3,"OBRAS COMPLEMENTARES",{"$nulls":5},{"$f":"SUM(I30:I30)","v":631.30999999999995}]
[19,"3.1","ATERRO MANUAL COM COMPACTAÇÃO MECANIZADA",94319,"M3",14,{"$f":"VLOOKUP(A30,CPU!$A$1:$N$4589,9)","v":36.82},{"$f":"VLOOKUP(A30,CPU!$A$1:$N$4589,10)","v":45.093453999999994},{"$f":"ROUND(F30*H30,2)","v":631.30999999999995}]
[null,"TOTAL GERAL DA OBRA COM BDI ",{"$nulls":6},{"$f":"SUM(I9,I15,I29)","v":153483.92000000001}]

{"sheet":"CPU","index":1,"n_rows":295,"n_cols":13,"rows_kept":295,"cut":false,"hidden":false,"merged":[[102,1,102,6],[91,1,91,3],[91,4,91,7],[92,2,92,5],[93,2,93,3],[94,1,94,7],[99,1,99,3],[99,5,99,6],[100,1,100,6],[101,1,101,6],[234,0,249,0],[133,1,133,3],[133,4,133,7],[134,2,134,5],[135,2,135,3],[136,1,136,7],[143,1,143,3],[143,5,143,6],[144,1,144,6],[145,1,145,6],[146,1,146,6],[133,0,146,0],[218,4,218,7],[184,0,199,0],[200,1,200,3],[200,4,200,7],[184,1,184,3],[184,4,184,7],[171,2,171,3],[172,1,172,7],[179,1,179,3],[179,5,179,6],[180,1,180,6],[181,1,181,6],[236,2,236,3],[237,1,237,7],[245,1,245,3],[245,5,245,6],[246,1,246,6],[247,1,247,6],[248,1,248,6],[234,1,234,3],[234,4,234,7],[229,1,229,3],[229,5,229,6],[213,1,213,3],[213,5,213,6],[214,1,214,6],[215,1,215,6],[216,1,216,6],[234,10,234,11],[235,2,235,5],[0,0,12,0],[13,0,28,0],[29,0,39,0],[40,0,56,0],[57,0,77,0],[78,0,90,0],[118,0,132,0],[148,0,168,0],[169,0,183,0],[104,0,116,0],[91,0,102,0],[184,10,184,11],[185,2,185,5],[186,2,186,3],[187,1,187,7],[195,1,195,3],[195,5,195,6],[196,1,196,6],[200,0,217,0],[218,0,233,0],[218,1,218,3],[189,8,189,9],[200,10,200,11],[201,2,201,5],[202,2,202,3],[203,1,203,7],[232,1,232,6],[230,1,230,6],[231,1,231,6],[197,1,197,6],[198,1,198,6],[218,10,218,11],[219,2,219,5],[220,2,220,3],[221,1,221,7],[182,1,182,6],[164,1,164,3],[164,5,164,6],[165,1,165,6],[166,1,166,6],[167,1,167,6],[169,1,169,3],[169,4,169,7],[170,2,170,5],[118,1,118,3],[118,4,118,7],[118,10,118,11],[119,2,119,5],[120,2,120,3],[121,1,121,7],[128,1,128,3],[128,5,128,6],[169,10,169,11],[129,1,129,6],[130,1,130,6],[131,1,131,6],[148,1,148,3],[148,4,148,7],[148,10,148,11],[149,2,149,5],[150,2,150,3],[151,1,151,7],[78,10,78,11],[79,2,79,5],[80,2,80,3],[81,1,81,7],[86,1,86,3],[86,5,86,6],[87,1,87,6],[88,1,88,6],[89,1,89,6],[78,1,78,3],[78,4,78,7],[57,10,57,11],[58,2,58,5],[59,2,59,3],[60,1,60,7],[73,1,73,3],[73,5,73,6],[74,1,74,6],[75,1,75,6],[76,1,76,6],[57,1,57,3],[57,4,57,7],[40,10,40,11],[41,2,41,5],[42,2,42,3],[43,1,43,7],[52,1,52,3],[52,5,52,6],[53,1,53,6],[54,1,54,6],[55,1,55,6],[40,4,40,7],[29,10,29,11],[30,2,30,5],[31,2,31,3],[32,1,32,7],[30,8,31,9],[35,1,35,3],[35,5,35,6],[36,1,36,6],[37,1,37,6],[13,10,13,11],[14,2,14,5],[15,2,15,3],[16,1,16,7],[24,1,24,3],[24,5,24,6],[14,8,15,9],[0,1,0,3],[0,4,0,7],[0,10,0,11],[1,2,1,5],[2,2,2,3],[3,1,3,7],[8,1,8,3],[8,5,8,6],[9,1,9,6],[1,10,1,11],[10,1,10,6],[11,1,11,6],[13,1,13,3],[13,4,13,7],[250,10,250,11],[251,2,251,5],[252,2,252,3],[253,1,253,7],[262,1,262,3],[262,5,262,6],[263,1,263,6],[25,1,25,6],[26,1,26,6],[27,1,27,6],[116,1,116,6],[104,1,104,3],[104,4,104,7],[105,2,105,5],[106,2,106,3],[107,1,107,7],[113,1,113,3],[113,5,113,6],[114,1,114,6],[115,1,115,6],[29,1,29,3],[29,4,29,7],[38,1,38,6],[40,1,40,3],[264,1,264,6],[265,1,265,6],[267,0,278,0],[267,1,267,3],[267,4,267,7],[268,2,268,5],[269,2,269,3],[270,1,270,7],[275,1,275,3],[275,5,275,6],[276,1,276,6],[277,1,277,6],[278,1,278,6],[250,0,266,0],[250,1,250,3],[250,4,250,7],[280,0,294,0],[280,1,280,3],[280,4,280,7],[281,2,281,5],[282,2,282,3],[283,1,283,7],[291,1,291,3],[291,5,291,6],[292,1,292,6],[293,1,293,6],[294,1,294,6]]}
[1,"CODEVASF",null,null," COMPOSIÇÃO DE PREÇO UNITÁRIO",null,null,null,{"$f":"H10","v":4184},{"$f":"H12","v":5124.1448},"BDI CALCULADO:",null,{"$f":"ORÇAMENTO!I6","v":0.22469999999999998}]
[null,"OBRA:  ",{"$f":"ORÇAMENTO!C5","v":" PASSAGEM MOLHADA DA PRAINHA - RIO MOSQUITO (ESTRADA PARA TALHADO - SERRANÓPOLIS DE MINAS/MG)"},null,null,null,"DATA: ",{"$f":"ORÇAMENTO!C6","v":" AGOSTO / 2.021   "},null,null,"BDI DIFERENCIADO:",null,{"$f":"#REF!/100","v":{"$error":"#REF!"}}]
[null,"SERVIÇO:  ",{"$f":"VLOOKUP(A1,ORÇAMENTO!A10:I30,3)","v":"MOBILIZAÇÃO E DESMOBILIZAÇÃO"},null,"Referência:",{"$f":"VLOOKUP(A1,ORÇAMENTO!A10:I30,4)","v":"CPU.1"},"UNIDADE: ",{"$f":"VLOOKUP(A1,ORÇAMENTO!A10:I30,5)","v":"GL"}]
[]
[null,"TIPO ITEM","CODIGO ITEM","DESCRIÇÃO ITEM","UNIDADE ITEM","COEFICIENTE","PRECO UNITARIO","CUSTO TOTAL"]
[null,"COMPOSICAO",89876,"CAMINHÃO BASCULANTE 14 M3, COM CAVALO MECÂNICO DE CAPACIDADE MÁXIMA DE TRAÇÃO COMBINADO DE 36000 KG, POTÊNCIA 286 CV, INCLUSIVE SEMIREBOQUE COM CAÇAMBA METÁLICA","CHP DIURNO.",16,"227,53",{"$f":"ROUNDDOWN(F6*G6,2)","v":3640.48}]
[null,"COMPOSICAO",89877,"CAMINHÃO BASCULANTE 14 M3, COM CAVALO MECÂNICO DE CAPACIDADE MÁXIMA DE TRAÇÃO COMBINADO DE 36000 KG, POTÊNCIA 286 CV, INCLUSIVE SEMIREBOQUE COM CAÇAMBA METÁLICA","CHI DIURNO.",8,"52,23",{"$f":"ROUNDDOWN(F7*G7,2)","v":417.84}]
[null,"COMPOSIÇÃO",88316,"SERVENTE COM ENCARGOS COMPLEMENTARES","H",8,15.71,125.68]
[null,"PRODUÇÃO DA EQUIPE",null,null,1,"CUSTO ",null,{"$f":"SUM(H6:H8)","v":4184}]
[null,"TOTAL",{"$nulls":5},{"$f":"H9/E9","v":4184}]
[null,"BDI                %",{"$nulls":5},{"$f":"1+$M$1","v":1.2246999999999999}]
[null,"TOTAL DO SERVIÇO - R$",{"$nulls":5},{"$f":"H10*H11","v":5124.1448}]
[]
[{"$f":"A1+1","v":2},"CODEVASF",null,null," COMPOSIÇÃO DE PREÇO UNITÁRIO",null,null,null,{"$f":"H26","v":13565.300000000001},{"$f":"H28","v":16613.422910000001}]
[null,"OBRA:  ",{"$f":"$C$2","v":" PASSAGEM MOLHADA DA PRAINHA - RIO MOSQUITO (ESTRADA PARA TALHADO - SERRANÓPOLIS DE MINAS/MG)"},null,null,null,"DATA: ",{"$f":"$H$2","v":" AGOSTO / 2.021   "},"CALCULAR ÍNDICES PELO PORTE DA OBRA"]
[null,"SERVIÇO:  ",{"$f":"VLOOKUP(A14,ORÇAMENTO!$A$10:$I$30,3)","v":"ADMINISTRAÇÃO LOCAL"},null,"SINAPI","CPU","UNIDADE: ",{"$f":"VLOOKUP(A14,ORÇAMENTO!$A$10:$I$30,5)","v":"GL"}]
[]
[null,"TIPO ITEM","CODIGO ITEM","DESCRIÇÃO ITEM","UNIDADE ITEM","COEFICIENTE","PRECO UNITARIO","CUSTO TOTAL"]
[null,"INSUMO",14250,"ENERGIA ELÉTRICA","kwh",90,0.94,{"$f":"ROUNDDOWN(F19*G19,2)","v":84.6}]
[null,"INSUMO",14583,"ÁGUA/ESGOTO ","m³",6,17.78,106.68]
[null,"COTAÇÃO","MERC.","TELEFONE (PLANO CONTROLE)","UNID",2,50,100]
[null,"COMPOSICAO",90777,"Engenheiro Civil Júnior com encargos complementares","H",27.5,93.29,2565.4699999999998]
[null,"COMPOSICAO",90776,"Encarregado Geral com encargos complementares","H",{"$f":"220/3","v":73.333333333333329},41.04,3009.6]
[null,"COMPOSICAO",90772,"Auxiliar de escritório com encargos complementares","H",55,16.66,916.3]
[null,"PRODUÇÃO DA EQUIPE",null,null,0.5,"CUSTO ",null,{"$f":"SUM(H19:H24)","v":6782.6500000000005}]
[null,"TOTAL",{"$nulls":5},{"$f":"H25/E25","v":13565.300000000001}]
[null,"BDI                %",{"$nulls":5},{"$f":"1+$M$1","v":1.2246999999999999}]
[null,"TOTAL DO SERVIÇO - R$",{"$nulls":5},{"$f":"H26*H27","v":16613.422910000001}]
[]
[{"$f":"A14+1","v":3},"CODEVASF",null,null," COMPOSIÇÃO DE PREÇO UNITÁRIO",null,null,null,{"$f":"H37","v":1755},{"$f":"H39","v":2149.3484999999996}]
[null,"OBRA:  ",{"$f":"$C$2","v":" PASSAGEM MOLHADA DA PRAINHA - RIO MOSQUITO (ESTRADA PARA TALHADO - SERRANÓPOLIS DE MINAS/MG)"},null,null,null,"DATA: ",{"$f":"$H$2","v":" AGOSTO / 2.021   "},"QUANTIDADES PELO PORTE E PRAZO DA OBRA"]
[null,"SERVIÇO:  ",{"$f":"VLOOKUP(A30,ORÇAMENTO!$A$10:$I$30,3)","v":"CANTEIRO DE OBRAS"},null,"SINAPI",{"$f":"VLOOKUP(A30,ORÇAMENTO!$A$10:$I$30,4)","v":"CPU.3"},"UNIDADE: ",{"$f":"VLOOKUP(A30,ORÇAMENTO!$A$10:$I$30,5)","v":"GL"}]
[]
[null,"TIPO ITEM","CODIGO ITEM","DESCRIÇÃO ITEM","UNIDADE ITEM","COEFICIENTE","PRECO UNITARIO","CUSTO TOTAL"]
[null,"COTAÇÃO",10775,"ALUGUEL DE IMÓVEL OU CONTEINER QUE ATENDA AOS REQUISITOS MÍNIMOS PARA INSTALAÇÃO DO CANTEIRO DE OBRAS ","MÊS",3,585,{"$f":"ROUNDDOWN(F35*G35,2)","v":1755}]
[null,"PRODUÇÃO DA EQUIPE",null,null,1,"CUSTO ",null,{"$f":"SUM(H35:H35)","v":1755}]
[null,"TOTAL",{"$nulls":5},{"$f":"H36/E36","v":1755}]
[null,"BDI                %",{"$nulls":5},{"$f":"1+$M$1","v":1.2246999999999999}]
[null,"TOTAL DO SERVIÇO - R$",{"$nulls":5},{"$f":"H37*H38","v":2149.3484999999996}]
[]
[{"$f":"A30+1","v":4},"CODEVASF",null,null," COMPOSIÇÃO DE PREÇO UNITÁRIO",null,null,null,{"$f":"H54","v":465.94000000000005},{"$f":"H56","v":570.63671799999997}]
[null,"OBRA:  ",{"$f":"$C$2","v":" PASSAGEM MOLHADA DA PRAINHA - RIO MOSQUITO (ESTRADA PARA TALHADO - SERRANÓPOLIS DE MINAS/MG)"},null,null,null,"DATA: ",{"$f":"$H$2","v":" AGOSTO / 2.021   "}]
[null,"SERVIÇO:  ",{"$f":"VLOOKUP(A41,ORÇAMENTO!$A$10:$I$30,3)","v":"PLACA DE OBRA EM CHAPA DE AÇO GALVANIZADO"},null,"SINAPI",{"$f":"VLOOKUP(A41,ORÇAMENTO!$A$10:$I$30,4)","v":"74209/001"},"UNIDADE: ",{"$f":"VLOOKUP(A41,ORÇAMENTO!$A$10:$I$30,5)","v":"M2"}]
[]
[null,"TIPO ITEM","CODIGO ITEM","DESCRIÇÃO ITEM","UNIDADE ITEM","COEFICIENTE","PRECO UNITARIO","CUSTO TOTAL"]
[null,"INSUMO","4417","SARRAFO DE MADEIRA NAO APARELHADA *2,5 X 7* CM, MACARANDUBA, ANGELIM OU EQUIVALENTE DA REGIAO","M","1,0000000",12.04,{"$f":"ROUNDDOWN(F46*G46,2)","v":12.04}]
[null,"INSUMO","4491","PONTALETE DE MADEIRA NAO APARELHADA *7,5 X 7,5* CM (3 X 3 \") PINUS, MISTA OU EQUIVALENTE DA REGIAO","M","4,0000000",6.38,25.52]
[null,"INSUMO","4813","PLACA DE OBRA (PARA CONSTRUCAO CIVIL) EM CHAPA GALVANIZADA *N. 22*, ADESIVADA, DE *2,0 X 1,125* M","M2","1,0000000",370,370]
[null,"INSUMO","5075","PREGO DE ACO POLIDO COM CABECA 18 X 30 (2 3/4 X 10)","KG","0,1100000",18.59,2.04]
[null,"COMPOSICAO","88262","CARPINTEIRO DE FORMAS COM ENCARGOS COMPLEMENTARES","H","1,0000000",21.87,21.87]
[null,"COMPOSICAO","88316","SERVENTE COM ENCARGOS COMPLEMENTARES","H","2,0000000",15.71,31.42]
[null,"COMPOSICAO","94962","CONCRETO MAGRO PARA LASTRO, TRAÇO 1:4,5:4,5 (CIMENTO/ AREIA MÉDIA/ BRITA 1)  - PREPARO MECÂNICO COM BETONEIRA 400 L","M3","0,0100000",305.63,3.05]
[null,"PRODUÇÃO DA EQUIPE",null,null,1,"CUSTO ",null,{"$f":"SUM(H46:H52)","v":465.94000000000005}]
[null,"TOTAL",{"$nulls":5},{"$f":"H53/E53","v":465.94000000000005}]
[null,"BDI                %",{"$nulls":5},{"$f":"1+$M$1","v":1.2246999999999999}]
[null,"TOTAL DO SERVIÇO - R$",{"$nulls":5},{"$f":"H54*H55","v":570.63671799999997}]
[]
[{"$f":"A41+1","v":5},"CODEVASF",null,null," COMPOSIÇÃO DE PREÇO UNITÁRIO",null,null,null,{"$f":"H75","v":63.260000000000005},{"$f":"H77","v":77.474521999999993}]
[null,"OBRA:  ",{"$f":"$C$2","v":" PASSAGEM MOLHADA DA PRAINHA - RIO MOSQUITO (ESTRADA PARA TALHADO - SERRANÓPOLIS DE MINAS/MG)"},null,null,null,"DATA: ",{"$f":"$H$2","v":" AGOSTO / 2.021   "}]
[null,"SERVIÇO:  ",{"$f":"VLOOKUP(A58,ORÇAMENTO!$A$10:$I$30,3)","v":"LOCACAO CONVENCIONAL DE OBRA, UTILIZANDO GABARITO DE TÁBUAS CORRIDAS PONTALETADAS A CADA 2,00M"},null,"SINAPI",{"$f":"VLOOKUP(A58,ORÇAMENTO!$A$10:$I$30,4)","v":99059},"UNIDADE: ",{"$f":"VLOOKUP(A58,ORÇAMENTO!$A$10:$I$30,5)","v":"M"}]
[]
[null,"TIPO ITEM","CODIGO ITEM","DESCRIÇÃO ITEM","UNIDADE ITEM","COEFICIENTE","PRECO UNITARIO","CUSTO TOTAL"]
[null,"INSUMO","4417","SARRAFO NAO APARELHADO *2,5 X 7* CM, EM MACARANDUBA, ANGELIM OU EQUIVALENTE DA REGIAO -  BRUTA","M","0,7445000","13,06",{"$f":"ROUNDDOWN(F63*G63,2)","v":9.7200000000000006}]
[null,"INSUMO","4433","CAIBRO NAO APARELHADO  *7,5 X 7,5* CM, EM MACARANDUBA, ANGELIM OU EQUIVALENTE DA REGIAO -  BRUTA","M","0,4125000","46,93",19.350000000000001]
[null,"INSUMO","5068","PREGO DE ACO POLIDO COM CABECA 17 X 21 (2 X 11)","KG","0,1110000","18,62",2.06]
[null,"INSUMO","7356","TINTA ACRILICA PREMIUM, COR BRANCO FOSCO","L","0,0256000","20,69",0.52]
[null,"INSUMO","10567","TABUA *2,5 X 23* CM EM PINUS, MISTA OU EQUIVALENTE DA REGIAO - BRUTA","M","0,5500000","8,17",4.49]
[null,"COMPOSICAO","88239","AJUDANTE DE CARPINTEIRO COM ENCARGOS COMPLEMENTARES","H","0,3563000","18,07",6.43]
[null,"COMPOSICAO","88262","CARPINTEIRO DE FORMAS COM ENCARGOS COMPLEMENTARES","H","0,7125000","21,87",15.58]
[null,"COMPOSICAO","91692","SERRA CIRCULAR DE BANCADA COM MOTOR ELÉTRICO POTÊNCIA DE 5HP, COM COIFA PARA DISCO 10\"","CHP","0,0039000","23,89",0.09]
[null,"COMPOSICAO","91693","SERRA CIRCULAR DE BANCADA COM MOTOR ELÉTRICO POTÊNCIA DE 5HP, COM COIFA PARA DISCO 10\"","CHI","0,0168000","20,47",0.34]
[null,"COMPOSICAO","94974","CONCRETO MAGRO PARA LASTRO, TRAÇO 1:4,5:4,5 (EM MASSA SECA DE CIMENTO/ AREIA MÉDIA/ BRITA 1)","M3","0,0046000","350,25",1.61]
[null,"COMPOSICAO","99062","MARCAÇÃO DE PONTOS EM GABARITO OU CAVALETE","UN","1,5000000","2,05",3.07]
[null,"PRODUÇÃO DA EQUIPE",null,null,1,"CUSTO ",null,{"$f":"SUM(H63:H73)","v":63.260000000000005}]
[null,"TOTAL",{"$nulls":5},{"$f":"H74/E74","v":63.260000000000005}]
[null,"BDI                %",{"$nulls":5},{"$f":"1+$M$1","v":1.2246999999999999}]
[null,"TOTAL DO SERVIÇO - R$",{"$nulls":5},{"$f":"H75*H76","v":77.474521999999993}]
[]
[{"$f":"A58+1","v":6},"CODEVASF",null,null," COMPOSIÇÃO DE PREÇO UNITÁRIO",null,null,null,{"$f":"H88","v":1.6199999999999999},{"$f":"H90","v":1.9840139999999997}]
[null,"OBRA:  ",{"$f":"$C$2","v":" PASSAGEM MOLHADA DA PRAINHA - RIO MOSQUITO (ESTRADA PARA TALHADO - SERRANÓPOLIS DE MINAS/MG)"},null,null,null,"DATA: ",{"$f":"$H$2","v":" AGOSTO / 2.021   "},null,{"$f":"H91","v":0}]
[null,"SERVIÇO:  ",{"$f":"VLOOKUP(A79,ORÇAMENTO!$A$10:$I$30,3)","v":"ESCAVAÇÃO HORIZONTAL EM SOLO DE 1A CATEGORIA"},null,"SINAPI",{"$f":"VLOOKUP(A79,ORÇAMENTO!$A$10:$I$30,4)","v":101116},"UNIDADE: ",{"$f":"VLOOKUP(A79,ORÇAMENTO!$A$10:$I$30,5)","v":"M3"}]
[]
[null,"TIPO ITEM","CODIGO ITEM","DESCRIÇÃO ITEM","UNIDADE ITEM","COEFICIENTE","PRECO UNITARIO","CUSTO TOTAL"]
[null,"COMPOSICAO","5847","TRATOR DE ESTEIRAS, POTÊNCIA 170 HP, PESO OPERACIONAL 19 T, CAÇAMBA 5,2 M3","CHP","0,0048000","196,22",{"$f":"ROUNDDOWN(F84*G84,2)","v":0.94}]
[null,"COMPOSICAO","5849","TRATOR DE ESTEIRAS, POTÊNCIA 170 HP, PESO OPERACIONAL 19 T, CAÇAMBA 5,2 M3","CHI","0,0082000","59,09",0.48]
[null,"COMPOSICAO","88316","SERVENTE COM ENCARGOS COMPLEMENTARES","H","0,0131000","15,71",0.2]
[null,"PRODUÇÃO DA EQUIPE",null,null,1,"CUSTO ",null,{"$f":"SUM(H84:H86)","v":1.6199999999999999}]
[null,"TOTAL",{"$nulls":5},{"$f":"H87/E87","v":1.6199999999999999}]
[null,"BDI                %",{"$nulls":5},{"$f":"1+$M$1","v":1.2246999999999999}]
[null,"TOTAL DO SERVIÇO - R$",{"$nulls":5},{"$f":"H88*H89","v":1.9840139999999997}]
[]
[7,"CODEVASF",null,null," COMPOSIÇÃO DE PREÇO UNITÁRIO",null,null,null,{"$f":"H101","v":117.28999999999999},{"$f":"H103","v":143.64506299999996}]
[null,"OBRA:  ",{"$f":"$C$2","v":" PASSAGEM MOLHADA DA PRAINHA - RIO MOSQUITO (ESTRADA PARA TALHADO - SERRANÓPOLIS DE MINAS/MG)"},null,null,null,"DATA: ",{"$f":"$H$2","v":" AGOSTO / 2.021   "}]
[null,"SERVIÇO:  ",{"$f":"VLOOKUP(A92,ORÇAMENTO!$A$10:$I$30,3)","v":"ESCAVAÇÃO MANUAL PARA BLOCO DE COROAMENTO OU SAPATA, SEM PREVISÃO DE FÔRMA"},null,"SINAPI",{"$f":"VLOOKUP(A92,ORÇAMENTO!$A$10:$I$30,4)","v":96522},"UNIDADE: ",{"$f":"VLOOKUP(A92,ORÇAMENTO!$A$10:$I$30,5)","v":"M3"}]
[]
[null,"TIPO ITEM","CODIGO ITEM","DESCRIÇÃO ITEM","UNIDADE ITEM","COEFICIENTE","PRECO UNITARIO","CUSTO TOTAL"]
[null,"COMPOSICAO","88309","PEDREIRO COM ENCARGOS COMPLEMENTARES","H","2,3610000","22,09",{"$f":"ROUNDDOWN(F97*G97,2)","v":52.15}]
[null,"COMPOSICAO","88316","SERVENTE COM ENCARGOS COMPLEMENTARES","H","4,1470000","15,71",65.14]
[{"$nulls":7},0]
[null,"PRODUÇÃO DA EQUIPE",null,null,1,"CUSTO ",null,{"$f":"SUM(H97:H99)","v":117.28999999999999}]
[null,"TOTAL",{"$nulls":5},{"$f":"H100/E100","v":117.28999999999999}]
[null,"BDI                %",{"$nulls":5},{"$f":"1+$M$1","v":1.2246999999999999}]
[null,"TOTAL DO SERVIÇO - R$",{"$nulls":5},{"$f":"H101*H102","v":143.64506299999996}]
[]
[8,"CODEVASF",null,null," COMPOSIÇÃO DE PREÇO UNITÁRIO",null,null,null,{"$f":"H115","v":6.1400000000000006},{"$f":"H117","v":7.5196579999999997}]
[null,"OBRA:  ",{"$f":"$C$2","v":" PASSAGEM MOLHADA DA PRAINHA - RIO MOSQUITO (ESTRADA PARA TALHADO - SERRANÓPOLIS DE MINAS/MG)"},null,null,null,"DATA: ",{"$f":"$H$2","v":" AGOSTO / 2.021   "}]
[null,"SERVIÇO:  ",{"$f":"VLOOKUP(A105,ORÇAMENTO!$A$10:$I$30,3)","v":"CARGA, MANOBRA E DESCARGA DE SOLOS E MATERIAIS GRANULARES EM CAMINHÃO BASCULANTE - CARGA COM PÁ CARREGADEIRA  E DESCARGA LIVRE "},null,"SINAPI",{"$f":"VLOOKUP(A105,ORÇAMENTO!$A$10:$I$30,4)","v":100976},"UNIDADE: ",{"$f":"VLOOKUP(A105,ORÇAMENTO!$A$10:$I$30,5)","v":"M3"}]
[]
[null,"TIPO ITEM","CODIGO ITEM","DESCRIÇÃO ITEM","UNIDADE ITEM","COEFICIENTE","PRECO UNITARIO","CUSTO TOTAL"]
[null,"COMPOSICAO","5940","PÁ CARREGADEIRA SOBRE RODAS, POTÊNCIA LÍQUIDA 128 HP, CAPACIDADE DA CAÇAMBA 1,7 A 2,8 M3, PESO OPERACIONAL 11632 KG","CHP","0,0083000","155,35",{"$f":"ROUNDDOWN(F110*G110,2)","v":1.28}]
[null,"COMPOSICAO","5942","PÁ CARREGADEIRA SOBRE RODAS, POTÊNCIA LÍQUIDA 128 HP, CAPACIDADE DA CAÇAMBA 1,7 A 2,8 M3, PESO OPERACIONAL 11632 KG","CHI","0,0074000","56,76",0.42]
[null,"COMPOSICAO","89883","CAMINHÃO BASCULANTE 18 M3, COM CAVALO MECÂNICO DE CAPACIDADE MÁXIMA DE TRAÇÃO COMBINADO DE 45000 KG, POTÊNCIA 330 CV, INCLUSIVE SEMIREBOQUE COM CAÇAMBA METÁLICA","CHP","0,0153000","258,45",3.95]
[null,"COMPOSICAO","89884","CAMINHÃO BASCULANTE 18 M3, COM CAVALO MECÂNICO DE CAPACIDADE MÁXIMA DE TRAÇÃO COMBINADO DE 45000 KG, POTÊNCIA 330 CV, INCLUSIVE SEMIREBOQUE COM CAÇAMBA METÁLICA","CHI","0,0095000","52,02",0.49]
[null,"PRODUÇÃO DA EQUIPE",null,null,1,"CUSTO ",null,{"$f":"SUM(H110:H113)","v":6.1400000000000006}]
[null,"TOTAL",{"$nulls":5},{"$f":"H114/E114","v":6.1400000000000006}]
[null,"BDI                %",{"$nulls":5},{"$f":"1+$M$1","v":1.2246999999999999}]
[null,"TOTAL DO SERVIÇO - R$",{"$nulls":5},{"$f":"H115*H116","v":7.5196579999999997}]
[]
[9,"CODEVASF",null,null," COMPOSIÇÃO DE PREÇO UNITÁRIO",null,null,null,{"$f":"H130","v":2.3699999999999997},{"$f":"H132","v":2.9025389999999995}]
[null,"OBRA:  ",{"$f":"$C$2","v":" PASSAGEM MOLHADA DA PRAINHA - RIO MOSQUITO (ESTRADA PARA TALHADO - SERRANÓPOLIS DE MINAS/MG)"},null,null,null,"DATA: ",{"$f":"$H$2","v":" AGOSTO / 2.021   "}]
[null,"SERVIÇO:  ",{"$f":"VLOOKUP(A119,ORÇAMENTO!$A$10:$I$30,3)","v":"PREPARO DE FUNDO DE VALA COM LARGURA MAIOR OU IGUAL A 1,5 M (ACERTO DO SOLO NATURAL)"},null,"SINAPI",{"$f":"VLOOKUP(A119,ORÇAMENTO!$A$10:$I$30,4)","v":101617},"UNIDADE: ",{"$f":"VLOOKUP(A119,ORÇAMENTO!$A$10:$I$30,5)","v":"M2"}]
[]
[null,"TIPO ITEM","CODIGO ITEM","DESCRIÇÃO ITEM","UNIDADE ITEM","COEFICIENTE","PRECO UNITARIO","CUSTO TOTAL"]
[null,"COMPOSICAO","88309","PEDREIRO COM ENCARGOS COMPLEMENTARES","H","0,0507000","22,09",{"$f":"ROUNDDOWN(F124*G124,2)","v":1.1100000000000001}]
[null,"COMPOSICAO","88316","SERVENTE COM ENCARGOS COMPLEMENTARES","H","0,0760000","15,71",1.19]
[null,"COMPOSICAO","91533","COMPACTADOR DE SOLOS DE PERCUSSÃO (SOQUETE) COM MOTOR A GASOLINA 4 TEMPOS, POTÊNCIA 4 CV","CHP","0,0016000","28,17",0.04]
[null,"COMPOSICAO","91534","COMPACTADOR DE SOLOS DE PERCUSSÃO (SOQUETE) COM MOTOR A GASOLINA 4 TEMPOS, POTÊNCIA 4 CV","CHI","0,0016000","21,12",0.03]
[{"$nulls":7},0]
[null,"PRODUÇÃO DA EQUIPE",null,null,1,"CUSTO ",null,{"$f":"SUM(H124:H128)","v":2.3699999999999997}]
[null,"TOTAL",{"$nulls":5},{"$f":"H129/E129","v":2.3699999999999997}]
[null,"BDI                %",{"$nulls":5},{"$f":"1+$M$1","v":1.2246999999999999}]
[null,"TOTAL DO SERVIÇO - R$",{"$nulls":5},{"$f":"H130*H131","v":2.9025389999999995}]
[]
[10,"CODEVASF",null,null," COMPOSIÇÃO DE PREÇO UNITÁRIO",null,null,null,{"$f":"H145","v":131.82999999999998},{"$f":"H147","v":161.45220099999997}]
[null,"OBRA:  ",{"$f":"$C$2","v":" PASSAGEM MOLHADA DA PRAINHA - RIO MOSQUITO (ESTRADA PARA TALHADO - SERRANÓPOLIS DE MINAS/MG)"},null,null,null,"DATA: ",{"$f":"$H$2","v":" AGOSTO / 2.021   "}]
[null,"SERVIÇO:  ",{"$f":"VLOOKUP(A134,ORÇAMENTO!$A$10:$I$30,3)","v":"LASTRO DE BRITA, ESPESSURA 5CM"},null,"SINAPI",{"$f":"VLOOKUP(A134,ORÇAMENTO!$A$10:$I$30,4)","v":96622},"UNIDADE: ",{"$f":"VLOOKUP(A134,ORÇAMENTO!$A$10:$I$30,5)","v":"M3"}]
[]
[null,"TIPO ITEM","CODIGO ITEM","DESCRIÇÃO ITEM","UNIDADE ITEM","COEFICIENTE","PRECO UNITARIO","CUSTO TOTAL"]
[null,"INSUMO","4718","PEDRA BRITADA N. 2 (19 A 38 MM) POSTO PEDREIRA/FORNECEDOR, SEM FRETE","M3","1,1300000","87,14",{"$f":"ROUNDDOWN(F139*G139,2)","v":98.46}]
[null,"COMPOSICAO","88309","PEDREIRO COM ENCARGOS COMPLEMENTARES","H","1,2170000","22,09",26.88]
[null,"COMPOSICAO","88316","SERVENTE COM ENCARGOS COMPLEMENTARES","H","0,3940000","15,71",6.18]
[null,"COMPOSICAO","91277","PLACA VIBRATÓRIA REVERSÍVEL COM MOTOR 4 TEMPOS A GASOLINA, FORÇA CENTRÍFUGA DE 25 KN (2500 KGF), POTÊNCIA 5,5 CV","CHP","0,0320000","9,64",0.3]
[null,"COMPOSICAO","91278","PLACA VIBRATÓRIA REVERSÍVEL COM MOTOR 4 TEMPOS A GASOLINA, FORÇA CENTRÍFUGA DE 25 KN (2500 KGF), POTÊNCIA 5,5 CV","CHI","0,0300000","0,52",0.01]
[null,"PRODUÇÃO DA EQUIPE",null,null,1,"CUSTO ",null,{"$f":"SUM(H139:H143)","v":131.82999999999998}]
[null,"TOTAL",{"$nulls":5},{"$f":"H144/E144","v":131.82999999999998}]
[null,"BDI                %",{"$nulls":5},{"$f":"1+$M$1","v":1.2246999999999999}]
[null,"TOTAL DO SERVIÇO - R$",{"$nulls":5},{"$f":"H145*H146","v":161.45220099999997}]
[]
[11,"CODEVASF",null,null," COMPOSIÇÃO DE PREÇO UNITÁRIO",null,null,null,{"$f":"H166","v":79.55},{"$f":"H168","v":97.424884999999989}]
[null,"OBRA:  ",{"$f":"$C$2","v":" PASSAGEM MOLHADA DA PRAINHA - RIO MOSQUITO (ESTRADA PARA TALHADO - SERRANÓPOLIS DE MINAS/MG)"},null,null,null,"DATA: ",{"$f":"$H$2","v":" AGOSTO / 2.021   "}]
[null,"SERVIÇO:  ",{"$f":"VLOOKUP(A149,ORÇAMENTO!$A$10:$I$30,3)","v":"FABRICAÇÃO, MONTAGEM E DESMONTAGEM DE FÔRMA PARA VIGAS EM CHAPA DE MADEIRA COMPENSADA RESINADA, E=17 MM"},null,"SINAPI",{"$f":"VLOOKUP(A149,ORÇAMENTO!$A$10:$I$30,4)","v":96542},"UNIDADE: ",{"$f":"VLOOKUP(A149,ORÇAMENTO!$A$10:$I$30,5)","v":"M2"}]
[]
[null,"TIPO ITEM","CODIGO ITEM","DESCRIÇÃO ITEM","UNIDADE ITEM","COEFICIENTE","PRECO UNITARIO","CUSTO TOTAL"]
[null,"INSUMO","1358","CHAPA DE MADEIRA COMPENSADA RESINADA PARA FORMA DE CONCRETO, DE *2,2 X 1,1* M, E = 17 MM","M2","0,3150000","50,71",{"$f":"ROUNDDOWN(F154*G154,2)","v":15.97}]
[null,"INSUMO","2692","DESMOLDANTE PROTETOR PARA FORMAS DE MADEIRA, DE BASE OLEOSA EMULSIONADA EM AGUA","L","0,0100000","3,98",0.03]
[null,"INSUMO","4491","PONTALETE *7,5 X 7,5* CM EM PINUS, MISTA OU EQUIVALENTE DA REGIAO - BRUTA","M","1,2180000","7,23",8.8000000000000007]
[null,"INSUMO","4517","SARRAFO *2,5 X 7,5* CM EM PINUS, MISTA OU EQUIVALENTE DA REGIAO - BRUTA","M","0,7220000","2,53",1.82]
[null,"INSUMO","5073","PREGO DE ACO POLIDO COM CABECA 17 X 24","KG","0,0190000","18,97",0.36]
[null,"INSUMO","20247","PREGO DE ACO POLIDO COM CABECA 15 X 15","KG","0,0040000","20,61",0.08]
[null,"INSUMO","40304","PREGO DE ACO POLIDO CABECA DUPLA 17 X 27","KG","0,0100000","22,98",0.22]
[null,"COMPOSICAO","88239","AJUDANTE DE CARPINTEIRO COM ENCARGOS COMPLEMENTARES","H","0,7250000","18,07",13.1]
[null,"COMPOSICAO","88262","CARPINTEIRO DE FORMAS COM ENCARGOS COMPLEMENTARES","H","1,7490000","21,87",38.25]
[null,"COMPOSICAO","91692","SERRA CIRCULAR DE BANCADA COM MOTOR ELÉTRICO POTÊNCIA DE 5HP, COM COIFA PARA DISCO 10\"","CHP","0,0140000","23,89",0.33]
[null,"COMPOSICAO","91693","SERRA CIRCULAR DE BANCADA COM MOTOR ELÉTRICO POTÊNCIA DE 5HP, COM COIFA PARA DISCO 10\"","CHI","0,0290000","20,47",0.59]
[null,"PRODUÇÃO DA EQUIPE",null,null,1,"CUSTO ",null,{"$f":"SUM(H154:H164)","v":79.55}]
[null,"TOTAL",{"$nulls":5},{"$f":"H165/E165","v":79.55}]
[null,"BDI                %",{"$nulls":5},{"$f":"1+$M$1","v":1.2246999999999999}]
[null,"TOTAL DO SERVIÇO - R$",{"$nulls":5},{"$f":"H166*H167","v":97.424884999999989}]
[]
[12,"CODEVASF",null,null," COMPOSIÇÃO DE PREÇO UNITÁRIO",null,null,null,{"$f":"H181","v":20.34},{"$f":"H183","v":24.910397999999997}]
[null,"OBRA:  ",{"$f":"$C$2","v":" PASSAGEM MOLHADA DA PRAINHA - RIO MOSQUITO (ESTRADA PARA TALHADO - SERRANÓPOLIS DE MINAS/MG)"},null,null,null,"DATA: ",{"$f":"$H$2","v":" AGOSTO / 2.021   "}]
[null,"SERVIÇO:  ",{"$f":"VLOOKUP(A170,ORÇAMENTO!$A$10:$I$30,3)","v":"ARMAÇÃO DE BLOCO, VIGA BALDRAME E SAPATA UTILIZANDO AÇO CA-60 DE 4.2 OU 5 MM - MONTAGEM"},null,"SINAPI",{"$f":"VLOOKUP(A170,ORÇAMENTO!$A$10:$I$30,4)","v":96543},"UNIDADE: ",{"$f":"VLOOKUP(A170,ORÇAMENTO!$A$10:$I$30,5)","v":"KG"}]
[]
[null,"TIPO ITEM","CODIGO ITEM","DESCRIÇÃO ITEM","UNIDADE ITEM","COEFICIENTE","PRECO UNITARIO","CUSTO TOTAL"]
[null,"INSUMO","39017","ESPACADOR / DISTANCIADOR CIRCULAR COM ENTRADA LATERAL, EM PLASTICO, PARA VERGALHAO *4,2 A 12,5* MM, COBRIMENTO 20 MM","UN","1,9665000","0,19",{"$f":"ROUNDDOWN(F175*G175,2)","v":0.37}]
[null,"INSUMO","43132","ARAME RECOZIDO 16 BWG, D = 1,65 MM (0,016 KG/M) OU 18 BWG, D = 1,25 MM (0,01 KG/M)","KG","0,0250000","26,90",0.67]
[null,"COMPOSICAO","88238","AJUDANTE DE ARMADOR COM ENCARGOS COMPLEMENTARES","H","0,0635000","16,52",1.04]
[null,"COMPOSICAO","88245","ARMADOR COM ENCARGOS COMPLEMENTARES","H","0,1945000","21,94",4.26]
[null,"COMPOSICAO","92791","CORTE E DOBRA DE AÇO CA-60, DIÂMETRO DE 5,0 MM - INCLUSIVE FORNECIMENTO","KG","1,0000000","14,00",14]
[null,"PRODUÇÃO DA EQUIPE",null,null,1,"CUSTO ",null,{"$f":"SUM(H175:H179)","v":20.34}]
[null,"TOTAL",{"$nulls":5},{"$f":"H180/E180","v":20.34}]
[null,"BDI                %",{"$nulls":5},{"$f":"1+$M$1","v":1.2246999999999999}]
[null,"TOTAL DO SERVIÇO - R$",{"$nulls":5},{"$f":"H181*H182","v":24.910397999999997}]
[]
[13,"CODEVASF",null,null," COMPOSIÇÃO DE PREÇO UNITÁRIO",null,null,null,{"$f":"H197","v":16.79},{"$f":"H199","v":20.562712999999999}]
[null,"OBRA:  ",{"$f":"$C$2","v":" PASSAGEM MOLHADA DA PRAINHA - RIO MOSQUITO (ESTRADA PARA TALHADO - SERRANÓPOLIS DE MINAS/MG)"},null,null,null,"DATA: ",{"$f":"$H$2","v":" AGOSTO / 2.021   "}]
[null,"SERVIÇO:  ",{"$f":"VLOOKUP(A185,ORÇAMENTO!$A$10:$I$30,3)","v":"ARMAÇÃO DE BLOCO, VIGA BALDRAME OU SAPATA UTILIZANDO AÇO CA-50 DE 10MM - MONTAGEM"},null,"SINAPI",{"$f":"VLOOKUP(A185,ORÇAMENTO!$A$10:$I$30,4)","v":96546},"UNIDADE: ",{"$f":"VLOOKUP(A185,ORÇAMENTO!$A$10:$I$30,5)","v":"KG"}]
[]
[null,"TIPO ITEM","CODIGO ITEM","DESCRIÇÃO ITEM","UNIDADE ITEM","COEFICIENTE","PRECO UNITARIO","CUSTO TOTAL"]
[null,"INSUMO","39017","ESPACADOR / DISTANCIADOR CIRCULAR COM ENTRADA LATERAL, EM PLASTICO, PARA VERGALHAO *4,2 A 12,5* MM, COBRIMENTO 20 MM","UN","0,4655000","0,19",{"$f":"ROUNDDOWN(F190*G190,2)","v":0.08}]
[null,"INSUMO","43132","ARAME RECOZIDO 16 BWG, D = 1,65 MM (0,016 KG/M) OU 18 BWG, D = 1,25 MM (0,01 KG/M)","KG","0,0250000","26,90",0.67]
[null,"COMPOSICAO","88238","AJUDANTE DE ARMADOR COM ENCARGOS COMPLEMENTARES","H","0,0290000","16,52",0.47]
[null,"COMPOSICAO","88245","ARMADOR COM ENCARGOS COMPLEMENTARES","H","0,0890000","21,94",1.95]
[null,"COMPOSICAO","92794","CORTE E DOBRA DE AÇO CA-50, DIÂMETRO DE 10,0 MM - INCLUSIVE FORNECIMENTO","KG","1,0000000","13,62",13.62]
[{"$nulls":7},0]
[null,"PRODUÇÃO DA EQUIPE",null,null,1,"CUSTO ",null,{"$f":"SUM(H190:H195)","v":16.79}]
[null,"TOTAL",{"$nulls":5},{"$f":"H196/E196","v":16.79}]
[null,"BDI                %",{"$nulls":5},{"$f":"1+$M$1","v":1.2246999999999999}]
[null,"TOTAL DO SERVIÇO - R$",{"$nulls":5},{"$f":"H197*H198","v":20.562712999999999}]
[]
[14,"CODEVASF",null,null," COMPOSIÇÃO DE PREÇO UNITÁRIO",null,null,null,{"$f":"H215","v":394.17},{"$f":"H217","v":482.73999899999995}]
[null,"OBRA:  ",{"$f":"$C$2","v":" PASSAGEM MOLHADA DA PRAINHA - RIO MOSQUITO (ESTRADA PARA TALHADO - SERRANÓPOLIS DE MINAS/MG)"},null,null,null,"DATA: ",{"$f":"$H$2","v":" AGOSTO / 2.021   "}]
[null,"SERVIÇO:  ",{"$f":"VLOOKUP(A201,ORÇAMENTO!$A$10:$I$30,3)","v":"CONCRETO FCK = 25MPA - PREPARO MECÂNICO COM BETONEIRA"},null,"SINAPI",{"$f":"VLOOKUP(A201,ORÇAMENTO!$A$10:$I$30,4)","v":94965},"UNIDADE: ",{"$f":"VLOOKUP(A201,ORÇAMENTO!$A$10:$I$30,5)","v":"M3"}]
[]
[null,"TIPO ITEM","CODIGO ITEM","DESCRIÇÃO ITEM","UNIDADE ITEM","COEFICIENTE","PRECO UNITARIO","CUSTO TOTAL"]
[null,"INSUMO","370","AREIA MEDIA - POSTO JAZIDA/FORNECEDOR (RETIRADO NA JAZIDA, SEM TRANSPORTE)","M3","0,7229000","75,00",{"$f":"ROUNDDOWN(F206*G206,2)","v":54.21}]
[null,"INSUMO","1379","CIMENTO PORTLAND COMPOSTO CP II-32","KG","362,6579000","0,62",224.84]
[null,"INSUMO","4721","PEDRA BRITADA N. 1 (9,5 a 19 MM) POSTO PEDREIRA/FORNECEDOR, SEM FRETE","M3","0,5934000","86,68",51.43]
[null,"COMPOSICAO","88316","SERVENTE COM ENCARGOS COMPLEMENTARES","H","2,3117000","15,71",36.31]
[null,"COMPOSICAO","88377","OPERADOR DE BETONEIRA ESTACIONÁRIA / MISTURADOR COM ENCARGOS COMPLEMENTARES","H","1,4637000","17,52",25.64]
[null,"COMPOSICAO","88830","BETONEIRA CAPACIDADE NOMINAL DE 400 L, CAPACIDADE DE MISTURA 280 L, MOTOR ELÉTRICO TRIFÁSICO POTÊNCIA DE 2 CV, SEM CARREGADOR","CHP","0,7534000","1,99",1.49]
[null,"COMPOSICAO","88831","BETONEIRA CAPACIDADE NOMINAL DE 400 L, CAPACIDADE DE MISTURA 280 L, MOTOR ELÉTRICO TRIFÁSICO POTÊNCIA DE 2 CV, SEM CARREGADOR","CHI","0,7103000","0,36",0.25]
[{"$nulls":7},0]
[null,"PRODUÇÃO DA EQUIPE",null,null,1,"CUSTO ",null,{"$f":"SUM(H206:H213)","v":394.17}]
[null,"TOTAL",{"$nulls":5},{"$f":"H214/E214","v":394.17}]
[null,"BDI                %",{"$nulls":5},{"$f":"1+$M$1","v":1.2246999999999999}]
[null,"TOTAL DO SERVIÇO - R$",{"$nulls":5},{"$f":"H215*H216","v":482.73999899999995}]
[]
[15,"CODEVASF",null,null," COMPOSIÇÃO DE PREÇO UNITÁRIO",null,null,null,{"$f":"H231","v":186.26000000000002},{"$f":"H233","v":228.11262200000002}]
[null,"OBRA:  ",{"$f":"$C$2","v":" PASSAGEM MOLHADA DA PRAINHA - RIO MOSQUITO (ESTRADA PARA TALHADO - SERRANÓPOLIS DE MINAS/MG)"},null,null,null,"DATA: ",{"$f":"$H$2","v":" AGOSTO / 2.021   "}]
[null,"SERVIÇO:  ",{"$f":"VLOOKUP(A219,ORÇAMENTO!$A$10:$I$30,3)","v":"ENSECADEIRA COM SACOS DE RÁFIA, INCLUSIVE FORNECIMENTO DO MATERIAL DE ENCHIMENTO"},null,"SINAPI",{"$f":"VLOOKUP(A219,ORÇAMENTO!$A$10:$I$30,4)","v":"C2767a"},"UNIDADE: ",{"$f":"VLOOKUP(A219,ORÇAMENTO!$A$10:$I$30,5)","v":"M3"}]
[]
[null,"TIPO ITEM","CODIGO ITEM","DESCRIÇÃO ITEM","UNIDADE ITEM","COEFICIENTE","PRECO UNITARIO","CUSTO TOTAL"]
[null,"INSUMO",37526,"SACO DE RAFIA NOVO, LISO (SEM CLICHE), *60 x 90* CM","UNID.",28,2.66,{"$f":"ROUNDDOWN(F224*G224,2)","v":74.48}]
[null,"INSUMO","I2543","FIO PARA COSTURAR SACO","M",24,0.11,2.64]
[null,"INSUMO","I0036","AGULHA 125 PARA COSTURAR SACO","UM",0.2,0.94,0.18]
[null,"INSUMO",368,"AREIA PARA ATERRO - POSTO JAZIDA/FORNECEDOR (RETIRADO NA JAZIDA, SEM TRANSPORTE)","M3",1.0249999999999999,45,46.12]
[null,"COMPOSICAO","88316","SERVENTE COM ENCARGOS COMPLEMENTARES","H",4,"15,71",62.84]
[{"$nulls":7},0]
[null,"PRODUÇÃO DA EQUIPE",null,null,1,"CUSTO ",null,{"$f":"SUM(H224:H229)","v":186.26000000000002}]
[null,"TOTAL",{"$nulls":5},{"$f":"H230/E230","v":186.26000000000002}]
[null,"BDI                %",{"$nulls":5},{"$f":"1+$M$1","v":1.2246999999999999}]
[null,"TOTAL DO SERVIÇO - R$",{"$nulls":5},{"$f":"H231*H232","v":228.11262200000002}]
[]
[16,"CODEVASF",null,null," COMPOSIÇÃO DE PREÇO UNITÁRIO",null,null,null,{"$f":"H247","v":27.639999999999997},{"$f":"H249","v":33.85070799999999}]
[null,"OBRA:  ",{"$f":"$C$2","v":" PASSAGEM MOLHADA DA PRAINHA - RIO MOSQUITO (ESTRADA PARA TALHADO - SERRANÓPOLIS DE MINAS/MG)"},null,null,null,"DATA: ",{"$f":"$H$2","v":" AGOSTO / 2.021   "}]
[null,"SERVIÇO:  ",{"$f":"VLOOKUP(A235,ORÇAMENTO!$A$10:$I$30,3)","v":"LANÇAMENTO COM USO DE BOMBA, ADENSAMENTO E ACABAMENTO DE CONCRETO EM ESTRUTURAS"},null,"SINAPI",{"$f":"VLOOKUP(A235,ORÇAMENTO!$A$10:$I$30,4)","v":92874},"UNIDADE: ",{"$f":"VLOOKUP(A235,ORÇAMENTO!$A$10:$I$30,5)","v":"M3"}]
[]
[null,"TIPO ITEM","CODIGO ITEM","DESCRIÇÃO ITEM","UNIDADE ITEM","COEFICIENTE","PRECO UNITARIO","CUSTO TOTAL"]
[null,"COMPOSICAO","88262","CARPINTEIRO DE FORMAS COM ENCARGOS COMPLEMENTARES","H","0,1990000","21,87",{"$f":"ROUNDDOWN(F240*G240,2)","v":4.3499999999999996}]
[null,"COMPOSICAO","88309","PEDREIRO COM ENCARGOS COMPLEMENTARES","H","0,1990000","22,09",4.3899999999999997]
[null,"COMPOSICAO","88316","SERVENTE COM ENCARGOS COMPLEMENTARES","H","1,1920000","15,71",18.72]
[null,"COMPOSICAO","90586","VIBRADOR DE IMERSÃO, DIÂMETRO DE PONTEIRA 45MM, MOTOR ELÉTRICO TRIFÁSICO POTÊNCIA DE 2 CV","CHP","0,0680000","2,04",0.13]
[null,"COMPOSICAO","90587","VIBRADOR DE IMERSÃO, DIÂMETRO DE PONTEIRA 45MM, MOTOR ELÉTRICO TRIFÁSICO POTÊNCIA DE 2 CV","CHI","0,1310000","0,42",0.05]
[{"$nulls":7},0]
[null,"PRODUÇÃO DA EQUIPE",null,null,1,"CUSTO ",null,{"$f":"SUM(H240:H244)","v":27.639999999999997}]
[null,"TOTAL",{"$nulls":5},{"$f":"H246/E246","v":27.639999999999997}]
[null,"BDI                %",{"$nulls":5},{"$f":"1+$M$1","v":1.2246999999999999}]
[null,"TOTAL DO SERVIÇO - R$",{"$nulls":5},{"$f":"H247*H248","v":33.85070799999999}]
[]
[17,"CODEVASF",null,null," COMPOSIÇÃO DE PREÇO UNITÁRIO",null,null,null,{"$f":"H264","v":459.15000000000003},{"$f":"H266","v":562.32100500000001}]
[null,"OBRA:  ",{"$f":"$C$2","v":" PASSAGEM MOLHADA DA PRAINHA - RIO MOSQUITO (ESTRADA PARA TALHADO - SERRANÓPOLIS DE MINAS/MG)"},null,null,null,"DATA: ",{"$f":"$H$2","v":" AGOSTO / 2.021   "}]
[null,"SERVIÇO:  ",{"$f":"VLOOKUP(A251,ORÇAMENTO!$A$10:$I$30,3)","v":"TUBO DE CONCRETO DIÂMETRO DE 800 MM, JUNTA RÍGIDA - FORNECIMENTO E ASSENTAMENTO"},null,"SINAPI",{"$f":"VLOOKUP(A251,ORÇAMENTO!$A$10:$I$30,4)","v":92214},"UNIDADE: ",{"$f":"VLOOKUP(A251,ORÇAMENTO!$A$10:$I$30,5)","v":"M"}]
[]
[null,"TIPO ITEM","CODIGO ITEM","DESCRIÇÃO ITEM","UNIDADE ITEM","COEFICIENTE","PRECO UNITARIO","CUSTO TOTAL"]
[null,"COMPOSICAO","5631","ESCAVADEIRA HIDRÁULICA SOBRE ESTEIRAS, CAÇAMBA 0,80 M3, PESO OPERACIONAL 17 T, POTENCIA BRUTA 111 HP","CHP","0,1360000","160,47",{"$f":"ROUNDDOWN(F256*G256,2)","v":21.82}]
[null,"COMPOSICAO","5632","ESCAVADEIRA HIDRÁULICA SOBRE ESTEIRAS, CAÇAMBA 0,80 M3, PESO OPERACIONAL 17 T, POTENCIA BRUTA 111 HP","CHI","0,2870000","64,98",18.64]
[null,"INSUMO","COTAÇÃO","TUBO DE CONCRETO ARMADO PARA AGUAS PLUVIAIS, CLASSE PA-1, COM ENCAIXE PONTA E BOLSA, DIAMETRO NOMINAL DE 800 MM - POSTO OBRA","M",1,380,380,"CONCREBLOCOS"]
[null,"COMPOSICAO","88246","ASSENTADOR DE TUBOS COM ENCARGOS COMPLEMENTARES","H","0,6400000","19,42",12.42]
[null,"COMPOSICAO","88316","SERVENTE COM ENCARGOS COMPLEMENTARES","H","1,2800000","15,71",20.100000000000001]
[null,"COMPOSICAO","88629","ARGAMASSA TRAÇO 1:3 (EM VOLUME DE CIMENTO E AREIA MÉDIA ÚMIDA), PREPARO MANUAL","M3","0,0120000","514,31",6.17]
[{"$nulls":7},0]
[null,"PRODUÇÃO DA EQUIPE",null,null,1,"CUSTO ",null,{"$f":"SUM(H256:H261)","v":459.15000000000003}]
[null,"TOTAL",{"$nulls":5},{"$f":"H263/E263","v":459.15000000000003}]
[null,"BDI                %",{"$nulls":5},{"$f":"1+$M$1","v":1.2246999999999999}]
[null,"TOTAL DO SERVIÇO - R$",{"$nulls":5},{"$f":"H264*H265","v":562.32100500000001}]
[]
[18,"CODEVASF",null,null," COMPOSIÇÃO DE PREÇO UNITÁRIO",null,null,null,{"$f":"H277","v":0.53},{"$f":"H279","v":0.64909099999999997}]
[null,"OBRA:  ",{"$f":"$C$2","v":" PASSAGEM MOLHADA DA PRAINHA - RIO MOSQUITO (ESTRADA PARA TALHADO - SERRANÓPOLIS DE MINAS/MG)"},null,null,null,"DATA: ",{"$f":"$H$2","v":" AGOSTO / 2.021   "}]
[null,"SERVIÇO:  ",{"$f":"VLOOKUP(A268,ORÇAMENTO!$A$10:$I$38,3)","v":"TRANSPORTE COM CAMINHÃO BASCULANTE DE 18 M3, EM VIA URBANA PAVIMENTADA"},null,"SINAPI",{"$f":"VLOOKUP(A268,ORÇAMENTO!$A$10:$I$38,4)","v":95427},"UNIDADE: ",{"$f":"VLOOKUP(A268,ORÇAMENTO!$A$10:$I$38,5)","v":"M3XKM"}]
[]
[null,"TIPO ITEM","CODIGO ITEM","DESCRIÇÃO ITEM","UNIDADE ITEM","COEFICIENTE","PRECO UNITARIO","CUSTO TOTAL"]
[null,"COMPOSICAO","89883","CAMINHÃO BASCULANTE 18 M3, COM CAVALO MECÂNICO DE CAPACIDADE MÁXIMA DE TRAÇÃO COMBINADO DE 45000 KG, POTÊNCIA 330 CV, INCLUSIVE SEMIREBOQUE COM CAÇAMBA METÁLICA","CHP","0,0019000","258,45",{"$f":"ROUNDDOWN(F273*G273,2)","v":0.49}]
[null,"COMPOSICAO","89884","CAMINHÃO BASCULANTE 18 M3, COM CAVALO MECÂNICO DE CAPACIDADE MÁXIMA DE TRAÇÃO COMBINADO DE 45000 KG, POTÊNCIA 330 CV, INCLUSIVE SEMIREBOQUE COM CAÇAMBA METÁLICA","CHI","0,0008000","52,02",0.04]
[{"$nulls":7},0]
[null,"PRODUÇÃO DA EQUIPE",null,null,1,"CUSTO ",null,{"$f":"SUM(H273:H275)","v":0.53}]
[null,"TOTAL",{"$nulls":5},{"$f":"H276/E276","v":0.53}]
[null,"BDI                %",{"$nulls":5},{"$f":"1+$M$1","v":1.2246999999999999}]
[null,"TOTAL DO SERVIÇO - R$",{"$nulls":5},{"$f":"H277*H278","v":0.64909099999999997}]
[]
[19,"CODEVASF",null,null," COMPOSIÇÃO DE PREÇO UNITÁRIO",null,null,null,{"$f":"H293","v":36.82},{"$f":"H295","v":45.093453999999994}]
[null,"OBRA:  ",{"$f":"$C$2","v":" PASSAGEM MOLHADA DA PRAINHA - RIO MOSQUITO (ESTRADA PARA TALHADO - SERRANÓPOLIS DE MINAS/MG)"},null,null,null,"DATA: ",{"$f":"$H$2","v":" AGOSTO / 2.021   "}]
[null,"SERVIÇO:  ",{"$f":"VLOOKUP(A281,ORÇAMENTO!$A$10:$I$38,3)","v":"ATERRO MANUAL COM COMPACTAÇÃO MECANIZADA"},null,"SINAPI",{"$f":"VLOOKUP(A281,ORÇAMENTO!$A$10:$I$38,4)","v":94319},"UNIDADE: ",{"$f":"VLOOKUP(A281,ORÇAMENTO!$A$10:$I$38,5)","v":"M3"}]
[]
[null,"TIPO ITEM","CODIGO ITEM","DESCRIÇÃO ITEM","UNIDADE ITEM","COEFICIENTE","PRECO UNITARIO","CUSTO TOTAL"]
[null,"COMPOSICAO","5901","CAMINHÃO PIPA 10.000 L TRUCADO, PESO BRUTO TOTAL 23.000 KG, CARGA ÚTIL MÁXIMA 15.935 KG, DISTÂNCIA ENTRE EIXOS 4,8 M, POTÊNCIA 230 CV, INCLUSIVE TANQUE DE AÇO PARA TRANSPORTE DE ÁGUA","CHP","0,0060000","219,17",{"$f":"ROUNDDOWN(F286*G286,2)","v":1.31}]
[null,"COMPOSICAO","5903","CAMINHÃO PIPA 10.000 L TRUCADO, PESO BRUTO TOTAL 23.000 KG, CARGA ÚTIL MÁXIMA 15.935 KG, DISTÂNCIA ENTRE EIXOS 4,8 M, POTÊNCIA 230 CV, INCLUSIVE TANQUE DE AÇO PARA TRANSPORTE DE ÁGUA","CHI","0,0030000","40,54",{"$f":"ROUNDDOWN(F287*G287,2)","v":0.12}]
[null,"INSUMO","6079","ARGILA, ARGILA VERMELHA OU ARGILA ARENOSA (RETIRADA NA JAZIDA, SEM TRANSPORTE)","M3","1,2500000","9,58",11.97]
[null,"COMPOSICAO","88316","SERVENTE COM ENCARGOS COMPLEMENTARES","H","0,6590000","15,71",10.35]
[null,"COMPOSICAO","91533","COMPACTADOR DE SOLOS DE PERCUSSÃO (SOQUETE) COM MOTOR A GASOLINA 4 TEMPOS, POTÊNCIA 4 CV","CHP","0,2740000","28,17",7.71]
[null,"COMPOSICAO","91534","COMPACTADOR DE SOLOS DE PERCUSSÃO (SOQUETE) COM MOTOR A GASOLINA 4 TEMPOS, POTÊNCIA 4 CV ","CHI","0,2540000","21,12",5.36]
[null,"PRODUÇÃO DA EQUIPE",null,null,1,"CUSTO ",null,{"$f":"SUM(H286:H291)","v":36.82}]
[null,"TOTAL",{"$nulls":5},{"$f":"H292/E292","v":36.82}]
[null,"BDI                %",{"$nulls":5},{"$f":"1+$M$1","v":1.2246999999999999}]
[null,"TOTAL DO SERVIÇO - R$",{"$nulls":5},{"$f":"H293*H294","v":45.093453999999994}]

{"sheet":"BDI SERV","index":2,"n_rows":37,"n_cols":5,"rows_kept":37,"cut":false,"hidden":false,"merged":[[36,0,36,5],[3,1,4,1],[3,2,4,2],[0,1,2,4],[32,0,34,5],[28,0,28,5],[30,1,30,2],[31,1,31,2]]}
[null,"DETALHAMENTO DO BDI - SERVIÇOS"]
[]
[]
[null,"Item","Descrição dos Serviços","%","%"]
[null,null,null,"PV","CD"]
[]
[null,1,"ADMINISTRAÇÃO CENTRAL"," ",4]
[null,"1.1","ESCRITÓRIO CENTRAL"," "," "]
[null,"1.2","VIAGENS"," "," "]
[null,"1.3","OUTROS"," "," "]
[null," "," "," "," "]
[null,2,"IMPOSTOS E TAXAS",{"$f":"SUM(D13:D16)","v":6.15},{"$f":"SUM(E13:E16)","v":7.6899999999999995}]
[null,"2.1","ISS (*)",2.5,{"$f":"ROUND(D13*1.2515,2)","v":3.13}]
[null,"2.2","PIS",0.65,0.81]
[null,"2.3","Cofins",3,3.75]
[null,"2.4","CONTRIBUIÇÃO PREVIDENCIÁRIA SOBRE A RENDA BRUTA",0,0]
[]
[null,3,"TAXA DE RISCO"," ",{"$f":"SUM(E19:E22)","v":2.2799999999999998}]
[null,"3.1","SEGURO",null,0.41]
[null,"3.2","RISCO",null,1.46]
[null,"3.3","GARANTIA",null,0.41]
[]
[null,4,"DESPESAS FINANCEIRAS"," ",0.94]
[]
[null,5,"LUCRO",null,7.14]
[]
[null," ","BDI - CALCULADO"," ",{"$f":"ROUND((((1+(E7+E18)/100)*(1+E23/100)*(1+E25/100)/(1-D12/100)-1)*100),2)","v":22.47}]
[]
["BDI = ((1+((AC+S+R+G)/100))x(1+DF/100)x(1+L/100)/(1-I/100)-1)*100"]
[]
[null,"BDI (CALCULADO):",null,{"$f":"ROUND((((1+((E7+E18)/100))*(1+E23/100)*(1+E25/100))/(1-D12/100)-1)*100,2)","v":22.47},"%"]
[null," "]
["(*) ISS CONFORME LEI COMPLEMENTAR Nº 001 / 2010 - DECLARAÇÃO EM ANEXO \n\n(CONSIDERANDO AS DEDUÇÕES PREVISTAS NOS ART. 107 E 108 - QUANTIDADE ESTIMADA DE MATERIAL: 50%)"]
[]
[]
[]
["BDI EM CONFORMIDADE COM OS ACÓRDÃOS Nº 2369/2011 e ACÓRDÃO Nº 2.622/2013 - TCU - PLENÁRIO"]

{"sheet":"CRONOGRAMA","index":3,"n_rows":15,"n_cols":9,"rows_kept":15,"cut":false,"hidden":false,"merged":[[11,1,12,2],[14,1,18,8],[7,2,8,2],[9,2,10,2],[7,1,8,1],[9,1,10,1],[7,0,8,0],[9,0,10,0],[0,1,0,8],[1,6,1,8],[2,6,2,8],[3,1,3,6],[5,0,6,0],[5,2,6,2],[1,1,2,1],[5,1,6,1],[1,2,2,4]]}
[null,"CRONOGRAMA FÍSICO-FINANCEIRO"]
[null,"OBRA: ",{"$f":"ORÇAMENTO!C5","v":" PASSAGEM MOLHADA DA PRAINHA - RIO MOSQUITO (ESTRADA PARA TALHADO - SERRANÓPOLIS DE MINAS/MG)"},null,null,"VALOR:",{"$f":"ORÇAMENTO!I31","v":153483.92000000001}]
[{"$nulls":5},"PRAZO: ","90 DIAS "]
[]
[null,"ITEM","ETAPAS/DESCRIÇAO","FISICO/  FINANCEIRO","TOTAL    ETAPAS","MÊS 1","MÊS 2","MÊS 3","TOTAL"]
["A",{"$f":"VLOOKUP(A6,ORÇAMENTO!$A$9:$I$31,2)","v":1},{"$f":"VLOOKUP(A6,ORÇAMENTO!$A$9:$I$31,3)","v":"SERVIÇOS PRELIMINARES "},"FISICO ",{"$f":"ROUND(E7/$G$2,4)","v":0.19839999999999999},0.5,0.4,0.1,{"$f":"SUM(F6:H6)","v":1}]
[null,null,null,"FINANCEIRO",{"$f":"ORÇAMENTO!I9","v":30451.399999999998},{"$f":"ROUND($E$7*F6,2)","v":15225.7},12180.56,3045.14,30451.4]
["B",{"$f":"VLOOKUP(A8,ORÇAMENTO!$A$9:$I$31,2)","v":2},{"$f":"VLOOKUP(A8,ORÇAMENTO!$A$9:$I$31,3)","v":"TERRAPLANAGEM E ESTRUTURA"},"FISICO ",{"$f":"ROUND(E9/$G$2,4)","v":0.79749999999999999},0.3,0.6,0.1,0.99999999999999989]
[null,null,null,"FINANCEIRO",{"$f":"ORÇAMENTO!I15","v":122401.21000000002},{"$f":"ROUND($E$9*F8,2)","v":36720.36},73440.73,12240.12,122401.20999999999]
["c",{"$f":"VLOOKUP(A10,ORÇAMENTO!$A$9:$I$31,2)","v":3},{"$f":"VLOOKUP(A10,ORÇAMENTO!$A$9:$I$31,3)","v":"OBRAS COMPLEMENTARES"},"FISICO ",{"$f":"ROUND(E11/$G$2,4)","v":4.1000000000000003E-3},null,1,null,1]
[null,null,null,"FINANCEIRO",{"$f":"ORÇAMENTO!I29","v":631.30999999999995},{"$f":"ROUND($E$11*F10,2)","v":0},631.30999999999995,0,631.30999999999995]
[null,"TOTAL",null,"FISICO ",{"$f":"SUM(F12:H12)","v":0.99999999999999978},{"$f":"F13/E13","v":0.3384462685081277},{"$f":"G13/E13","v":0.56196505796828744},{"$f":"H13/E13","v":9.9588673523584748E-2},0.99999999999999978]
[null,null,null,"FINANCEIRO",{"$f":"E9+E7+E11","v":153483.92000000001},{"$f":"F9+F7+F11","v":51946.06},86252.599999999991,15285.26,{"$f":"SUM(F13:H13)","v":153483.91999999998}]
[]
[null,"OBSERVAÇÕES:"]